{"text_format":"1","workbook":"xlsx","n_sheets":10,"sheets":["Sheet1","Sheet3","Sheet2","2020 Data Sheet","2024 Data Sheet","Summary","Bombardier Prices","airbus 2018","statista 2021","Aircraft Pricing"],"not_rendered":{"charts":1,"images":2,"macros":0,"external_links":2,"defined_names":4,"comments":0,"pivot_tables":0},"unopened":[],"bounds":{"document_bytes":16777216,"sheet_cells":100000,"rows_first":2000,"rows_last":500,"rows_between":2000,"halvings":0,"cell_chars":16384,"cell_head_chars":4096},"cells_cut":0,"cells_raw":0,"read":"whole","date_system":"1900"}

{"sheet":"Sheet1","index":0,"n_rows":45,"n_cols":16,"rows_kept":45,"cut":false,"hidden":false,"merged":[]}
["Make Model","Type","family","Engine","Range","PAX","Text $","Price ($M)",null,"Market value","source"]
["BOEING 737-MAX 7",{"$f":"TRIM(RIGHT(A2,LEN(A2)-SEARCH(\" \",A2)))","v":"737-MAX 7"},"737",null,null,172,"$99.7M",{"$f":"VALUE(LEFT(G2,LEN(G2)-1))","v":99.7},{"$f":"INDEX(Sheet3!$A$1:$B$21,MATCH(RIGHT(A2,LEN(A2)-SEARCH(\" \",A2)),Sheet3!$A$1:$A$21,0),2)","v":{"$error":"#N/A"}},{"$f":"H2/2","v":49.85},"http://www.axonaviation.com/commercial-aircraft/aircraft-data/aircraft-pricing",{"$f":"INDEX('Aircraft Pricing'!$A:$F,MATCH(A2&\"^\"&D2&\"^\"&E2&\"^\"&F2&\"^\"&G2,'Aircraft Pricing'!$F:$F,0),5)","v":{"$error":"#N/A"}}]
["Airbus A220-100",{"$f":"RIGHT(A3,LEN(A3)-SEARCH(\" \",A3))","v":"A220-100"},"A220",null,null,null,"$81.0M",{"$f":"VALUE(LEFT(G3,LEN(G3)-1))","v":81},{"$f":"INDEX(Sheet3!$A$1:$B$21,MATCH(RIGHT(A3,LEN(A3)-SEARCH(\" \",A3)),Sheet3!$A$1:$A$21,0),2)","v":{"$error":"#N/A"}},{"$f":"H3/2","v":40.5},"https://simpleflying.com/how-much-do-airbus-aircraft-cost/",{"$f":"INDEX('Aircraft Pricing'!$A:$F,MATCH(A3&\"^\"&D3&\"^\"&E3&\"^\"&F3&\"^\"&G3,'Aircraft Pricing'!$F:$F,0),5)","v":{"$error":"#N/A"}}]
["Airbus A220-300","A220-300","A220",null,null,null,"$91.5M",91.5,{"$f":"INDEX(Sheet3!$A$1:$B$21,MATCH(RIGHT(A4,LEN(A4)-SEARCH(\" \",A4)),Sheet3!$A$1:$A$21,0),2)","v":{"$error":"#N/A"}},{"$f":"H4/2","v":45.75},"https://simpleflying.com/how-much-do-airbus-aircraft-cost/",{"$f":"INDEX('Aircraft Pricing'!$A:$F,MATCH(A4&\"^\"&D4&\"^\"&E4&\"^\"&F4&\"^\"&G4,'Aircraft Pricing'!$F:$F,0),5)","v":{"$error":"#N/A"}}]
["Airbus A318","A318","A320","GE, Pratt & Whitney","3,100 NM",107,"$75.1M",75.099999999999994,{"$f":"INDEX(Sheet3!$A$1:$B$21,MATCH(RIGHT(A5,LEN(A5)-SEARCH(\" \",A5)),Sheet3!$A$1:$A$21,0),2)","v":{"$error":"#N/A"}},{"$f":"H5/2","v":37.549999999999997},"http://www.axonaviation.com/commercial-aircraft/aircraft-data/aircraft-pricing",{"$f":"INDEX('Aircraft Pricing'!$A:$F,MATCH(A5&\"^\"&D5&\"^\"&E5&\"^\"&F5&\"^\"&G5,'Aircraft Pricing'!$F:$F,0),5)","v":"$75.1M"}]
["Airbus A319","A319","A320","GE, International Aero Engines","3,700 nm",124,"$89.6M",89.6,{"$f":"INDEX(Sheet3!$A$1:$B$21,MATCH(RIGHT(A6,LEN(A6)-SEARCH(\" \",A6)),Sheet3!$A$1:$A$21,0),2)","v":{"$error":"#N/A"}},{"$f":"H6/2","v":44.8},"http://www.axonaviation.com/commercial-aircraft/aircraft-data/aircraft-pricing",{"$f":"INDEX('Aircraft Pricing'!$A:$F,MATCH(A6&\"^\"&D6&\"^\"&E6&\"^\"&F6&\"^\"&G6,'Aircraft Pricing'!$F:$F,0),5)","v":"$89.6M"}]
["Airbus A319NEO","A319NEO","A320",null,null,null,"$101.5M",101.5,{"$f":"INDEX(Sheet3!$A$1:$B$21,MATCH(RIGHT(A7,LEN(A7)-SEARCH(\" \",A7)),Sheet3!$A$1:$A$21,0),2)","v":{"$error":"#N/A"}},50.75,"https://simpleflying.com/how-much-do-airbus-aircraft-cost/",{"$f":"INDEX('Aircraft Pricing'!$A:$F,MATCH(A7&\"^\"&D7&\"^\"&E7&\"^\"&F7&\"^\"&G7,'Aircraft Pricing'!$F:$F,0),5)","v":{"$error":"#N/A"}}]
["Airbus A320","A320","A320","GE, International Aero Engines","3,300 NM",150,"$98M",98,{"$f":"INDEX(Sheet3!$A$1:$B$21,MATCH(RIGHT(A8,LEN(A8)-SEARCH(\" \",A8)),Sheet3!$A$1:$A$21,0),2)","v":{"$error":"#N/A"}},49,"http://www.axonaviation.com/commercial-aircraft/aircraft-data/aircraft-pricing",{"$f":"INDEX('Aircraft Pricing'!$A:$F,MATCH(A8&\"^\"&D8&\"^\"&E8&\"^\"&F8&\"^\"&G8,'Aircraft Pricing'!$F:$F,0),5)","v":"$98M"}]
{"$rows_left_out":38}
{"sheet":"Sheet3","index":1,"n_rows":21,"n_cols":2,"rows_kept":21,"cut":false,"hidden":false,"merged":[]}
["737-700",89.1]
["737 MAX 7",99.7]
["737-800",106.1]
["737-900ER",112.6]
["737 MAX 8",121.6]
["737 MAX 200",124.8]
["737 MAX 9",128.9]
["737 MAX 10",134.9]
{"$rows_left_out":14}
{"sheet":"Sheet2","index":2,"n_rows":63,"n_cols":1,"rows_kept":63,"cut":false,"hidden":false,"merged":[]}
["A330/340"]
["A220"]
["A320"]
["A350"]
["A300"]
["A380"]
["ATR 42/72"]
["Do328Jet"]
{"$rows_left_out":56}
{"sheet":"2020 Data Sheet","index":3,"n_rows":485,"n_cols":19,"rows_kept":485,"cut":false,"hidden":false,"merged":[]}
[null,null,null,"MFGR",null,"aircraft_level_3","aircraft_level_4",null,null,null,null,null,"Price ($M)",null,"Source","Avionics Price","AC value factor","AV value factor","Avionics Percentage"]
[null,165,{"$f":"INDEX('[1]Pt1-AvionicsComponentCosts'!$A:$B,MATCH(B2,'[1]Pt1-AvionicsComponentCosts'!$A:$A,0),2)","v":"Fighters and Jet Trainers"},"Aermacchi",1,"M-345","Aermacchi M-345",{"$f":"TRIM(SUBSTITUTE(G2,D2,\"\"))","v":"M-345"},{"$f":"TRIM(SUBSTITUTE(SUBSTITUTE(SUBSTITUTE(SUBSTITUTE(SUBSTITUTE(H2,\"Family\",\"\"),\"737 Classic:\",\"\"),\"737 MAX:\",\"\"),\"787 Dreamliner:\",\"\"),\"777:\",\"\"))","v":"M-345"},{"$f":"MATCH(\"*\"&F2&\"*\",Sheet1!C:C,0)","v":{"$error":"#N/A"}},{"$f":"MATCH(\"*\"&H2&\"*\",Sheet1!C:C,0)","v":{"$error":"#N/A"}},{"$f":"MATCH(\"*\"&I2&\"*\",Sheet1!B:B,0)","v":{"$error":"#N/A"}},{"$f":"338/13","v":26},null,"https://www.defensenews.com/digital-show-dailies/paris-air-show/2019/06/13/italy-buys-13-jet-trainers-inks-naval-industry-deal/",{"$f":"INDEX('[1]Pt1-AvionicsComponentCosts'!$A:$NE,MATCH(B2,'[1]Pt1-AvionicsComponentCosts'!$A:$A,0),MATCH(\"END MARKER\",'[1]Pt1-AvionicsComponentCosts'!$11:$11,0))","v":1158497},1,1,{"$f":"IFERROR(P2/(M2*100000)*R2,\"\")","v":0.44557576923076925}]
[null,166,{"$f":"INDEX('[1]Pt1-AvionicsComponentCosts'!$A:$B,MATCH(B3,'[1]Pt1-AvionicsComponentCosts'!$A:$A,0),2)","v":"Fighters and Jet Trainers"},"Aermacchi",1,"M-346","Aermacchi M-346",{"$f":"TRIM(SUBSTITUTE(G3,D3,\"\"))","v":"M-346"},{"$f":"TRIM(SUBSTITUTE(SUBSTITUTE(SUBSTITUTE(SUBSTITUTE(SUBSTITUTE(H3,\"Family\",\"\"),\"737 Classic:\",\"\"),\"737 MAX:\",\"\"),\"787 Dreamliner:\",\"\"),\"777:\",\"\"))","v":"M-346"},{"$f":"MATCH(\"*\"&F3&\"*\",Sheet1!C:C,0)","v":{"$error":"#N/A"}},{"$f":"MATCH(\"*\"&H3&\"*\",Sheet1!C:C,0)","v":{"$error":"#N/A"}},{"$f":"MATCH(\"*\"&I3&\"*\",Sheet1!B:B,0)","v":{"$error":"#N/A"}},25,null,"https://www.defensenews.com/breaking-news/2017/01/26/trainer-price-wars-raytheon-wanted-millions-less-per-plane-than-leonardo/",{"$f":"INDEX('[1]Pt1-AvionicsComponentCosts'!$A:$NE,MATCH(B3,'[1]Pt1-AvionicsComponentCosts'!$A:$A,0),MATCH(\"END MARKER\",'[1]Pt1-AvionicsComponentCosts'!$11:$11,0))","v":1160538},1,1,{"$f":"IFERROR(P3/(M3*100000)*R3,\"\")","v":0.46421519999999999}]
[null,578,{"$f":"INDEX('[1]Pt1-AvionicsComponentCosts'!$A:$B,MATCH(B4,'[1]Pt1-AvionicsComponentCosts'!$A:$A,0),2)","v":"Fighters and Jet Trainers"},"Aero Vodochody",1,"Aero L-39NG","Aero Vodochody L-39NG","L-39NG","L-39NG",{"$f":"MATCH(\"*\"&F4&\"*\",Sheet1!C:C,0)","v":{"$error":"#N/A"}},{"$f":"MATCH(\"*\"&H4&\"*\",Sheet1!C:C,0)","v":{"$error":"#N/A"}},{"$f":"MATCH(\"*\"&I4&\"*\",Sheet1!B:B,0)","v":{"$error":"#N/A"}},18.5,null,"https://trends.aeroexpo.online/project-79261.html",{"$f":"INDEX('[1]Pt1-AvionicsComponentCosts'!$A:$NE,MATCH(B4,'[1]Pt1-AvionicsComponentCosts'!$A:$A,0),MATCH(\"END MARKER\",'[1]Pt1-AvionicsComponentCosts'!$11:$11,0))","v":1158497},1,1,0.62621459459459461]
[null,675,{"$f":"INDEX('[1]Pt1-AvionicsComponentCosts'!$A:$B,MATCH(B5,'[1]Pt1-AvionicsComponentCosts'!$A:$A,0),2)","v":"Fighters and Jet Trainers"},"AIDC",1,"AIDC T-5","AIDC T-5","T-5","T-5",{"$f":"MATCH(\"*\"&F5&\"*\",Sheet1!C:C,0)","v":{"$error":"#N/A"}},{"$f":"MATCH(\"*\"&H5&\"*\",Sheet1!C:C,0)","v":{"$error":"#N/A"}},{"$f":"MATCH(\"*\"&I5&\"*\",Sheet1!B:B,0)","v":{"$error":"#N/A"}},{"$f":"(2200000000/66)/1000000","v":33.333333333333329},null,"https://www.janes.com/osint-insights/defence-news/defence/aidc-completes-27-t-5a-deliveries-to-rocaf",{"$f":"INDEX('[1]Pt1-AvionicsComponentCosts'!$A:$NE,MATCH(B5,'[1]Pt1-AvionicsComponentCosts'!$A:$A,0),MATCH(\"END MARKER\",'[1]Pt1-AvionicsComponentCosts'!$11:$11,0))","v":1160538},1,1,0.34816140000000001]
[null,544,{"$f":"INDEX('[1]Pt1-AvionicsComponentCosts'!$A:$B,MATCH(B6,'[1]Pt1-AvionicsComponentCosts'!$A:$A,0),2)","v":"Turbine GA"},"Air",1,"Air Tractor","Air Tractor","Tractor","Tractor",{"$f":"MATCH(\"*\"&F6&\"*\",Sheet1!C:C,0)","v":{"$error":"#N/A"}},{"$f":"MATCH(\"*\"&H6&\"*\",Sheet1!C:C,0)","v":{"$error":"#N/A"}},{"$f":"MATCH(\"*\"&I6&\"*\",Sheet1!B:B,0)","v":{"$error":"#N/A"}},"x",null,null,{"$f":"INDEX('[1]Pt1-AvionicsComponentCosts'!$A:$NE,MATCH(B6,'[1]Pt1-AvionicsComponentCosts'!$A:$A,0),MATCH(\"END MARKER\",'[1]Pt1-AvionicsComponentCosts'!$11:$11,0))","v":211406},1,1,""]
[null,674,{"$f":"INDEX('[1]Pt1-AvionicsComponentCosts'!$A:$B,MATCH(B7,'[1]Pt1-AvionicsComponentCosts'!$A:$A,0),2)","v":"Business Jet"},"Airbus",1,"ACJ","Airbus ACJ TwoTwenty","ACJ TwoTwenty","ACJ TwoTwenty",{"$f":"MATCH(\"*\"&F7&\"*\",Sheet1!C:C,0)","v":{"$error":"#N/A"}},{"$f":"MATCH(\"*\"&H7&\"*\",Sheet1!C:C,0)","v":{"$error":"#N/A"}},{"$f":"MATCH(\"*\"&I7&\"*\",Sheet1!B:B,0)","v":{"$error":"#N/A"}},100,null,"https://bjtonline.com/business-jet-news/airbus-acj-twotwenty",{"$f":"INDEX('[1]Pt1-AvionicsComponentCosts'!$A:$NE,MATCH(B7,'[1]Pt1-AvionicsComponentCosts'!$A:$A,0),MATCH(\"END MARKER\",'[1]Pt1-AvionicsComponentCosts'!$11:$11,0))","v":1368462},0.75,0.75,0.10263464999999999]
[null,296,{"$f":"INDEX('[1]Pt1-AvionicsComponentCosts'!$A:$B,MATCH(B8,'[1]Pt1-AvionicsComponentCosts'!$A:$A,0),2)","v":"Business Jet"},"Airbus",1,"ACJ","Airbus ACJ320 Family","ACJ320 Family","ACJ320",{"$f":"MATCH(\"*\"&F8&\"*\",Sheet1!C:C,0)","v":{"$error":"#N/A"}},{"$f":"MATCH(\"*\"&H8&\"*\",Sheet1!C:C,0)","v":{"$error":"#N/A"}},{"$f":"MATCH(\"*\"&I8&\"*\",Sheet1!B:B,0)","v":{"$error":"#N/A"}},85,null,"https://www.bjtonline.com/aircraft/airbus-acj320",{"$f":"INDEX('[1]Pt1-AvionicsComponentCosts'!$A:$NE,MATCH(B8,'[1]Pt1-AvionicsComponentCosts'!$A:$A,0),MATCH(\"END MARKER\",'[1]Pt1-AvionicsComponentCosts'!$11:$11,0))","v":1164717},0.75,0.75,0.10276914705882353]
{"$rows_left_out":478}
{"sheet":"2024 Data Sheet","index":4,"n_rows":485,"n_cols":19,"rows_kept":485,"cut":false,"hidden":false,"merged":[]}
[null,null,null,"MFGR",null,"aircraft_level_3","aircraft_level_4",null,null,null,null,null,"Price ($M)",null,"Source","Avionics Price","AC value factor","AV value factor","Avionics Percentage"]
[null,165,{"$f":"INDEX('[1]Pt1-AvionicsComponentCosts'!$A:$B,MATCH(B2,'[1]Pt1-AvionicsComponentCosts'!$A:$A,0),2)","v":"Fighters and Jet Trainers"},"Aermacchi",1,"M-345","Aermacchi M-345",{"$f":"TRIM(SUBSTITUTE(G2,D2,\"\"))","v":"M-345"},{"$f":"TRIM(SUBSTITUTE(SUBSTITUTE(SUBSTITUTE(SUBSTITUTE(SUBSTITUTE(H2,\"Family\",\"\"),\"737 Classic:\",\"\"),\"737 MAX:\",\"\"),\"787 Dreamliner:\",\"\"),\"777:\",\"\"))","v":"M-345"},{"$f":"MATCH(\"*\"&F2&\"*\",Sheet1!C:C,0)","v":{"$error":"#N/A"}},{"$f":"MATCH(\"*\"&H2&\"*\",Sheet1!C:C,0)","v":{"$error":"#N/A"}},{"$f":"MATCH(\"*\"&I2&\"*\",Sheet1!B:B,0)","v":{"$error":"#N/A"}},{"$f":"338/13","v":26},null,"https://www.defensenews.com/digital-show-dailies/paris-air-show/2019/06/13/italy-buys-13-jet-trainers-inks-naval-industry-deal/",{"$f":"INDEX('[2]Pt1-AvionicsComponentCosts'!$A:$NE,MATCH(B2,'[2]Pt1-AvionicsComponentCosts'!$A:$A,0),MATCH(\"END MARKER\",'[2]Pt1-AvionicsComponentCosts'!$11:$11,0))","v":1295662.9234796404},1,1,{"$f":"IFERROR(P2/(M2*100000)*R2,\"\")","v":0.49833189364601554}]
[null,166,{"$f":"INDEX('[1]Pt1-AvionicsComponentCosts'!$A:$B,MATCH(B3,'[1]Pt1-AvionicsComponentCosts'!$A:$A,0),2)","v":"Fighters and Jet Trainers"},"Aermacchi",1,"M-346","Aermacchi M-346",{"$f":"TRIM(SUBSTITUTE(G3,D3,\"\"))","v":"M-346"},{"$f":"TRIM(SUBSTITUTE(SUBSTITUTE(SUBSTITUTE(SUBSTITUTE(SUBSTITUTE(H3,\"Family\",\"\"),\"737 Classic:\",\"\"),\"737 MAX:\",\"\"),\"787 Dreamliner:\",\"\"),\"777:\",\"\"))","v":"M-346"},{"$f":"MATCH(\"*\"&F3&\"*\",Sheet1!C:C,0)","v":{"$error":"#N/A"}},{"$f":"MATCH(\"*\"&H3&\"*\",Sheet1!C:C,0)","v":{"$error":"#N/A"}},{"$f":"MATCH(\"*\"&I3&\"*\",Sheet1!B:B,0)","v":{"$error":"#N/A"}},25,null,"https://www.defensenews.com/breaking-news/2017/01/26/trainer-price-wars-raytheon-wanted-millions-less-per-plane-than-leonardo/",{"$f":"INDEX('[2]Pt1-AvionicsComponentCosts'!$A:$NE,MATCH(B3,'[2]Pt1-AvionicsComponentCosts'!$A:$A,0),MATCH(\"END MARKER\",'[2]Pt1-AvionicsComponentCosts'!$11:$11,0))","v":1297945.5463615018},1,1,{"$f":"IFERROR(P3/(M3*100000)*R3,\"\")","v":0.51917821854460067}]
[null,578,{"$f":"INDEX('[1]Pt1-AvionicsComponentCosts'!$A:$B,MATCH(B4,'[1]Pt1-AvionicsComponentCosts'!$A:$A,0),2)","v":"Fighters and Jet Trainers"},"Aero Vodochody",1,"Aero L-39NG","Aero Vodochody L-39NG","L-39NG","L-39NG",{"$f":"MATCH(\"*\"&F4&\"*\",Sheet1!C:C,0)","v":{"$error":"#N/A"}},{"$f":"MATCH(\"*\"&H4&\"*\",Sheet1!C:C,0)","v":{"$error":"#N/A"}},{"$f":"MATCH(\"*\"&I4&\"*\",Sheet1!B:B,0)","v":{"$error":"#N/A"}},18.5,null,"https://trends.aeroexpo.online/project-79261.html",{"$f":"INDEX('[2]Pt1-AvionicsComponentCosts'!$A:$NE,MATCH(B4,'[2]Pt1-AvionicsComponentCosts'!$A:$A,0),MATCH(\"END MARKER\",'[2]Pt1-AvionicsComponentCosts'!$11:$11,0))","v":1295662.9234796404},1,1,0.70035833701602179]
[null,675,{"$f":"INDEX('[1]Pt1-AvionicsComponentCosts'!$A:$B,MATCH(B5,'[1]Pt1-AvionicsComponentCosts'!$A:$A,0),2)","v":"Fighters and Jet Trainers"},"AIDC",1,"AIDC T-5","AIDC T-5","T-5","T-5",{"$f":"MATCH(\"*\"&F5&\"*\",Sheet1!C:C,0)","v":{"$error":"#N/A"}},{"$f":"MATCH(\"*\"&H5&\"*\",Sheet1!C:C,0)","v":{"$error":"#N/A"}},{"$f":"MATCH(\"*\"&I5&\"*\",Sheet1!B:B,0)","v":{"$error":"#N/A"}},{"$f":"(2200000000/66)/1000000","v":33.333333333333329},null,"https://www.janes.com/osint-insights/defence-news/defence/aidc-completes-27-t-5a-deliveries-to-rocaf",{"$f":"INDEX('[2]Pt1-AvionicsComponentCosts'!$A:$NE,MATCH(B5,'[2]Pt1-AvionicsComponentCosts'!$A:$A,0),MATCH(\"END MARKER\",'[2]Pt1-AvionicsComponentCosts'!$11:$11,0))","v":1297945.5463615018},1,1,0.38938366390845058]
[null,544,{"$f":"INDEX('[1]Pt1-AvionicsComponentCosts'!$A:$B,MATCH(B6,'[1]Pt1-AvionicsComponentCosts'!$A:$A,0),2)","v":"Turbine GA"},"Air",1,"Air Tractor","Air Tractor","Tractor","Tractor",{"$f":"MATCH(\"*\"&F6&\"*\",Sheet1!C:C,0)","v":{"$error":"#N/A"}},{"$f":"MATCH(\"*\"&H6&\"*\",Sheet1!C:C,0)","v":{"$error":"#N/A"}},{"$f":"MATCH(\"*\"&I6&\"*\",Sheet1!B:B,0)","v":{"$error":"#N/A"}},"x",null,null,{"$f":"INDEX('[2]Pt1-AvionicsComponentCosts'!$A:$NE,MATCH(B6,'[2]Pt1-AvionicsComponentCosts'!$A:$A,0),MATCH(\"END MARKER\",'[2]Pt1-AvionicsComponentCosts'!$11:$11,0))","v":220626.48800000001},1,1,""]
[null,674,{"$f":"INDEX('[1]Pt1-AvionicsComponentCosts'!$A:$B,MATCH(B7,'[1]Pt1-AvionicsComponentCosts'!$A:$A,0),2)","v":"Business Jet"},"Airbus",1,"ACJ","Airbus ACJ TwoTwenty","ACJ TwoTwenty","ACJ TwoTwenty",{"$f":"MATCH(\"*\"&F7&\"*\",Sheet1!C:C,0)","v":{"$error":"#N/A"}},{"$f":"MATCH(\"*\"&H7&\"*\",Sheet1!C:C,0)","v":{"$error":"#N/A"}},{"$f":"MATCH(\"*\"&I7&\"*\",Sheet1!B:B,0)","v":{"$error":"#N/A"}},100,null,"https://bjtonline.com/business-jet-news/airbus-acj-twotwenty",{"$f":"INDEX('[2]Pt1-AvionicsComponentCosts'!$A:$NE,MATCH(B7,'[2]Pt1-AvionicsComponentCosts'!$A:$A,0),MATCH(\"END MARKER\",'[2]Pt1-AvionicsComponentCosts'!$11:$11,0))","v":1568058},0.75,0.75,0.11760435]
[null,296,{"$f":"INDEX('[1]Pt1-AvionicsComponentCosts'!$A:$B,MATCH(B8,'[1]Pt1-AvionicsComponentCosts'!$A:$A,0),2)","v":"Business Jet"},"Airbus",1,"ACJ","Airbus ACJ320 Family","ACJ320 Family","ACJ320",{"$f":"MATCH(\"*\"&F8&\"*\",Sheet1!C:C,0)","v":{"$error":"#N/A"}},{"$f":"MATCH(\"*\"&H8&\"*\",Sheet1!C:C,0)","v":{"$error":"#N/A"}},{"$f":"MATCH(\"*\"&I8&\"*\",Sheet1!B:B,0)","v":{"$error":"#N/A"}},85,null,"https://www.bjtonline.com/aircraft/airbus-acj320",{"$f":"INDEX('[2]Pt1-AvionicsComponentCosts'!$A:$NE,MATCH(B8,'[2]Pt1-AvionicsComponentCosts'!$A:$A,0),MATCH(\"END MARKER\",'[2]Pt1-AvionicsComponentCosts'!$11:$11,0))","v":1395799},0.75,0.75,0.12315873529411764]
{"$rows_left_out":478}
{"sheet":"Summary","index":5,"n_rows":25,"n_cols":8,"rows_kept":25,"cut":false,"hidden":false,"merged":[[13,0,13,7],[0,0,0,7]]}
["2020 Data"]
[null,"AC Value Factor","Average Avionics Cost","Average","High","High Item","Low","Low Item"]
["Fighters and Jet Trainers",{"$f":"INDEX('2020 Data Sheet'!$A:$S,MATCH($A3,'2020 Data Sheet'!C:C,0),MATCH(B$2,'2020 Data Sheet'!$1:$1,0))","v":1},{"$f":"AVERAGEIF('2020 Data Sheet'!$C:$C,Summary!$A3,'2020 Data Sheet'!$P:$P)","v":2168883.3846153845},{"$f":"AVERAGEIF('2020 Data Sheet'!C:C,A3,'2020 Data Sheet'!S:S)","v":0.47104174095634099},{"$f":"_xlfn.MAXIFS('2020 Data Sheet'!S:S,'2020 Data Sheet'!C:C,A3)","v":0.62621459459459461},{"$f":"INDEX('2020 Data Sheet'!$A:$S,MATCH(Summary!E3,'2020 Data Sheet'!$S:$S,0),6)","v":"Aero L-39NG"},{"$f":"_xlfn.MINIFS('2020 Data Sheet'!S:S,'2020 Data Sheet'!C:C,A3)","v":0.34816140000000001},{"$f":"INDEX('2020 Data Sheet'!$A:$S,MATCH(Summary!G3,'2020 Data Sheet'!$S:$S,0),6)","v":"AIDC T-5"}]
["Turbine GA",{"$f":"INDEX('2020 Data Sheet'!$A:$S,MATCH($A4,'2020 Data Sheet'!C:C,0),MATCH(B$2,'2020 Data Sheet'!$1:$1,0))","v":1},{"$f":"AVERAGEIF('2020 Data Sheet'!$C:$C,Summary!$A4,'2020 Data Sheet'!$P:$P)","v":246230.73913043478},{"$f":"AVERAGEIF('2020 Data Sheet'!C:C,A4,'2020 Data Sheet'!S:S)","v":0.46265606953278021},{"$f":"_xlfn.MAXIFS('2020 Data Sheet'!S:S,'2020 Data Sheet'!C:C,A4)","v":0.82508846153846149},{"$f":"INDEX('2020 Data Sheet'!$A:$S,MATCH(Summary!E4,'2020 Data Sheet'!$S:$S,0),6)","v":"Cessna 208 Caravan"},{"$f":"_xlfn.MINIFS('2020 Data Sheet'!S:S,'2020 Data Sheet'!C:C,A4)","v":0.24487994579945799},{"$f":"INDEX('2020 Data Sheet'!$A:$S,MATCH(Summary!G4,'2020 Data Sheet'!$S:$S,0),6)","v":"Canadair CL-415"}]
["Business Jet",{"$f":"INDEX('2020 Data Sheet'!$A:$S,MATCH($A5,'2020 Data Sheet'!C:C,0),MATCH(B$2,'2020 Data Sheet'!$1:$1,0))","v":0.75},{"$f":"AVERAGEIF('2020 Data Sheet'!$C:$C,Summary!$A5,'2020 Data Sheet'!$P:$P)","v":889565},{"$f":"AVERAGEIF('2020 Data Sheet'!C:C,A5,'2020 Data Sheet'!S:S)","v":0.17662179203461362},{"$f":"_xlfn.MAXIFS('2020 Data Sheet'!S:S,'2020 Data Sheet'!C:C,A5)","v":0.45758749999999998},{"$f":"INDEX('2020 Data Sheet'!$A:$S,MATCH(Summary!E5,'2020 Data Sheet'!$S:$S,0),6)","v":"G100"},{"$f":"_xlfn.MINIFS('2020 Data Sheet'!S:S,'2020 Data Sheet'!C:C,A5)","v":3.3114375000000001E-2},{"$f":"INDEX('2020 Data Sheet'!$A:$S,MATCH(Summary!G5,'2020 Data Sheet'!$S:$S,0),6)","v":"Wide body VIP"}]
["Freighter",{"$f":"INDEX('2020 Data Sheet'!$A:$S,MATCH($A6,'2020 Data Sheet'!C:C,0),MATCH(B$2,'2020 Data Sheet'!$1:$1,0))","v":0.5},{"$f":"AVERAGEIF('2020 Data Sheet'!$C:$C,Summary!$A6,'2020 Data Sheet'!$P:$P)","v":1534532.4074074074},{"$f":"AVERAGEIF('2020 Data Sheet'!C:C,A6,'2020 Data Sheet'!S:S)","v":8.80536382706604E-2},{"$f":"_xlfn.MAXIFS('2020 Data Sheet'!S:S,'2020 Data Sheet'!C:C,A6)","v":0.32755388888888887},{"$f":"INDEX('2020 Data Sheet'!$A:$S,MATCH(Summary!E6,'2020 Data Sheet'!$S:$S,0),6)","v":"A330"},{"$f":"_xlfn.MINIFS('2020 Data Sheet'!S:S,'2020 Data Sheet'!C:C,A6)","v":1.9999898236092266E-2},{"$f":"INDEX('2020 Data Sheet'!$A:$S,MATCH(Summary!G6,'2020 Data Sheet'!$S:$S,0),6)","v":"Boeing 777X"}]
["Helicopter",{"$f":"INDEX('2020 Data Sheet'!$A:$S,MATCH($A7,'2020 Data Sheet'!C:C,0),MATCH(B$2,'2020 Data Sheet'!$1:$1,0))","v":0.99},{"$f":"AVERAGEIF('2020 Data Sheet'!$C:$C,Summary!$A7,'2020 Data Sheet'!$P:$P)","v":932854.37096774194},{"$f":"AVERAGEIF('2020 Data Sheet'!C:C,A7,'2020 Data Sheet'!S:S)","v":0.65077699761279229},{"$f":"_xlfn.MAXIFS('2020 Data Sheet'!S:S,'2020 Data Sheet'!C:C,A7)","v":3.5193586153846153},{"$f":"INDEX('2020 Data Sheet'!$A:$S,MATCH(Summary!E7,'2020 Data Sheet'!$S:$S,0),6)","v":"Bell 505 Jet Ranger X"},{"$f":"_xlfn.MINIFS('2020 Data Sheet'!S:S,'2020 Data Sheet'!C:C,A7)","v":0.1161681048},{"$f":"INDEX('2020 Data Sheet'!$A:$S,MATCH(Summary!G7,'2020 Data Sheet'!$S:$S,0),6)","v":"Sikorsky CH-53K King Stallion"}]
["Large Commercial Aircraft",{"$f":"INDEX('2020 Data Sheet'!$A:$S,MATCH($A8,'2020 Data Sheet'!C:C,0),MATCH(B$2,'2020 Data Sheet'!$1:$1,0))","v":0.5},{"$f":"AVERAGEIF('2020 Data Sheet'!$C:$C,Summary!$A8,'2020 Data Sheet'!$P:$P)","v":1618284.0370370371},{"$f":"AVERAGEIF('2020 Data Sheet'!C:C,A8,'2020 Data Sheet'!S:S)","v":4.6254947905196561E-2},{"$f":"_xlfn.MAXIFS('2020 Data Sheet'!S:S,'2020 Data Sheet'!C:C,A8)","v":8.4472962962962958E-2},{"$f":"INDEX('2020 Data Sheet'!$A:$S,MATCH(Summary!E8,'2020 Data Sheet'!$S:$S,0),6)","v":"A220"},{"$f":"_xlfn.MINIFS('2020 Data Sheet'!S:S,'2020 Data Sheet'!C:C,A8)","v":2.5565750791497061E-2},{"$f":"INDEX('2020 Data Sheet'!$A:$S,MATCH(Summary!G8,'2020 Data Sheet'!$S:$S,0),6)","v":"Boeing 777X"}]
{"$rows_left_out":18}
{"sheet":"Bombardier Prices","index":6,"n_rows":15,"n_cols":4,"rows_kept":15,"cut":false,"hidden":false,"merged":[]}
[]
["Challenger 300",14,null,{"$f":"INDEX('2020 Data Sheet'!I:I,MATCH(\"*\"&A2&\"*\",'2020 Data Sheet'!I:I,0),1)","v":"Challenger 300/350"}]
["Challenger 350",14.9,null,{"$f":"INDEX('2020 Data Sheet'!I:I,MATCH(\"*\"&A3&\"*\",'2020 Data Sheet'!I:I,0),1)","v":"Challenger 3500"}]
["Challenger 3500",26.9,null,{"$f":"INDEX('2020 Data Sheet'!I:I,MATCH(\"*\"&A4&\"*\",'2020 Data Sheet'!I:I,0),1)","v":"Challenger 3500"}]
["Challenger 600",31.9,null,{"$f":"INDEX('2020 Data Sheet'!I:I,MATCH(\"*\"&A5&\"*\",'2020 Data Sheet'!I:I,0),1)","v":"Challenger 600 series"}]
["Challenger 6XX",31.9,null,{"$f":"INDEX('2020 Data Sheet'!I:I,MATCH(\"*\"&A6&\"*\",'2020 Data Sheet'!I:I,0),1)","v":"Challenger 6XX series"}]
["Challenger 850",39.9,null,{"$f":"INDEX('2020 Data Sheet'!I:I,MATCH(\"*\"&A7&\"*\",'2020 Data Sheet'!I:I,0),1)","v":"Challenger 850"}]
["Global 5000",46,null,{"$f":"INDEX('2020 Data Sheet'!I:I,MATCH(\"*\"&A8&\"*\",'2020 Data Sheet'!I:I,0),1)","v":"Global 5000"}]
{"$rows_left_out":8}
{"sheet":"airbus 2018","index":7,"n_rows":20,"n_cols":2,"rows_kept":20,"cut":false,"hidden":false,"merged":[]}
["AIRBUS AIRCRAFT"]
["2018 AVERAGE LIST PRICES* (USD millions)"]
["A318",77.400000000000006]
["A319",92.3]
["A320",101]
["A321",118.3]
["A319neo",101.5]
["A320neo",110.6]
{"$rows_left_out":13}
{"sheet":"statista 2021","index":8,"n_rows":42,"n_cols":2,"rows_kept":42,"cut":false,"hidden":false,"merged":[]}
["New production values for Airbus aircraft in 2021, by type"]
["A380",169.5]
["A350-1000",159.1]
["A350-900",145.80000000000001]
["A330neo-900",104]
["A330-800",92.2]
["A330-200 Freighter",84]
["A330-300",80.599999999999994]
{"$rows_left_out":35}
{"sheet":"Aircraft Pricing","index":9,"n_rows":41,"n_cols":6,"rows_kept":41,"cut":false,"hidden":false,"merged":[]}
["Aircraft model","Engine","Range","Typical Configuration","New Price"]
["BOEING 737 MAX 7",null,null,172,"$99.7M",{"$f":"A2&\"^\"&B2&\"^\"&C2&\"^\"&D2&\"^\"&E2","v":"BOEING 737 MAX 7^^^172^$99.7M"}]
["Airbus A318","GE, Pratt & Whitney","3,100 NM",107,"$75.1M",{"$f":"A3&\"^\"&B3&\"^\"&C3&\"^\"&D3&\"^\"&E3","v":"Airbus A318^GE, Pratt & Whitney^3,100 NM^107^$75.1M"}]
["Airbus A319","GE, International Aero Engines","3,700 nm",124,"$89.6M","Airbus A319^GE, International Aero Engines^3,700 nm^124^$89.6M"]
["Airbus A320","GE, International Aero Engines","3,300 NM",150,"$98M","Airbus A320^GE, International Aero Engines^3,300 NM^150^$98M"]
["Airbus A321","GE, International Aero Engines","3,200 NM",185,"$114.9M","Airbus A321^GE, International Aero Engines^3,200 NM^185^$114.9M"]
["Airbus A330-200","ROLLS-ROYCE, GE, Pratt & Whitney","7,250 NM",247,"$231.5M","Airbus A330-200^ROLLS-ROYCE, GE, Pratt & Whitney^7,250 NM^247^$231.5M"]
["Airbus A330-200F","Pratt & Whitney, ROLLS-ROYCE","4,000 NM","N/A","$234.7M","Airbus A330-200F^Pratt & Whitney, ROLLS-ROYCE^4,000 NM^N/A^$234.7M"]
{"$rows_left_out":33}