{"text_format":"1","workbook":"xlsx","n_sheets":10,"sheets":["Sheet1","Sheet3","Sheet2","2020 Data Sheet","2024 Data Sheet","Summary","Bombardier Prices","airbus 2018","statista 2021","Aircraft Pricing"],"not_rendered":{"charts":1,"images":2,"macros":0,"external_links":2,"defined_names":4,"comments":0,"pivot_tables":0},"unopened":[],"bounds":{"document_bytes":16777216,"sheet_cells":100000,"rows_first":2000,"rows_last":500,"rows_between":2000,"halvings":0,"cell_chars":16384,"cell_head_chars":4096},"cells_cut":0,"cells_raw":0,"read":"whole","date_system":"1900"}

{"sheet":"Sheet1","index":0,"n_rows":45,"n_cols":16,"rows_kept":45,"cut":false,"hidden":false,"merged":[]}
["Make Model","Type","family","Engine","Range","PAX","Text $","Price ($M)",null,"Market value","source"]
["BOEING 737-MAX 7",{"$f":"TRIM(RIGHT(A2,LEN(A2)-SEARCH(\" \",A2)))","v":"737-MAX 7"},"737",null,null,172,"$99.7M",{"$f":"VALUE(LEFT(G2,LEN(G2)-1))","v":99.7},{"$f":"INDEX(Sheet3!$A$1:$B$21,MATCH(RIGHT(A2,LEN(A2)-SEARCH(\" \",A2)),Sheet3!$A$1:$A$21,0),2)","v":{"$error":"#N/A"}},{"$f":"H2/2","v":49.85},"http://www.axonaviation.com/commercial-aircraft/aircraft-data/aircraft-pricing",{"$f":"INDEX('Aircraft Pricing'!$A:$F,MATCH(A2&\"^\"&D2&\"^\"&E2&\"^\"&F2&\"^\"&G2,'Aircraft Pricing'!$F:$F,0),5)","v":{"$error":"#N/A"}}]
["Airbus A220-100",{"$f":"RIGHT(A3,LEN(A3)-SEARCH(\" \",A3))","v":"A220-100"},"A220",null,null,null,"$81.0M",{"$f":"VALUE(LEFT(G3,LEN(G3)-1))","v":81},{"$f":"INDEX(Sheet3!$A$1:$B$21,MATCH(RIGHT(A3,LEN(A3)-SEARCH(\" \",A3)),Sheet3!$A$1:$A$21,0),2)","v":{"$error":"#N/A"}},{"$f":"H3/2","v":40.5},"https://simpleflying.com/how-much-do-airbus-aircraft-cost/",{"$f":"INDEX('Aircraft Pricing'!$A:$F,MATCH(A3&\"^\"&D3&\"^\"&E3&\"^\"&F3&\"^\"&G3,'Aircraft Pricing'!$F:$F,0),5)","v":{"$error":"#N/A"}}]
["Airbus A220-300","A220-300","A220",null,null,null,"$91.5M",91.5,{"$f":"INDEX(Sheet3!$A$1:$B$21,MATCH(RIGHT(A4,LEN(A4)-SEARCH(\" \",A4)),Sheet3!$A$1:$A$21,0),2)","v":{"$error":"#N/A"}},{"$f":"H4/2","v":45.75},"https://simpleflying.com/how-much-do-airbus-aircraft-cost/",{"$f":"INDEX('Aircraft Pricing'!$A:$F,MATCH(A4&\"^\"&D4&\"^\"&E4&\"^\"&F4&\"^\"&G4,'Aircraft Pricing'!$F:$F,0),5)","v":{"$error":"#N/A"}}]
["Airbus A318","A318","A320","GE, Pratt & Whitney","3,100 NM",107,"$75.1M",75.099999999999994,{"$f":"INDEX(Sheet3!$A$1:$B$21,MATCH(RIGHT(A5,LEN(A5)-SEARCH(\" \",A5)),Sheet3!$A$1:$A$21,0),2)","v":{"$error":"#N/A"}},{"$f":"H5/2","v":37.549999999999997},"http://www.axonaviation.com/commercial-aircraft/aircraft-data/aircraft-pricing",{"$f":"INDEX('Aircraft Pricing'!$A:$F,MATCH(A5&\"^\"&D5&\"^\"&E5&\"^\"&F5&\"^\"&G5,'Aircraft Pricing'!$F:$F,0),5)","v":"$75.1M"}]
["Airbus A319","A319","A320","GE, International Aero Engines","3,700 nm",124,"$89.6M",89.6,{"$f":"INDEX(Sheet3!$A$1:$B$21,MATCH(RIGHT(A6,LEN(A6)-SEARCH(\" \",A6)),Sheet3!$A$1:$A$21,0),2)","v":{"$error":"#N/A"}},{"$f":"H6/2","v":44.8},"http://www.axonaviation.com/commercial-aircraft/aircraft-data/aircraft-pricing",{"$f":"INDEX('Aircraft Pricing'!$A:$F,MATCH(A6&\"^\"&D6&\"^\"&E6&\"^\"&F6&\"^\"&G6,'Aircraft Pricing'!$F:$F,0),5)","v":"$89.6M"}]
["Airbus A319NEO","A319NEO","A320",null,null,null,"$101.5M",101.5,{"$f":"INDEX(Sheet3!$A$1:$B$21,MATCH(RIGHT(A7,LEN(A7)-SEARCH(\" \",A7)),Sheet3!$A$1:$A$21,0),2)","v":{"$error":"#N/A"}},50.75,"https://simpleflying.com/how-much-do-airbus-aircraft-cost/",{"$f":"INDEX('Aircraft Pricing'!$A:$F,MATCH(A7&\"^\"&D7&\"^\"&E7&\"^\"&F7&\"^\"&G7,'Aircraft Pricing'!$F:$F,0),5)","v":{"$error":"#N/A"}}]
["Airbus A320","A320","A320","GE, International Aero Engines","3,300 NM",150,"$98M",98,{"$f":"INDEX(Sheet3!$A$1:$B$21,MATCH(RIGHT(A8,LEN(A8)-SEARCH(\" \",A8)),Sheet3!$A$1:$A$21,0),2)","v":{"$error":"#N/A"}},49,"http://www.axonaviation.com/commercial-aircraft/aircraft-data/aircraft-pricing",{"$f":"INDEX('Aircraft Pricing'!$A:$F,MATCH(A8&\"^\"&D8&\"^\"&E8&\"^\"&F8&\"^\"&G8,'Aircraft Pricing'!$F:$F,0),5)","v":"$98M"}]
["Airbus A321","A321","A320","GE, International Aero Engines","3,200 NM",185,"$114.9M",114.9,{"$f":"INDEX(Sheet3!$A$1:$B$21,MATCH(RIGHT(A9,LEN(A9)-SEARCH(\" \",A9)),Sheet3!$A$1:$A$21,0),2)","v":{"$error":"#N/A"}},{"$f":"H9/2","v":57.45},"http://www.axonaviation.com/commercial-aircraft/aircraft-data/aircraft-pricing",{"$f":"INDEX('Aircraft Pricing'!$A:$F,MATCH(A9&\"^\"&D9&\"^\"&E9&\"^\"&F9&\"^\"&G9,'Aircraft Pricing'!$F:$F,0),5)","v":"$114.9M"}]
["Airbus A321NEO","A321NEO","A320",null,null,null,"$129.5M",129.5,{"$f":"INDEX(Sheet3!$A$1:$B$21,MATCH(RIGHT(A10,LEN(A10)-SEARCH(\" \",A10)),Sheet3!$A$1:$A$21,0),2)","v":{"$error":"#N/A"}},64.75,"https://simpleflying.com/how-much-do-airbus-aircraft-cost/",{"$f":"INDEX('Aircraft Pricing'!$A:$F,MATCH(A10&\"^\"&D10&\"^\"&E10&\"^\"&F10&\"^\"&G10,'Aircraft Pricing'!$F:$F,0),5)","v":{"$error":"#N/A"}}]
["Airbus A330-200","A330-200","A330/340","ROLLS-ROYCE, GE, Pratt & Whitney","7,250 NM",247,"$231.5M",231.5,{"$f":"INDEX(Sheet3!$A$1:$B$21,MATCH(RIGHT(A11,LEN(A11)-SEARCH(\" \",A11)),Sheet3!$A$1:$A$21,0),2)","v":{"$error":"#N/A"}},115.75,"http://www.axonaviation.com/commercial-aircraft/aircraft-data/aircraft-pricing",{"$f":"INDEX('Aircraft Pricing'!$A:$F,MATCH(A11&\"^\"&D11&\"^\"&E11&\"^\"&F11&\"^\"&G11,'Aircraft Pricing'!$F:$F,0),5)","v":"$231.5M"}]
["Airbus A330-200F","A330-200F","A330/340","Pratt & Whitney, ROLLS-ROYCE","4,000 NM","N/A","$234.7M",234.7,{"$f":"INDEX(Sheet3!$A$1:$B$21,MATCH(RIGHT(A12,LEN(A12)-SEARCH(\" \",A12)),Sheet3!$A$1:$A$21,0),2)","v":{"$error":"#N/A"}},117.35,"http://www.axonaviation.com/commercial-aircraft/aircraft-data/aircraft-pricing",{"$f":"INDEX('Aircraft Pricing'!$A:$F,MATCH(A12&\"^\"&D12&\"^\"&E12&\"^\"&F12&\"^\"&G12,'Aircraft Pricing'!$F:$F,0),5)","v":"$234.7M"}]
["Airbus A330-300","A330-300","A330/340","ROLLS-ROYCE, GE, Pratt & Whitney","6,350 NM",277,"$256.4M",256.39999999999998,{"$f":"INDEX(Sheet3!$A$1:$B$21,MATCH(RIGHT(A13,LEN(A13)-SEARCH(\" \",A13)),Sheet3!$A$1:$A$21,0),2)","v":{"$error":"#N/A"}},{"$f":"H13/2","v":128.19999999999999},"http://www.axonaviation.com/commercial-aircraft/aircraft-data/aircraft-pricing",{"$f":"INDEX('Aircraft Pricing'!$A:$F,MATCH(A13&\"^\"&D13&\"^\"&E13&\"^\"&F13&\"^\"&G13,'Aircraft Pricing'!$F:$F,0),5)","v":"$256.4M"}]
["Airbus A330-800NEO","A330-800NEO","A330/340",null,null,null,"$259.9M",259.89999999999998,{"$f":"INDEX(Sheet3!$A$1:$B$21,MATCH(RIGHT(A14,LEN(A14)-SEARCH(\" \",A14)),Sheet3!$A$1:$A$21,0),2)","v":{"$error":"#N/A"}},129.94999999999999,"https://simpleflying.com/how-much-do-airbus-aircraft-cost/",{"$f":"INDEX('Aircraft Pricing'!$A:$F,MATCH(A14&\"^\"&D14&\"^\"&E14&\"^\"&F14&\"^\"&G14,'Aircraft Pricing'!$F:$F,0),5)","v":{"$error":"#N/A"}}]
["Airbus A330-900NEO","A330-900NEO","A330/340",null,null,null,"$296.4M",296.39999999999998,{"$f":"INDEX(Sheet3!$A$1:$B$21,MATCH(RIGHT(A15,LEN(A15)-SEARCH(\" \",A15)),Sheet3!$A$1:$A$21,0),2)","v":{"$error":"#N/A"}},{"$f":"H15/2","v":148.19999999999999},"https://simpleflying.com/how-much-do-airbus-aircraft-cost/",{"$f":"INDEX('Aircraft Pricing'!$A:$F,MATCH(A15&\"^\"&D15&\"^\"&E15&\"^\"&F15&\"^\"&G15,'Aircraft Pricing'!$F:$F,0),5)","v":{"$error":"#N/A"}}]
["Airbus A340-300","A340-300","A330/340","CFM International","7,300 NM",277,"$219M",219,{"$f":"INDEX(Sheet3!$A$1:$B$21,MATCH(RIGHT(A16,LEN(A16)-SEARCH(\" \",A16)),Sheet3!$A$1:$A$21,0),2)","v":{"$error":"#N/A"}},109.5,"http://www.axonaviation.com/commercial-aircraft/aircraft-data/aircraft-pricing",{"$f":"INDEX('Aircraft Pricing'!$A:$F,MATCH(A16&\"^\"&D16&\"^\"&E16&\"^\"&F16&\"^\"&G16,'Aircraft Pricing'!$F:$F,0),5)","v":"$219M"}]
["Airbus A350-900","A350-900","A350","ROLLS-ROYCE","8,100 NM",325,"$308.1M",308.10000000000002,{"$f":"INDEX(Sheet3!$A$1:$B$21,MATCH(RIGHT(A17,LEN(A17)-SEARCH(\" \",A17)),Sheet3!$A$1:$A$21,0),2)","v":{"$error":"#N/A"}},154.05000000000001,"http://www.axonaviation.com/commercial-aircraft/aircraft-data/aircraft-pricing",{"$f":"INDEX('Aircraft Pricing'!$A:$F,MATCH(A17&\"^\"&D17&\"^\"&E17&\"^\"&F17&\"^\"&G17,'Aircraft Pricing'!$F:$F,0),5)","v":"$308.1M"}]
["Airbus A350-1000","A350-1000","A350","ROLLS-ROYCE","7,950 NM",366,"$355.7M",355.7,{"$f":"INDEX(Sheet3!$A$1:$B$21,MATCH(RIGHT(A18,LEN(A18)-SEARCH(\" \",A18)),Sheet3!$A$1:$A$21,0),2)","v":{"$error":"#N/A"}},177.85,"http://www.axonaviation.com/commercial-aircraft/aircraft-data/aircraft-pricing",{"$f":"INDEX('Aircraft Pricing'!$A:$F,MATCH(A18&\"^\"&D18&\"^\"&E18&\"^\"&F18&\"^\"&G18,'Aircraft Pricing'!$F:$F,0),5)","v":"$355.7M"}]
["Airbus A380","A380","A380","ROLLS-ROYCE, Engine Alliance","8,200 NM",544,"$350M",350,{"$f":"INDEX(Sheet3!$A$1:$B$21,MATCH(RIGHT(A19,LEN(A19)-SEARCH(\" \",A19)),Sheet3!$A$1:$A$21,0),2)","v":{"$error":"#N/A"}},175,"http://www.axonaviation.com/commercial-aircraft/aircraft-data/aircraft-pricing",{"$f":"INDEX('Aircraft Pricing'!$A:$F,MATCH(A19&\"^\"&D19&\"^\"&E19&\"^\"&F19&\"^\"&G19,'Aircraft Pricing'!$F:$F,0),5)","v":"$350M"}]
["Boeing 737-700","737-700","737","Pratt & Whitney, GE","3,440 NM",126,"$89.1M",89.1,{"$f":"INDEX(Sheet3!$A$1:$B$21,MATCH(RIGHT(A20,LEN(A20)-SEARCH(\" \",A20)),Sheet3!$A$1:$A$21,0),2)","v":89.1},44.55,"http://www.axonaviation.com/commercial-aircraft/aircraft-data/aircraft-pricing",{"$f":"INDEX('Aircraft Pricing'!$A:$F,MATCH(A20&\"^\"&D20&\"^\"&E20&\"^\"&F20&\"^\"&G20,'Aircraft Pricing'!$F:$F,0),5)","v":"$89.1M"}]
["Boeing 737-800","737-800","737","Pratt & Whitney, GE, ROLLS-ROYCE","3,115 NM",162,"$106.1M",106.1,{"$f":"INDEX(Sheet3!$A$1:$B$21,MATCH(RIGHT(A21,LEN(A21)-SEARCH(\" \",A21)),Sheet3!$A$1:$A$21,0),2)","v":106.1},53.05,"http://www.axonaviation.com/commercial-aircraft/aircraft-data/aircraft-pricing",{"$f":"INDEX('Aircraft Pricing'!$A:$F,MATCH(A21&\"^\"&D21&\"^\"&E21&\"^\"&F21&\"^\"&G21,'Aircraft Pricing'!$F:$F,0),5)","v":"$106.1M"}]
["Boeing 737-900ER","737-900ER","737","Pratt & Whitney, GE","3,265 NM",178,"$112.6M",112.6,{"$f":"INDEX(Sheet3!$A$1:$B$21,MATCH(RIGHT(A22,LEN(A22)-SEARCH(\" \",A22)),Sheet3!$A$1:$A$21,0),2)","v":112.6},56.3,"http://www.axonaviation.com/commercial-aircraft/aircraft-data/aircraft-pricing",{"$f":"INDEX('Aircraft Pricing'!$A:$F,MATCH(A22&\"^\"&D22&\"^\"&E22&\"^\"&F22&\"^\"&G22,'Aircraft Pricing'!$F:$F,0),5)","v":"$112.6M"},null,null,null,"https://www.iba.aero/insight/aircraft-values-lease-rates-update-february-2024/"]
["Boeing 747-400","747-400","747","Pratt & Whitney, GE, ROLLS-ROYCE","7,260 NM",410,null,null,{"$f":"INDEX(Sheet3!$A$1:$B$21,MATCH(RIGHT(A23,LEN(A23)-SEARCH(\" \",A23)),Sheet3!$A$1:$A$21,0),2)","v":{"$error":"#N/A"}},0,"http://www.axonaviation.com/commercial-aircraft/aircraft-data/aircraft-pricing",{"$f":"INDEX('Aircraft Pricing'!$A:$F,MATCH(A23&\"^\"&D23&\"^\"&E23&\"^\"&F23&\"^\"&G23,'Aircraft Pricing'!$F:$F,0),5)","v":0}]
["Boeing 747-400F","747-400F","747","Pratt & Whitney, GE, ROLLS-ROYCE","4,445 NM","N/A",null,null,{"$f":"INDEX(Sheet3!$A$1:$B$21,MATCH(RIGHT(A24,LEN(A24)-SEARCH(\" \",A24)),Sheet3!$A$1:$A$21,0),2)","v":{"$error":"#N/A"}},0,"http://www.axonaviation.com/commercial-aircraft/aircraft-data/aircraft-pricing",{"$f":"INDEX('Aircraft Pricing'!$A:$F,MATCH(A24&\"^\"&D24&\"^\"&E24&\"^\"&F24&\"^\"&G24,'Aircraft Pricing'!$F:$F,0),5)","v":0}]
["Boeing 747-8i","747-8i","747","GE","7,730 NM",410,"$418.4M",418.4,{"$f":"INDEX(Sheet3!$A$1:$B$21,MATCH(RIGHT(A25,LEN(A25)-SEARCH(\" \",A25)),Sheet3!$A$1:$A$21,0),2)","v":{"$error":"#N/A"}},209.2,"http://www.axonaviation.com/commercial-aircraft/aircraft-data/aircraft-pricing",{"$f":"INDEX('Aircraft Pricing'!$A:$F,MATCH(A25&\"^\"&D25&\"^\"&E25&\"^\"&F25&\"^\"&G25,'Aircraft Pricing'!$F:$F,0),5)","v":"$418.4M"}]
["Boeing 757-200","757-200","757","ROLLS-ROYCE, Pratt & Whitney","4,100 NM",200,"TBC",null,{"$f":"INDEX(Sheet3!$A$1:$B$21,MATCH(RIGHT(A26,LEN(A26)-SEARCH(\" \",A26)),Sheet3!$A$1:$A$21,0),2)","v":{"$error":"#N/A"}},0,"http://www.axonaviation.com/commercial-aircraft/aircraft-data/aircraft-pricing",{"$f":"INDEX('Aircraft Pricing'!$A:$F,MATCH(A26&\"^\"&D26&\"^\"&E26&\"^\"&F26&\"^\"&G26,'Aircraft Pricing'!$F:$F,0),5)","v":"TBC"}]
["Boeing 757-300","757-300","757","ROLLS-ROYCE, Pratt & Whitney","3,595 NM",243,"TBC",null,{"$f":"INDEX(Sheet3!$A$1:$B$21,MATCH(RIGHT(A27,LEN(A27)-SEARCH(\" \",A27)),Sheet3!$A$1:$A$21,0),2)","v":{"$error":"#N/A"}},0,"http://www.axonaviation.com/commercial-aircraft/aircraft-data/aircraft-pricing",{"$f":"INDEX('Aircraft Pricing'!$A:$F,MATCH(A27&\"^\"&D27&\"^\"&E27&\"^\"&F27&\"^\"&G27,'Aircraft Pricing'!$F:$F,0),5)","v":"TBC"}]
["Boeing 767-300ER","767-300ER","767","Pratt & Whitney, GE, ROLLS-ROYCE","6,310 NM",269,"$217.9M",217.9,{"$f":"INDEX(Sheet3!$A$1:$B$21,MATCH(RIGHT(A28,LEN(A28)-SEARCH(\" \",A28)),Sheet3!$A$1:$A$21,0),2)","v":217.9},108.95,"http://www.axonaviation.com/commercial-aircraft/aircraft-data/aircraft-pricing",{"$f":"INDEX('Aircraft Pricing'!$A:$F,MATCH(A28&\"^\"&D28&\"^\"&E28&\"^\"&F28&\"^\"&G28,'Aircraft Pricing'!$F:$F,0),5)","v":"$217.9M"}]
["Boeing 767-400ER","767-400ER","767","Pratt & Whitney, GE","5,625 NM",304,"TBC",null,{"$f":"INDEX(Sheet3!$A$1:$B$21,MATCH(RIGHT(A29,LEN(A29)-SEARCH(\" \",A29)),Sheet3!$A$1:$A$21,0),2)","v":{"$error":"#N/A"}},0,"http://www.axonaviation.com/commercial-aircraft/aircraft-data/aircraft-pricing",{"$f":"INDEX('Aircraft Pricing'!$A:$F,MATCH(A29&\"^\"&D29&\"^\"&E29&\"^\"&F29&\"^\"&G29,'Aircraft Pricing'!$F:$F,0),5)","v":"TBC"}]
["Boeing 777-200ER","777-200ER","777","Pratt & Whitney, GE, ROLLS-ROYCE","7,065 NM",313,"$306.6M",306.60000000000002,{"$f":"INDEX(Sheet3!$A$1:$B$21,MATCH(RIGHT(A30,LEN(A30)-SEARCH(\" \",A30)),Sheet3!$A$1:$A$21,0),2)","v":306.60000000000002},153.30000000000001,"http://www.axonaviation.com/commercial-aircraft/aircraft-data/aircraft-pricing",{"$f":"INDEX('Aircraft Pricing'!$A:$F,MATCH(A30&\"^\"&D30&\"^\"&E30&\"^\"&F30&\"^\"&G30,'Aircraft Pricing'!$F:$F,0),5)","v":"$306.6M"}]
["Boeing 777-200LR","777-200LR","777","GE","8,555 NM",317,"$346.9M",346.9,{"$f":"INDEX(Sheet3!$A$1:$B$21,MATCH(RIGHT(A31,LEN(A31)-SEARCH(\" \",A31)),Sheet3!$A$1:$A$21,0),2)","v":346.9},173.45,"http://www.axonaviation.com/commercial-aircraft/aircraft-data/aircraft-pricing",{"$f":"INDEX('Aircraft Pricing'!$A:$F,MATCH(A31&\"^\"&D31&\"^\"&E31&\"^\"&F31&\"^\"&G31,'Aircraft Pricing'!$F:$F,0),5)","v":"$346.9M"}]
["Boeing 777-300ER","777-300ER","777","GE","7,370 NM",396,"$375.5M",375.5,{"$f":"INDEX(Sheet3!$A$1:$B$21,MATCH(RIGHT(A32,LEN(A32)-SEARCH(\" \",A32)),Sheet3!$A$1:$A$21,0),2)","v":375.5},187.75,"http://www.axonaviation.com/commercial-aircraft/aircraft-data/aircraft-pricing",{"$f":"INDEX('Aircraft Pricing'!$A:$F,MATCH(A32&\"^\"&D32&\"^\"&E32&\"^\"&F32&\"^\"&G32,'Aircraft Pricing'!$F:$F,0),5)","v":"$375.5M"}]
["Boeing 777F","777F","777","GE","4,970 NM","N/A","$352.3M",352.3,{"$f":"INDEX(Sheet3!$A$1:$B$21,MATCH(RIGHT(A33,LEN(A33)-SEARCH(\" \",A33)),Sheet3!$A$1:$A$21,0),2)","v":{"$error":"#N/A"}},176.15,"http://www.axonaviation.com/commercial-aircraft/aircraft-data/aircraft-pricing",{"$f":"INDEX('Aircraft Pricing'!$A:$F,MATCH(A33&\"^\"&D33&\"^\"&E33&\"^\"&F33&\"^\"&G33,'Aircraft Pricing'!$F:$F,0),5)","v":"$352.3M"}]
["Boeing 787-8","787-8","787","GE, ROLLS-ROYCE","7,355 NM",242,"$248.3M",248.3,{"$f":"INDEX(Sheet3!$A$1:$B$21,MATCH(RIGHT(A34,LEN(A34)-SEARCH(\" \",A34)),Sheet3!$A$1:$A$21,0),2)","v":248.3},124.15,"http://www.axonaviation.com/commercial-aircraft/aircraft-data/aircraft-pricing",{"$f":"INDEX('Aircraft Pricing'!$A:$F,MATCH(A34&\"^\"&D34&\"^\"&E34&\"^\"&F34&\"^\"&G34,'Aircraft Pricing'!$F:$F,0),5)","v":"$248.3M"}]
["Boeing 787-9","787-9","787","GE, ROLLS-ROYCE","7,635 NM",290,"$292.5M",292.5,{"$f":"INDEX(Sheet3!$A$1:$B$21,MATCH(RIGHT(A35,LEN(A35)-SEARCH(\" \",A35)),Sheet3!$A$1:$A$21,0),2)","v":292.5},146.25,"http://www.axonaviation.com/commercial-aircraft/aircraft-data/aircraft-pricing",{"$f":"INDEX('Aircraft Pricing'!$A:$F,MATCH(A35&\"^\"&D35&\"^\"&E35&\"^\"&F35&\"^\"&G35,'Aircraft Pricing'!$F:$F,0),5)","v":"$292.5M"}]
["Boeing 787-10","787-10","787","GE , ROLLS-ROYCE","6,430 NM",330,338.4,{"$f":"VALUE(G36)","v":338.4},{"$f":"INDEX(Sheet3!$A$1:$B$21,MATCH(RIGHT(A36,LEN(A36)-SEARCH(\" \",A36)),Sheet3!$A$1:$A$21,0),2)","v":338.4},169.2,"http://www.axonaviation.com/commercial-aircraft/aircraft-data/aircraft-pricing",{"$f":"INDEX('Aircraft Pricing'!$A:$F,MATCH(A36&\"^\"&D36&\"^\"&E36&\"^\"&F36&\"^\"&G36,'Aircraft Pricing'!$F:$F,0),5)","v":338.4}]
["Bombardier CRJ100ER/LR","CRJ100ER/LR","CRJ","GE","1,620 NM / 2,003 NM",50,"TBC",null,{"$f":"INDEX(Sheet3!$A$1:$B$21,MATCH(RIGHT(A37,LEN(A37)-SEARCH(\" \",A37)),Sheet3!$A$1:$A$21,0),2)","v":{"$error":"#N/A"}},0,"http://www.axonaviation.com/commercial-aircraft/aircraft-data/aircraft-pricing",{"$f":"INDEX('Aircraft Pricing'!$A:$F,MATCH(A37&\"^\"&D37&\"^\"&E37&\"^\"&F37&\"^\"&G37,'Aircraft Pricing'!$F:$F,0),5)","v":"TBC"}]
["Bombardier CRJ200ER/LR","CRJ200ER/LR","CRJ","GE","1,644 NM / 2,004 NM",50,"TBC",null,{"$f":"INDEX(Sheet3!$A$1:$B$21,MATCH(RIGHT(A38,LEN(A38)-SEARCH(\" \",A38)),Sheet3!$A$1:$A$21,0),2)","v":{"$error":"#N/A"}},0,"http://www.axonaviation.com/commercial-aircraft/aircraft-data/aircraft-pricing",{"$f":"INDEX('Aircraft Pricing'!$A:$F,MATCH(A38&\"^\"&D38&\"^\"&E38&\"^\"&F38&\"^\"&G38,'Aircraft Pricing'!$F:$F,0),5)","v":"TBC"}]
["Bombardier CRJ700ER","CRJ700ER","CRJ","GE","1,378 NM",66,"TBC",null,{"$f":"INDEX(Sheet3!$A$1:$B$21,MATCH(RIGHT(A39,LEN(A39)-SEARCH(\" \",A39)),Sheet3!$A$1:$A$21,0),2)","v":{"$error":"#N/A"}},0,"http://www.axonaviation.com/commercial-aircraft/aircraft-data/aircraft-pricing",{"$f":"INDEX('Aircraft Pricing'!$A:$F,MATCH(A39&\"^\"&D39&\"^\"&E39&\"^\"&F39&\"^\"&G39,'Aircraft Pricing'!$F:$F,0),5)","v":"TBC"}]
["Bombardier CRJ900ER/LR","CRJ900ER/LR","CRJ","GE","1,317 NM / 1,553 NM",79,"TBC",null,{"$f":"INDEX(Sheet3!$A$1:$B$21,MATCH(RIGHT(A40,LEN(A40)-SEARCH(\" \",A40)),Sheet3!$A$1:$A$21,0),2)","v":{"$error":"#N/A"}},0,"http://www.axonaviation.com/commercial-aircraft/aircraft-data/aircraft-pricing",{"$f":"INDEX('Aircraft Pricing'!$A:$F,MATCH(A40&\"^\"&D40&\"^\"&E40&\"^\"&F40&\"^\"&G40,'Aircraft Pricing'!$F:$F,0),5)","v":"TBC"}]
["Bombardier CRJ1000ER","CRJ1000ER","CRJ","GE","1,622 NM",50,"TBC",null,{"$f":"INDEX(Sheet3!$A$1:$B$21,MATCH(RIGHT(A41,LEN(A41)-SEARCH(\" \",A41)),Sheet3!$A$1:$A$21,0),2)","v":{"$error":"#N/A"}},0,"http://www.axonaviation.com/commercial-aircraft/aircraft-data/aircraft-pricing",{"$f":"INDEX('Aircraft Pricing'!$A:$F,MATCH(A41&\"^\"&D41&\"^\"&E41&\"^\"&F41&\"^\"&G41,'Aircraft Pricing'!$F:$F,0),5)","v":"TBC"}]
["Embraer 170LR","170LR","ERJ170/175/190/195","GE","2,100 NM",70,"$26.5M",26.5,{"$f":"INDEX(Sheet3!$A$1:$B$21,MATCH(RIGHT(A42,LEN(A42)-SEARCH(\" \",A42)),Sheet3!$A$1:$A$21,0),2)","v":{"$error":"#N/A"}},13.25,"http://www.axonaviation.com/commercial-aircraft/aircraft-data/aircraft-pricing",{"$f":"INDEX('Aircraft Pricing'!$A:$F,MATCH(A42&\"^\"&D42&\"^\"&E42&\"^\"&F42&\"^\"&G42,'Aircraft Pricing'!$F:$F,0),5)","v":"$26.5M"}]
["Embraer 175","175","ERJ170/175/190/195","GE","2,150 NM",78,"$28M",28,{"$f":"INDEX(Sheet3!$A$1:$B$21,MATCH(RIGHT(A43,LEN(A43)-SEARCH(\" \",A43)),Sheet3!$A$1:$A$21,0),2)","v":{"$error":"#N/A"}},14,"http://www.axonaviation.com/commercial-aircraft/aircraft-data/aircraft-pricing",{"$f":"INDEX('Aircraft Pricing'!$A:$F,MATCH(A43&\"^\"&D43&\"^\"&E43&\"^\"&F43&\"^\"&G43,'Aircraft Pricing'!$F:$F,0),5)","v":"$28M"}]
["Embraer 190","190","ERJ170/175/190/195","GE","2,400 NM",94,"$32M",32,{"$f":"INDEX(Sheet3!$A$1:$B$21,MATCH(RIGHT(A44,LEN(A44)-SEARCH(\" \",A44)),Sheet3!$A$1:$A$21,0),2)","v":{"$error":"#N/A"}},16,"http://www.axonaviation.com/commercial-aircraft/aircraft-data/aircraft-pricing",{"$f":"INDEX('Aircraft Pricing'!$A:$F,MATCH(A44&\"^\"&D44&\"^\"&E44&\"^\"&F44&\"^\"&G44,'Aircraft Pricing'!$F:$F,0),5)","v":"$32M"}]
["Embraer 195","195","ERJ170/175/190/195","GE","2,000 NM",106,"$40M",40,{"$f":"INDEX(Sheet3!$A$1:$B$21,MATCH(RIGHT(A45,LEN(A45)-SEARCH(\" \",A45)),Sheet3!$A$1:$A$21,0),2)","v":{"$error":"#N/A"}},20,"http://www.axonaviation.com/commercial-aircraft/aircraft-data/aircraft-pricing",{"$f":"INDEX('Aircraft Pricing'!$A:$F,MATCH(A45&\"^\"&D45&\"^\"&E45&\"^\"&F45&\"^\"&G45,'Aircraft Pricing'!$F:$F,0),5)","v":"$40M"}]

{"sheet":"Sheet3","index":1,"n_rows":21,"n_cols":2,"rows_kept":21,"cut":false,"hidden":false,"merged":[]}
["737-700",89.1]
["737 MAX 7",99.7]
["737-800",106.1]
["737-900ER",112.6]
["737 MAX 8",121.6]
["737 MAX 200",124.8]
["737 MAX 9",128.9]
["737 MAX 10",134.9]
["767-300ER",217.9]
["767-300 Freighter",220.3]
["787-8",248.3]
["787-9",292.5]
["777-200ER",306.60000000000002]
["787-10",338.4]
["777-200LR",346.9]
["777 Freighter",352.3]
["777-300ER",375.5]
["777-8",410.2]
["747-8",418.4]
["747-8 Freighter",419.2]
["777-9",442.2]

{"sheet":"Sheet2","index":2,"n_rows":63,"n_cols":1,"rows_kept":63,"cut":false,"hidden":false,"merged":[]}
["A330/340"]
["A220"]
["A320"]
["A350"]
["A300"]
["A380"]
["ATR 42/72"]
["Do328Jet"]
["Beech 1900"]
["737"]
["777"]
["727"]
["787"]
["767"]
["747"]
["757"]
["717"]
["707/720"]
["DHC-8"]
["CRJ"]
["A220"]
["Jetstream 41"]
["BAe146"]
["Jetstream 31"]
["HS748"]
["ATP"]
["CRJ"]
["ARJ21"]
["C919"]
["DHC-8"]
["DHC-6"]
["DHC-8"]
["DHC-7"]
["Do228"]
["Do328"]
["Do328Jet"]
["DC9/MD80"]
["EMB120"]
["EMB135/140/145"]
["ERJ170/175/190/195"]
["EMB110"]
["Metro"]
["Do328Jet"]
["F27/50"]
["F28/70/100"]
["HS748"]
["Do228"]
["N219"]
["L1011"]
["DC9/MD80"]
["DC8"]
["DC10/MD11"]
["Beech 1900"]
["Do328Jet"]
["Do228"]
["SAAB 340"]
["SAAB 2000"]
["Shorts"]
["Metro"]
["Cessna 408"]
["DHC-6"]
["MA700"]
["ERJ170/175/190/195"]

{"sheet":"2020 Data Sheet","index":3,"n_rows":485,"n_cols":19,"rows_kept":485,"cut":false,"hidden":false,"merged":[]}
[null,null,null,"MFGR",null,"aircraft_level_3","aircraft_level_4",null,null,null,null,null,"Price ($M)",null,"Source","Avionics Price","AC value factor","AV value factor","Avionics Percentage"]
[null,165,{"$f":"INDEX('[1]Pt1-AvionicsComponentCosts'!$A:$B,MATCH(B2,'[1]Pt1-AvionicsComponentCosts'!$A:$A,0),2)","v":"Fighters and Jet Trainers"},"Aermacchi",1,"M-345","Aermacchi M-345",{"$f":"TRIM(SUBSTITUTE(G2,D2,\"\"))","v":"M-345"},{"$f":"TRIM(SUBSTITUTE(SUBSTITUTE(SUBSTITUTE(SUBSTITUTE(SUBSTITUTE(H2,\"Family\",\"\"),\"737 Classic:\",\"\"),\"737 MAX:\",\"\"),\"787 Dreamliner:\",\"\"),\"777:\",\"\"))","v":"M-345"},{"$f":"MATCH(\"*\"&F2&\"*\",Sheet1!C:C,0)","v":{"$error":"#N/A"}},{"$f":"MATCH(\"*\"&H2&\"*\",Sheet1!C:C,0)","v":{"$error":"#N/A"}},{"$f":"MATCH(\"*\"&I2&\"*\",Sheet1!B:B,0)","v":{"$error":"#N/A"}},{"$f":"338/13","v":26},null,"https://www.defensenews.com/digital-show-dailies/paris-air-show/2019/06/13/italy-buys-13-jet-trainers-inks-naval-industry-deal/",{"$f":"INDEX('[1]Pt1-AvionicsComponentCosts'!$A:$NE,MATCH(B2,'[1]Pt1-AvionicsComponentCosts'!$A:$A,0),MATCH(\"END MARKER\",'[1]Pt1-AvionicsComponentCosts'!$11:$11,0))","v":1158497},1,1,{"$f":"IFERROR(P2/(M2*100000)*R2,\"\")","v":0.44557576923076925}]
[null,166,{"$f":"INDEX('[1]Pt1-AvionicsComponentCosts'!$A:$B,MATCH(B3,'[1]Pt1-AvionicsComponentCosts'!$A:$A,0),2)","v":"Fighters and Jet Trainers"},"Aermacchi",1,"M-346","Aermacchi M-346",{"$f":"TRIM(SUBSTITUTE(G3,D3,\"\"))","v":"M-346"},{"$f":"TRIM(SUBSTITUTE(SUBSTITUTE(SUBSTITUTE(SUBSTITUTE(SUBSTITUTE(H3,\"Family\",\"\"),\"737 Classic:\",\"\"),\"737 MAX:\",\"\"),\"787 Dreamliner:\",\"\"),\"777:\",\"\"))","v":"M-346"},{"$f":"MATCH(\"*\"&F3&\"*\",Sheet1!C:C,0)","v":{"$error":"#N/A"}},{"$f":"MATCH(\"*\"&H3&\"*\",Sheet1!C:C,0)","v":{"$error":"#N/A"}},{"$f":"MATCH(\"*\"&I3&\"*\",Sheet1!B:B,0)","v":{"$error":"#N/A"}},25,null,"https://www.defensenews.com/breaking-news/2017/01/26/trainer-price-wars-raytheon-wanted-millions-less-per-plane-than-leonardo/",{"$f":"INDEX('[1]Pt1-AvionicsComponentCosts'!$A:$NE,MATCH(B3,'[1]Pt1-AvionicsComponentCosts'!$A:$A,0),MATCH(\"END MARKER\",'[1]Pt1-AvionicsComponentCosts'!$11:$11,0))","v":1160538},1,1,{"$f":"IFERROR(P3/(M3*100000)*R3,\"\")","v":0.46421519999999999}]
[null,578,{"$f":"INDEX('[1]Pt1-AvionicsComponentCosts'!$A:$B,MATCH(B4,'[1]Pt1-AvionicsComponentCosts'!$A:$A,0),2)","v":"Fighters and Jet Trainers"},"Aero Vodochody",1,"Aero L-39NG","Aero Vodochody L-39NG","L-39NG","L-39NG",{"$f":"MATCH(\"*\"&F4&\"*\",Sheet1!C:C,0)","v":{"$error":"#N/A"}},{"$f":"MATCH(\"*\"&H4&\"*\",Sheet1!C:C,0)","v":{"$error":"#N/A"}},{"$f":"MATCH(\"*\"&I4&\"*\",Sheet1!B:B,0)","v":{"$error":"#N/A"}},18.5,null,"https://trends.aeroexpo.online/project-79261.html",{"$f":"INDEX('[1]Pt1-AvionicsComponentCosts'!$A:$NE,MATCH(B4,'[1]Pt1-AvionicsComponentCosts'!$A:$A,0),MATCH(\"END MARKER\",'[1]Pt1-AvionicsComponentCosts'!$11:$11,0))","v":1158497},1,1,0.62621459459459461]
[null,675,{"$f":"INDEX('[1]Pt1-AvionicsComponentCosts'!$A:$B,MATCH(B5,'[1]Pt1-AvionicsComponentCosts'!$A:$A,0),2)","v":"Fighters and Jet Trainers"},"AIDC",1,"AIDC T-5","AIDC T-5","T-5","T-5",{"$f":"MATCH(\"*\"&F5&\"*\",Sheet1!C:C,0)","v":{"$error":"#N/A"}},{"$f":"MATCH(\"*\"&H5&\"*\",Sheet1!C:C,0)","v":{"$error":"#N/A"}},{"$f":"MATCH(\"*\"&I5&\"*\",Sheet1!B:B,0)","v":{"$error":"#N/A"}},{"$f":"(2200000000/66)/1000000","v":33.333333333333329},null,"https://www.janes.com/osint-insights/defence-news/defence/aidc-completes-27-t-5a-deliveries-to-rocaf",{"$f":"INDEX('[1]Pt1-AvionicsComponentCosts'!$A:$NE,MATCH(B5,'[1]Pt1-AvionicsComponentCosts'!$A:$A,0),MATCH(\"END MARKER\",'[1]Pt1-AvionicsComponentCosts'!$11:$11,0))","v":1160538},1,1,0.34816140000000001]
[null,544,{"$f":"INDEX('[1]Pt1-AvionicsComponentCosts'!$A:$B,MATCH(B6,'[1]Pt1-AvionicsComponentCosts'!$A:$A,0),2)","v":"Turbine GA"},"Air",1,"Air Tractor","Air Tractor","Tractor","Tractor",{"$f":"MATCH(\"*\"&F6&\"*\",Sheet1!C:C,0)","v":{"$error":"#N/A"}},{"$f":"MATCH(\"*\"&H6&\"*\",Sheet1!C:C,0)","v":{"$error":"#N/A"}},{"$f":"MATCH(\"*\"&I6&\"*\",Sheet1!B:B,0)","v":{"$error":"#N/A"}},"x",null,null,{"$f":"INDEX('[1]Pt1-AvionicsComponentCosts'!$A:$NE,MATCH(B6,'[1]Pt1-AvionicsComponentCosts'!$A:$A,0),MATCH(\"END MARKER\",'[1]Pt1-AvionicsComponentCosts'!$11:$11,0))","v":211406},1,1,""]
[null,674,{"$f":"INDEX('[1]Pt1-AvionicsComponentCosts'!$A:$B,MATCH(B7,'[1]Pt1-AvionicsComponentCosts'!$A:$A,0),2)","v":"Business Jet"},"Airbus",1,"ACJ","Airbus ACJ TwoTwenty","ACJ TwoTwenty","ACJ TwoTwenty",{"$f":"MATCH(\"*\"&F7&\"*\",Sheet1!C:C,0)","v":{"$error":"#N/A"}},{"$f":"MATCH(\"*\"&H7&\"*\",Sheet1!C:C,0)","v":{"$error":"#N/A"}},{"$f":"MATCH(\"*\"&I7&\"*\",Sheet1!B:B,0)","v":{"$error":"#N/A"}},100,null,"https://bjtonline.com/business-jet-news/airbus-acj-twotwenty",{"$f":"INDEX('[1]Pt1-AvionicsComponentCosts'!$A:$NE,MATCH(B7,'[1]Pt1-AvionicsComponentCosts'!$A:$A,0),MATCH(\"END MARKER\",'[1]Pt1-AvionicsComponentCosts'!$11:$11,0))","v":1368462},0.75,0.75,0.10263464999999999]
[null,296,{"$f":"INDEX('[1]Pt1-AvionicsComponentCosts'!$A:$B,MATCH(B8,'[1]Pt1-AvionicsComponentCosts'!$A:$A,0),2)","v":"Business Jet"},"Airbus",1,"ACJ","Airbus ACJ320 Family","ACJ320 Family","ACJ320",{"$f":"MATCH(\"*\"&F8&\"*\",Sheet1!C:C,0)","v":{"$error":"#N/A"}},{"$f":"MATCH(\"*\"&H8&\"*\",Sheet1!C:C,0)","v":{"$error":"#N/A"}},{"$f":"MATCH(\"*\"&I8&\"*\",Sheet1!B:B,0)","v":{"$error":"#N/A"}},85,null,"https://www.bjtonline.com/aircraft/airbus-acj320",{"$f":"INDEX('[1]Pt1-AvionicsComponentCosts'!$A:$NE,MATCH(B8,'[1]Pt1-AvionicsComponentCosts'!$A:$A,0),MATCH(\"END MARKER\",'[1]Pt1-AvionicsComponentCosts'!$11:$11,0))","v":1164717},0.75,0.75,0.10276914705882353]
[null,528,{"$f":"INDEX('[1]Pt1-AvionicsComponentCosts'!$A:$B,MATCH(B9,'[1]Pt1-AvionicsComponentCosts'!$A:$A,0),2)","v":"Business Jet"},"Airbus",1,"ACJ","Airbus ACJ320neo Family","ACJ320neo Family","ACJ320neo",{"$f":"MATCH(\"*\"&F9&\"*\",Sheet1!C:C,0)","v":{"$error":"#N/A"}},{"$f":"MATCH(\"*\"&H9&\"*\",Sheet1!C:C,0)","v":{"$error":"#N/A"}},{"$f":"MATCH(\"*\"&I9&\"*\",Sheet1!B:B,0)","v":{"$error":"#N/A"}},110,null,"https://finance.yahoo.com/news/5-priciest-private-jets-2023-185110930.html",{"$f":"INDEX('[1]Pt1-AvionicsComponentCosts'!$A:$NE,MATCH(B9,'[1]Pt1-AvionicsComponentCosts'!$A:$A,0),MATCH(\"END MARKER\",'[1]Pt1-AvionicsComponentCosts'!$11:$11,0))","v":1164717},0.75,0.75,7.9412522727272727E-2]
[null,678,{"$f":"INDEX('[1]Pt1-AvionicsComponentCosts'!$A:$B,MATCH(B10,'[1]Pt1-AvionicsComponentCosts'!$A:$A,0),2)","v":"Business Jet"},"Airbus",1,"Wide body VIP","Airbus ACJ330-200","ACJ330-200","ACJ330-200",{"$f":"MATCH(\"*\"&F10&\"*\",Sheet1!C:C,0)","v":{"$error":"#N/A"}},{"$f":"MATCH(\"*\"&H10&\"*\",Sheet1!C:C,0)","v":{"$error":"#N/A"}},{"$f":"MATCH(\"*\"&I10&\"*\",Sheet1!B:B,0)","v":{"$error":"#N/A"}},390,null,"https://www.businessairnews.com/hb_aircraftpage.html?recnum=ACJ330",{"$f":"INDEX('[1]Pt1-AvionicsComponentCosts'!$A:$NE,MATCH(B10,'[1]Pt1-AvionicsComponentCosts'!$A:$A,0),MATCH(\"END MARKER\",'[1]Pt1-AvionicsComponentCosts'!$11:$11,0))","v":1757582},0.75,0.75,3.379965384615384E-2]
[null,565,{"$f":"INDEX('[1]Pt1-AvionicsComponentCosts'!$A:$B,MATCH(B11,'[1]Pt1-AvionicsComponentCosts'!$A:$A,0),2)","v":"Freighter"},"Airbus",1,"A330","Airbus A330-743L Beluga XL","A330-743L Beluga XL","A330-743L Beluga XL",{"$f":"MATCH(\"*\"&F11&\"*\",Sheet1!C:C,0)","v":11},{"$f":"MATCH(\"*\"&H11&\"*\",Sheet1!C:C,0)","v":{"$error":"#N/A"}},{"$f":"MATCH(\"*\"&I11&\"*\",Sheet1!B:B,0)","v":{"$error":"#N/A"}},"x",null,null,{"$f":"INDEX('[1]Pt1-AvionicsComponentCosts'!$A:$NE,MATCH(B11,'[1]Pt1-AvionicsComponentCosts'!$A:$A,0),MATCH(\"END MARKER\",'[1]Pt1-AvionicsComponentCosts'!$11:$11,0))","v":1768791},0.5,0.5,""]
[null,644,{"$f":"INDEX('[1]Pt1-AvionicsComponentCosts'!$A:$B,MATCH(B12,'[1]Pt1-AvionicsComponentCosts'!$A:$A,0),2)","v":"Freighter"},"Airbus",1,"A350","Airbus A350F","A350F","A350F",{"$f":"MATCH(\"*\"&F12&\"*\",Sheet1!C:C,0)","v":17},{"$f":"MATCH(\"*\"&H12&\"*\",Sheet1!C:C,0)","v":{"$error":"#N/A"}},{"$f":"MATCH(\"*\"&I12&\"*\",Sheet1!B:B,0)","v":{"$error":"#N/A"}},172,null,"https://aircargoeye.com/airline/aircraft/airbus/a350f/",{"$f":"INDEX('[1]Pt1-AvionicsComponentCosts'!$A:$NE,MATCH(B12,'[1]Pt1-AvionicsComponentCosts'!$A:$A,0),MATCH(\"END MARKER\",'[1]Pt1-AvionicsComponentCosts'!$11:$11,0))","v":1768791},0.5,0.5,5.1418343023255812E-2]
[null,632,{"$f":"INDEX('[1]Pt1-AvionicsComponentCosts'!$A:$B,MATCH(B13,'[1]Pt1-AvionicsComponentCosts'!$A:$A,0),2)","v":"Freighter"},"Airbus",1,"A300","A300-600F/RF","A300-600F/RF","A300-600F/RF",{"$f":"MATCH(\"*\"&F13&\"*\",Sheet1!C:C,0)","v":{"$error":"#N/A"}},{"$f":"MATCH(\"*\"&H13&\"*\",Sheet1!C:C,0)","v":{"$error":"#N/A"}},{"$f":"MATCH(\"*\"&I13&\"*\",Sheet1!B:B,0)","v":{"$error":"#N/A"}},null,"OOP",null,{"$f":"INDEX('[1]Pt1-AvionicsComponentCosts'!$A:$NE,MATCH(B13,'[1]Pt1-AvionicsComponentCosts'!$A:$A,0),MATCH(\"END MARKER\",'[1]Pt1-AvionicsComponentCosts'!$11:$11,0))","v":1735731},0.5,0.5,{"$f":"IFERROR(P13/(M13*100000)*R13,\"\")","v":""}]
[null,566,{"$f":"INDEX('[1]Pt1-AvionicsComponentCosts'!$A:$B,MATCH(B14,'[1]Pt1-AvionicsComponentCosts'!$A:$A,0),2)","v":"Freighter"},"Airbus",1,"A300","Airbus A300-600ST Beluga","A300-600ST Beluga","A300-600ST Beluga",{"$f":"MATCH(\"*\"&F14&\"*\",Sheet1!C:C,0)","v":{"$error":"#N/A"}},{"$f":"MATCH(\"*\"&H14&\"*\",Sheet1!C:C,0)","v":{"$error":"#N/A"}},{"$f":"MATCH(\"*\"&I14&\"*\",Sheet1!B:B,0)","v":{"$error":"#N/A"}},"x",null,null,{"$f":"INDEX('[1]Pt1-AvionicsComponentCosts'!$A:$NE,MATCH(B14,'[1]Pt1-AvionicsComponentCosts'!$A:$A,0),MATCH(\"END MARKER\",'[1]Pt1-AvionicsComponentCosts'!$11:$11,0))","v":1575117},0.5,0.5,""]
[null,560,{"$f":"INDEX('[1]Pt1-AvionicsComponentCosts'!$A:$B,MATCH(B15,'[1]Pt1-AvionicsComponentCosts'!$A:$A,0),2)","v":"Freighter"},"Airbus",1,"A330","Airbus A330-200F","A330-200F","A330-200F",{"$f":"MATCH(\"*\"&F15&\"*\",Sheet1!C:C,0)","v":11},{"$f":"MATCH(\"*\"&H15&\"*\",Sheet1!C:C,0)","v":{"$error":"#N/A"}},{"$f":"MATCH(\"*\"&I15&\"*\",Sheet1!B:B,0)","v":12},{"$f":"INDEX(Sheet1!$A:$K,MATCH($I15,Sheet1!$B:$B,0),MATCH(M$1,Sheet1!$A$1:$K$1,0))","v":234.7},null,{"$f":"INDEX(Sheet1!$A:$K,MATCH($I15,Sheet1!$B:$B,0),MATCH(O$1,Sheet1!$A$1:$K$1,0))","v":"http://www.axonaviation.com/commercial-aircraft/aircraft-data/aircraft-pricing"},{"$f":"INDEX('[1]Pt1-AvionicsComponentCosts'!$A:$NE,MATCH(B15,'[1]Pt1-AvionicsComponentCosts'!$A:$A,0),MATCH(\"END MARKER\",'[1]Pt1-AvionicsComponentCosts'!$11:$11,0))","v":1768788},0.5,0.5,3.7681891776736261E-2]
[null,562,{"$f":"INDEX('[1]Pt1-AvionicsComponentCosts'!$A:$B,MATCH(B16,'[1]Pt1-AvionicsComponentCosts'!$A:$A,0),2)","v":"Freighter"},"Airbus",1,"A330","Airbus A330-300P2F","A330-300P2F","A330-300P2F",{"$f":"MATCH(\"*\"&F16&\"*\",Sheet1!C:C,0)","v":11},{"$f":"MATCH(\"*\"&H16&\"*\",Sheet1!C:C,0)","v":{"$error":"#N/A"}},{"$f":"MATCH(\"*\"&I16&\"*\",Sheet1!B:B,0)","v":{"$error":"#N/A"}},27,"used","https://www.iba.aero/news/sustained-demand-for-passenger-to-freighter-aircraft-conversions-says-iba/",{"$f":"INDEX('[1]Pt1-AvionicsComponentCosts'!$A:$NE,MATCH(B16,'[1]Pt1-AvionicsComponentCosts'!$A:$A,0),MATCH(\"END MARKER\",'[1]Pt1-AvionicsComponentCosts'!$11:$11,0))","v":1768791},0.5,0.5,0.32755388888888887]
[null,669,{"$f":"INDEX('[1]Pt1-AvionicsComponentCosts'!$A:$B,MATCH(B17,'[1]Pt1-AvionicsComponentCosts'!$A:$A,0),2)","v":"Freighter"},"Airbus",1,"A340","Airbus A340-600NGF","A340-600NGF","A340-600NGF",{"$f":"MATCH(\"*\"&F17&\"*\",Sheet1!C:C,0)","v":{"$error":"#N/A"}},{"$f":"MATCH(\"*\"&H17&\"*\",Sheet1!C:C,0)","v":{"$error":"#N/A"}},{"$f":"MATCH(\"*\"&I17&\"*\",Sheet1!B:B,0)","v":{"$error":"#N/A"}},"x",null,null,{"$f":"INDEX('[1]Pt1-AvionicsComponentCosts'!$A:$NE,MATCH(B17,'[1]Pt1-AvionicsComponentCosts'!$A:$A,0),MATCH(\"END MARKER\",'[1]Pt1-AvionicsComponentCosts'!$11:$11,0))","v":1768791},0.5,0.5,""]
[null,665,{"$f":"INDEX('[1]Pt1-AvionicsComponentCosts'!$A:$B,MATCH(B18,'[1]Pt1-AvionicsComponentCosts'!$A:$A,0),2)","v":"Freighter"},"Airbus",1,"A320ceo","A320-200P2F","A320-200P2F","A320-200P2F",{"$f":"MATCH(\"*\"&F18&\"*\",Sheet1!C:C,0)","v":{"$error":"#N/A"}},{"$f":"MATCH(\"*\"&H18&\"*\",Sheet1!C:C,0)","v":{"$error":"#N/A"}},{"$f":"MATCH(\"*\"&I18&\"*\",Sheet1!B:B,0)","v":{"$error":"#N/A"}},23.3,"used","https://www.airliners.net/forum/viewtopic.php?t=1439571&start=300",{"$f":"INDEX('[1]Pt1-AvionicsComponentCosts'!$A:$NE,MATCH(B18,'[1]Pt1-AvionicsComponentCosts'!$A:$A,0),MATCH(\"END MARKER\",'[1]Pt1-AvionicsComponentCosts'!$11:$11,0))","v":1164718},0.5,0.5,0.24993948497854077]
[null,666,{"$f":"INDEX('[1]Pt1-AvionicsComponentCosts'!$A:$B,MATCH(B19,'[1]Pt1-AvionicsComponentCosts'!$A:$A,0),2)","v":"Freighter"},"Airbus",1,"A320ceo","A321P2F","A321P2F","A321P2F",{"$f":"MATCH(\"*\"&F19&\"*\",Sheet1!C:C,0)","v":{"$error":"#N/A"}},{"$f":"MATCH(\"*\"&H19&\"*\",Sheet1!C:C,0)","v":{"$error":"#N/A"}},{"$f":"MATCH(\"*\"&I19&\"*\",Sheet1!B:B,0)","v":{"$error":"#N/A"}},101,null,"https://www.avdelphi.com/aircraft_type.html?id=12714&recache=1721917906",{"$f":"INDEX('[1]Pt1-AvionicsComponentCosts'!$A:$NE,MATCH(B19,'[1]Pt1-AvionicsComponentCosts'!$A:$A,0),MATCH(\"END MARKER\",'[1]Pt1-AvionicsComponentCosts'!$11:$11,0))","v":1164718},0.5,0.5,5.7659306930693072E-2]
[null,104,{"$f":"INDEX('[1]Pt1-AvionicsComponentCosts'!$A:$B,MATCH(B20,'[1]Pt1-AvionicsComponentCosts'!$A:$A,0),2)","v":"Helicopter"},"Airbus",1,"Tiger","Airbus Tiger","Tiger","Tiger",{"$f":"MATCH(\"*\"&F20&\"*\",Sheet1!C:C,0)","v":{"$error":"#N/A"}},{"$f":"MATCH(\"*\"&H20&\"*\",Sheet1!C:C,0)","v":{"$error":"#N/A"}},{"$f":"MATCH(\"*\"&I20&\"*\",Sheet1!B:B,0)","v":{"$error":"#N/A"}},73,null,"https://simpleflying.com/most-expensive-military-helicopters-guide/",{"$f":"INDEX('[1]Pt1-AvionicsComponentCosts'!$A:$NE,MATCH(B20,'[1]Pt1-AvionicsComponentCosts'!$A:$A,0),MATCH(\"END MARKER\",'[1]Pt1-AvionicsComponentCosts'!$11:$11,0))","v":1457955},0.99,0.99,0.19772266438356165]
[null,117,{"$f":"INDEX('[1]Pt1-AvionicsComponentCosts'!$A:$B,MATCH(B21,'[1]Pt1-AvionicsComponentCosts'!$A:$A,0),2)","v":"Helicopter"},"Airbus",1,"Airbus UH-72 Lakota","Airbus UH-72 Lakota","UH-72 Lakota","UH-72 Lakota",{"$f":"MATCH(\"*\"&F21&\"*\",Sheet1!C:C,0)","v":{"$error":"#N/A"}},{"$f":"MATCH(\"*\"&H21&\"*\",Sheet1!C:C,0)","v":{"$error":"#N/A"}},{"$f":"MATCH(\"*\"&I21&\"*\",Sheet1!B:B,0)","v":{"$error":"#N/A"}},{"$f":"122.6/15","v":8.1733333333333338},null,"https://verticalmag.com/news/us-army-airbus-lakota-training-helicopters/",{"$f":"INDEX('[1]Pt1-AvionicsComponentCosts'!$A:$NE,MATCH(B21,'[1]Pt1-AvionicsComponentCosts'!$A:$A,0),MATCH(\"END MARKER\",'[1]Pt1-AvionicsComponentCosts'!$11:$11,0))","v":1435124},0.99,0.99,1.7383027243066882]
[null,112,{"$f":"INDEX('[1]Pt1-AvionicsComponentCosts'!$A:$B,MATCH(B22,'[1]Pt1-AvionicsComponentCosts'!$A:$A,0),2)","v":"Helicopter"},"Airbus",1,"H120 Colibri","Airbus H120 Colibri","H120 Colibri","H120 Colibri",{"$f":"MATCH(\"*\"&F22&\"*\",Sheet1!C:C,0)","v":{"$error":"#N/A"}},{"$f":"MATCH(\"*\"&H22&\"*\",Sheet1!C:C,0)","v":{"$error":"#N/A"}},{"$f":"MATCH(\"*\"&I22&\"*\",Sheet1!B:B,0)","v":{"$error":"#N/A"}},2,null,"https://bjtonline.com/aircraft/airbus-helicopters-h120",{"$f":"INDEX('[1]Pt1-AvionicsComponentCosts'!$A:$NE,MATCH(B22,'[1]Pt1-AvionicsComponentCosts'!$A:$A,0),MATCH(\"END MARKER\",'[1]Pt1-AvionicsComponentCosts'!$11:$11,0))","v":269100},0.99,0.99,1.3320449999999999]
[null,107,{"$f":"INDEX('[1]Pt1-AvionicsComponentCosts'!$A:$B,MATCH(B23,'[1]Pt1-AvionicsComponentCosts'!$A:$A,0),2)","v":"Helicopter"},"Airbus",1,"H125","Airbus H125","H125","H125",{"$f":"MATCH(\"*\"&F23&\"*\",Sheet1!C:C,0)","v":{"$error":"#N/A"}},{"$f":"MATCH(\"*\"&H23&\"*\",Sheet1!C:C,0)","v":{"$error":"#N/A"}},{"$f":"MATCH(\"*\"&I23&\"*\",Sheet1!B:B,0)","v":{"$error":"#N/A"}},2.9,null,"https://www.bjtonline.com/aircraft/airbus-helicopters-h125",{"$f":"INDEX('[1]Pt1-AvionicsComponentCosts'!$A:$NE,MATCH(B23,'[1]Pt1-AvionicsComponentCosts'!$A:$A,0),MATCH(\"END MARKER\",'[1]Pt1-AvionicsComponentCosts'!$11:$11,0))","v":269230},0.99,0.99,0.91909551724137928]
[null,108,{"$f":"INDEX('[1]Pt1-AvionicsComponentCosts'!$A:$B,MATCH(B24,'[1]Pt1-AvionicsComponentCosts'!$A:$A,0),2)","v":"Helicopter"},"Airbus",1,"H130","Airbus H130","H130","H130",{"$f":"MATCH(\"*\"&F24&\"*\",Sheet1!C:C,0)","v":{"$error":"#N/A"}},{"$f":"MATCH(\"*\"&H24&\"*\",Sheet1!C:C,0)","v":{"$error":"#N/A"}},{"$f":"MATCH(\"*\"&I24&\"*\",Sheet1!B:B,0)","v":{"$error":"#N/A"}},3.3,null,"https://www.bjtonline.com/aircraft/airbus-helicopters-h130",{"$f":"INDEX('[1]Pt1-AvionicsComponentCosts'!$A:$NE,MATCH(B24,'[1]Pt1-AvionicsComponentCosts'!$A:$A,0),MATCH(\"END MARKER\",'[1]Pt1-AvionicsComponentCosts'!$11:$11,0))","v":268326},0.99,0.99,0.80497799999999997]
[null,483,{"$f":"INDEX('[1]Pt1-AvionicsComponentCosts'!$A:$B,MATCH(B25,'[1]Pt1-AvionicsComponentCosts'!$A:$A,0),2)","v":"Helicopter"},"Airbus",1,"H135","Airbus H135","H135","H135",{"$f":"MATCH(\"*\"&F25&\"*\",Sheet1!C:C,0)","v":{"$error":"#N/A"}},{"$f":"MATCH(\"*\"&H25&\"*\",Sheet1!C:C,0)","v":{"$error":"#N/A"}},{"$f":"MATCH(\"*\"&I25&\"*\",Sheet1!B:B,0)","v":{"$error":"#N/A"}},5.7,null,"https://www.bjtonline.com/aircraft/airbus-helicopters-h135-p3",{"$f":"INDEX('[1]Pt1-AvionicsComponentCosts'!$A:$NE,MATCH(B25,'[1]Pt1-AvionicsComponentCosts'!$A:$A,0),MATCH(\"END MARKER\",'[1]Pt1-AvionicsComponentCosts'!$11:$11,0))","v":269100},0.99,0.99,0.46738421052631579]
[null,113,{"$f":"INDEX('[1]Pt1-AvionicsComponentCosts'!$A:$B,MATCH(B26,'[1]Pt1-AvionicsComponentCosts'!$A:$A,0),2)","v":"Helicopter"},"Airbus",1,"H145","Airbus H145/Kawasaki BK117","H145/Kawasaki BK117","H145/Kawasaki BK117",{"$f":"MATCH(\"*\"&F26&\"*\",Sheet1!C:C,0)","v":{"$error":"#N/A"}},{"$f":"MATCH(\"*\"&H26&\"*\",Sheet1!C:C,0)","v":{"$error":"#N/A"}},{"$f":"MATCH(\"*\"&I26&\"*\",Sheet1!B:B,0)","v":{"$error":"#N/A"}},9.6999999999999993,null,"https://www.bjtonline.com/aircraft/airbus-helicopters-h145",{"$f":"INDEX('[1]Pt1-AvionicsComponentCosts'!$A:$NE,MATCH(B26,'[1]Pt1-AvionicsComponentCosts'!$A:$A,0),MATCH(\"END MARKER\",'[1]Pt1-AvionicsComponentCosts'!$11:$11,0))","v":298535},0.99,0.99,0.30469036082474227]
[null,109,{"$f":"INDEX('[1]Pt1-AvionicsComponentCosts'!$A:$B,MATCH(B27,'[1]Pt1-AvionicsComponentCosts'!$A:$A,0),2)","v":"Helicopter"},"Airbus",1,"H155","Airbus H155","H155","H155",{"$f":"MATCH(\"*\"&F27&\"*\",Sheet1!C:C,0)","v":{"$error":"#N/A"}},{"$f":"MATCH(\"*\"&H27&\"*\",Sheet1!C:C,0)","v":{"$error":"#N/A"}},{"$f":"MATCH(\"*\"&I27&\"*\",Sheet1!B:B,0)","v":{"$error":"#N/A"}},14,null,"https://www.bjtonline.com/aircraft/airbus-helicopters-h155",{"$f":"INDEX('[1]Pt1-AvionicsComponentCosts'!$A:$NE,MATCH(B27,'[1]Pt1-AvionicsComponentCosts'!$A:$A,0),MATCH(\"END MARKER\",'[1]Pt1-AvionicsComponentCosts'!$11:$11,0))","v":464460},0.99,0.99,0.32843957142857144]
[null,110,{"$f":"INDEX('[1]Pt1-AvionicsComponentCosts'!$A:$B,MATCH(B28,'[1]Pt1-AvionicsComponentCosts'!$A:$A,0),2)","v":"Helicopter"},"Airbus",1,"H160","Airbus H160","H160","H160",{"$f":"MATCH(\"*\"&F28&\"*\",Sheet1!C:C,0)","v":{"$error":"#N/A"}},{"$f":"MATCH(\"*\"&H28&\"*\",Sheet1!C:C,0)","v":{"$error":"#N/A"}},{"$f":"MATCH(\"*\"&I28&\"*\",Sheet1!B:B,0)","v":{"$error":"#N/A"}},14,null,"https://www.businessinsider.com/airbus-luxury-helicopter-seat-10-people-for-around-14-million-2020-9",{"$f":"INDEX('[1]Pt1-AvionicsComponentCosts'!$A:$NE,MATCH(B28,'[1]Pt1-AvionicsComponentCosts'!$A:$A,0),MATCH(\"END MARKER\",'[1]Pt1-AvionicsComponentCosts'!$11:$11,0))","v":462782},0.99,0.99,0.32725298571428568]
[null,102,{"$f":"INDEX('[1]Pt1-AvionicsComponentCosts'!$A:$B,MATCH(B29,'[1]Pt1-AvionicsComponentCosts'!$A:$A,0),2)","v":"Helicopter"},"Airbus",1,"H175","Airbus H175","H175","H175",{"$f":"MATCH(\"*\"&F29&\"*\",Sheet1!C:C,0)","v":{"$error":"#N/A"}},{"$f":"MATCH(\"*\"&H29&\"*\",Sheet1!C:C,0)","v":{"$error":"#N/A"}},{"$f":"MATCH(\"*\"&I29&\"*\",Sheet1!B:B,0)","v":{"$error":"#N/A"}},17,null,"https://www.bjtonline.com/aircraft/airbus-helicopters-h175",{"$f":"INDEX('[1]Pt1-AvionicsComponentCosts'!$A:$NE,MATCH(B29,'[1]Pt1-AvionicsComponentCosts'!$A:$A,0),MATCH(\"END MARKER\",'[1]Pt1-AvionicsComponentCosts'!$11:$11,0))","v":597436},0.99,0.99,0.3479186117647059]
[null,105,{"$f":"INDEX('[1]Pt1-AvionicsComponentCosts'!$A:$B,MATCH(B30,'[1]Pt1-AvionicsComponentCosts'!$A:$A,0),2)","v":"Helicopter"},"Airbus",1,"H215 / H225","Airbus H215 / H225","H215 / H225","H215 / H225",{"$f":"MATCH(\"*\"&F30&\"*\",Sheet1!C:C,0)","v":{"$error":"#N/A"}},{"$f":"MATCH(\"*\"&H30&\"*\",Sheet1!C:C,0)","v":{"$error":"#N/A"}},{"$f":"MATCH(\"*\"&I30&\"*\",Sheet1!B:B,0)","v":{"$error":"#N/A"}},18,null,"https://www.bjtonline.com/aircraft/airbus-helicopters-h215-l1",{"$f":"INDEX('[1]Pt1-AvionicsComponentCosts'!$A:$NE,MATCH(B30,'[1]Pt1-AvionicsComponentCosts'!$A:$A,0),MATCH(\"END MARKER\",'[1]Pt1-AvionicsComponentCosts'!$11:$11,0))","v":603626},0.99,0.99,0.33199430000000002]
[null,106,{"$f":"INDEX('[1]Pt1-AvionicsComponentCosts'!$A:$B,MATCH(B31,'[1]Pt1-AvionicsComponentCosts'!$A:$A,0),2)","v":"Helicopter"},"Airbus",1,"H355","Airbus H355","H355","H355",{"$f":"MATCH(\"*\"&F31&\"*\",Sheet1!C:C,0)","v":{"$error":"#N/A"}},{"$f":"MATCH(\"*\"&H31&\"*\",Sheet1!C:C,0)","v":{"$error":"#N/A"}},{"$f":"MATCH(\"*\"&I31&\"*\",Sheet1!B:B,0)","v":{"$error":"#N/A"}},1.9,null,"https://www.bjtonline.com/aircraft/airbus-helicopters-as355f2-twinstar",{"$f":"INDEX('[1]Pt1-AvionicsComponentCosts'!$A:$NE,MATCH(B31,'[1]Pt1-AvionicsComponentCosts'!$A:$A,0),MATCH(\"END MARKER\",'[1]Pt1-AvionicsComponentCosts'!$11:$11,0))","v":304597},0.99,0.99,1.5871106842105263]
[null,645,{"$f":"INDEX('[1]Pt1-AvionicsComponentCosts'!$A:$B,MATCH(B32,'[1]Pt1-AvionicsComponentCosts'!$A:$A,0),2)","v":"Helicopter"},"Airbus",1,"X6","Airbus X6","X6","X6",{"$f":"MATCH(\"*\"&F32&\"*\",Sheet1!C:C,0)","v":{"$error":"#N/A"}},{"$f":"MATCH(\"*\"&H32&\"*\",Sheet1!C:C,0)","v":{"$error":"#N/A"}},{"$f":"MATCH(\"*\"&I32&\"*\",Sheet1!B:B,0)","v":{"$error":"#N/A"}},"x","concept",null,{"$f":"INDEX('[1]Pt1-AvionicsComponentCosts'!$A:$NE,MATCH(B32,'[1]Pt1-AvionicsComponentCosts'!$A:$A,0),MATCH(\"END MARKER\",'[1]Pt1-AvionicsComponentCosts'!$11:$11,0))","v":1466769},0.99,0.99,""]
[null,221,{"$f":"INDEX('[1]Pt1-AvionicsComponentCosts'!$A:$B,MATCH(B33,'[1]Pt1-AvionicsComponentCosts'!$A:$A,0),2)","v":"Large Commercial Aircraft"},"Airbus",1,"A220","Airbus A220-100","A220-100","A220-100",{"$f":"MATCH(\"*\"&F33&\"*\",Sheet1!C:C,0)","v":3},{"$f":"MATCH(\"*\"&H33&\"*\",Sheet1!C:C,0)","v":{"$error":"#N/A"}},{"$f":"MATCH(\"*\"&I33&\"*\",Sheet1!B:B,0)","v":3},{"$f":"INDEX(Sheet1!$A:$K,MATCH($I33,Sheet1!$B:$B,0),MATCH(M$1,Sheet1!$A$1:$K$1,0))","v":81},null,{"$f":"INDEX(Sheet1!$A:$K,MATCH($I33,Sheet1!$B:$B,0),MATCH(O$1,Sheet1!$A$1:$K$1,0))","v":"https://simpleflying.com/how-much-do-airbus-aircraft-cost/"},{"$f":"INDEX('[1]Pt1-AvionicsComponentCosts'!$A:$NE,MATCH(B33,'[1]Pt1-AvionicsComponentCosts'!$A:$A,0),MATCH(\"END MARKER\",'[1]Pt1-AvionicsComponentCosts'!$11:$11,0))","v":1368462},{"$f":"50%","v":0.5},{"$f":"50%","v":0.5},8.4472962962962958E-2]
[null,222,{"$f":"INDEX('[1]Pt1-AvionicsComponentCosts'!$A:$B,MATCH(B34,'[1]Pt1-AvionicsComponentCosts'!$A:$A,0),2)","v":"Large Commercial Aircraft"},"Airbus",1,"A220","Airbus A220-300","A220-300","A220-300",{"$f":"MATCH(\"*\"&F34&\"*\",Sheet1!C:C,0)","v":3},{"$f":"MATCH(\"*\"&H34&\"*\",Sheet1!C:C,0)","v":{"$error":"#N/A"}},{"$f":"MATCH(\"*\"&I34&\"*\",Sheet1!B:B,0)","v":4},{"$f":"INDEX(Sheet1!$A:$K,MATCH($I34,Sheet1!$B:$B,0),MATCH(M$1,Sheet1!$A$1:$K$1,0))","v":91.5},null,{"$f":"INDEX(Sheet1!$A:$K,MATCH($I34,Sheet1!$B:$B,0),MATCH(O$1,Sheet1!$A$1:$K$1,0))","v":"https://simpleflying.com/how-much-do-airbus-aircraft-cost/"},{"$f":"INDEX('[1]Pt1-AvionicsComponentCosts'!$A:$NE,MATCH(B34,'[1]Pt1-AvionicsComponentCosts'!$A:$A,0),MATCH(\"END MARKER\",'[1]Pt1-AvionicsComponentCosts'!$11:$11,0))","v":1368462},{"$f":"50%","v":0.5},{"$f":"50%","v":0.5},7.4779344262295086E-2]
[null,653,{"$f":"INDEX('[1]Pt1-AvionicsComponentCosts'!$A:$B,MATCH(B35,'[1]Pt1-AvionicsComponentCosts'!$A:$A,0),2)","v":"Large Commercial Aircraft"},"Airbus",1,"A220","Airbus A220-500","A220-500","A220-500",{"$f":"MATCH(\"*\"&F35&\"*\",Sheet1!C:C,0)","v":3},{"$f":"MATCH(\"*\"&H35&\"*\",Sheet1!C:C,0)","v":{"$error":"#N/A"}},{"$f":"MATCH(\"*\"&I35&\"*\",Sheet1!B:B,0)","v":{"$error":"#N/A"}},"x","concept",null,{"$f":"INDEX('[1]Pt1-AvionicsComponentCosts'!$A:$NE,MATCH(B35,'[1]Pt1-AvionicsComponentCosts'!$A:$A,0),MATCH(\"END MARKER\",'[1]Pt1-AvionicsComponentCosts'!$11:$11,0))","v":1436882},{"$f":"50%","v":0.5},{"$f":"50%","v":0.5},""]
[null,634,{"$f":"INDEX('[1]Pt1-AvionicsComponentCosts'!$A:$B,MATCH(B36,'[1]Pt1-AvionicsComponentCosts'!$A:$A,0),2)","v":"Large Commercial Aircraft"},"Airbus",1,"A320ceo","A319-100","A319-100","A319-100",{"$f":"MATCH(\"*\"&F36&\"*\",Sheet1!C:C,0)","v":{"$error":"#N/A"}},{"$f":"MATCH(\"*\"&H36&\"*\",Sheet1!C:C,0)","v":{"$error":"#N/A"}},{"$f":"MATCH(\"*\"&I36&\"*\",Sheet1!B:B,0)","v":{"$error":"#N/A"}},89,null,null,{"$f":"INDEX('[1]Pt1-AvionicsComponentCosts'!$A:$NE,MATCH(B36,'[1]Pt1-AvionicsComponentCosts'!$A:$A,0),MATCH(\"END MARKER\",'[1]Pt1-AvionicsComponentCosts'!$11:$11,0))","v":1212232},{"$f":"50%","v":0.5},{"$f":"50%","v":0.5},6.810292134831461E-2]
[null,633,{"$f":"INDEX('[1]Pt1-AvionicsComponentCosts'!$A:$B,MATCH(B37,'[1]Pt1-AvionicsComponentCosts'!$A:$A,0),2)","v":"Large Commercial Aircraft"},"Airbus",1,"A320ceo","A320-200","A320-200","A320-200",{"$f":"MATCH(\"*\"&F37&\"*\",Sheet1!C:C,0)","v":{"$error":"#N/A"}},{"$f":"MATCH(\"*\"&H37&\"*\",Sheet1!C:C,0)","v":{"$error":"#N/A"}},{"$f":"MATCH(\"*\"&I37&\"*\",Sheet1!B:B,0)","v":{"$error":"#N/A"}},98,null,null,{"$f":"INDEX('[1]Pt1-AvionicsComponentCosts'!$A:$NE,MATCH(B37,'[1]Pt1-AvionicsComponentCosts'!$A:$A,0),MATCH(\"END MARKER\",'[1]Pt1-AvionicsComponentCosts'!$11:$11,0))","v":1212232},{"$f":"50%","v":0.5},{"$f":"50%","v":0.5},6.1848571428571426E-2]
[null,206,{"$f":"INDEX('[1]Pt1-AvionicsComponentCosts'!$A:$B,MATCH(B38,'[1]Pt1-AvionicsComponentCosts'!$A:$A,0),2)","v":"Large Commercial Aircraft"},"Airbus",1,"A320ceo","Airbus A319ceo","A319ceo","A319ceo",{"$f":"MATCH(\"*\"&F38&\"*\",Sheet1!C:C,0)","v":{"$error":"#N/A"}},{"$f":"MATCH(\"*\"&H38&\"*\",Sheet1!C:C,0)","v":{"$error":"#N/A"}},{"$f":"MATCH(\"*\"&I38&\"*\",Sheet1!B:B,0)","v":{"$error":"#N/A"}},92.3,null,"https://simpleflying.com/how-much-do-airbus-aircraft-cost/",{"$f":"INDEX('[1]Pt1-AvionicsComponentCosts'!$A:$NE,MATCH(B38,'[1]Pt1-AvionicsComponentCosts'!$A:$A,0),MATCH(\"END MARKER\",'[1]Pt1-AvionicsComponentCosts'!$11:$11,0))","v":1212232},{"$f":"50%","v":0.5},{"$f":"50%","v":0.5},6.5668039003250273E-2]
[null,207,{"$f":"INDEX('[1]Pt1-AvionicsComponentCosts'!$A:$B,MATCH(B39,'[1]Pt1-AvionicsComponentCosts'!$A:$A,0),2)","v":"Large Commercial Aircraft"},"Airbus",1,"A320ceo","Airbus A320ceo","A320ceo","A320ceo",{"$f":"MATCH(\"*\"&F39&\"*\",Sheet1!C:C,0)","v":{"$error":"#N/A"}},{"$f":"MATCH(\"*\"&H39&\"*\",Sheet1!C:C,0)","v":{"$error":"#N/A"}},{"$f":"MATCH(\"*\"&I39&\"*\",Sheet1!B:B,0)","v":{"$error":"#N/A"}},101,null,"https://simpleflying.com/how-much-do-airbus-aircraft-cost/",{"$f":"INDEX('[1]Pt1-AvionicsComponentCosts'!$A:$NE,MATCH(B39,'[1]Pt1-AvionicsComponentCosts'!$A:$A,0),MATCH(\"END MARKER\",'[1]Pt1-AvionicsComponentCosts'!$11:$11,0))","v":1212232},{"$f":"50%","v":0.5},{"$f":"50%","v":0.5},6.001148514851485E-2]
[null,208,{"$f":"INDEX('[1]Pt1-AvionicsComponentCosts'!$A:$B,MATCH(B40,'[1]Pt1-AvionicsComponentCosts'!$A:$A,0),2)","v":"Large Commercial Aircraft"},"Airbus",1,"A320ceo","Airbus A321ceo","A321ceo","A321ceo",{"$f":"MATCH(\"*\"&F40&\"*\",Sheet1!C:C,0)","v":{"$error":"#N/A"}},{"$f":"MATCH(\"*\"&H40&\"*\",Sheet1!C:C,0)","v":{"$error":"#N/A"}},{"$f":"MATCH(\"*\"&I40&\"*\",Sheet1!B:B,0)","v":{"$error":"#N/A"}},118.3,null,"https://simpleflying.com/how-much-do-airbus-aircraft-cost/",{"$f":"INDEX('[1]Pt1-AvionicsComponentCosts'!$A:$NE,MATCH(B40,'[1]Pt1-AvionicsComponentCosts'!$A:$A,0),MATCH(\"END MARKER\",'[1]Pt1-AvionicsComponentCosts'!$11:$11,0))","v":1212232},{"$f":"50%","v":0.5},{"$f":"50%","v":0.5},5.1235502958579884E-2]
[null,513,{"$f":"INDEX('[1]Pt1-AvionicsComponentCosts'!$A:$B,MATCH(B41,'[1]Pt1-AvionicsComponentCosts'!$A:$A,0),2)","v":"Large Commercial Aircraft"},"Airbus",1,"A320neo","Airbus A319neo","A319neo","A319neo",{"$f":"MATCH(\"*\"&F41&\"*\",Sheet1!C:C,0)","v":{"$error":"#N/A"}},{"$f":"MATCH(\"*\"&H41&\"*\",Sheet1!C:C,0)","v":{"$error":"#N/A"}},{"$f":"MATCH(\"*\"&I41&\"*\",Sheet1!B:B,0)","v":7},{"$f":"INDEX(Sheet1!$A:$K,MATCH($I41,Sheet1!$B:$B,0),MATCH(M$1,Sheet1!$A$1:$K$1,0))","v":101.5},null,{"$f":"INDEX(Sheet1!$A:$K,MATCH($I41,Sheet1!$B:$B,0),MATCH(O$1,Sheet1!$A$1:$K$1,0))","v":"https://simpleflying.com/how-much-do-airbus-aircraft-cost/"},{"$f":"INDEX('[1]Pt1-AvionicsComponentCosts'!$A:$NE,MATCH(B41,'[1]Pt1-AvionicsComponentCosts'!$A:$A,0),MATCH(\"END MARKER\",'[1]Pt1-AvionicsComponentCosts'!$11:$11,0))","v":1212232},{"$f":"50%","v":0.5},{"$f":"50%","v":0.5},5.9715862068965515E-2]
[null,514,{"$f":"INDEX('[1]Pt1-AvionicsComponentCosts'!$A:$B,MATCH(B42,'[1]Pt1-AvionicsComponentCosts'!$A:$A,0),2)","v":"Large Commercial Aircraft"},"Airbus",1,"A320neo","Airbus A320neo","A320neo","A320neo",{"$f":"MATCH(\"*\"&F42&\"*\",Sheet1!C:C,0)","v":{"$error":"#N/A"}},{"$f":"MATCH(\"*\"&H42&\"*\",Sheet1!C:C,0)","v":{"$error":"#N/A"}},{"$f":"MATCH(\"*\"&I42&\"*\",Sheet1!B:B,0)","v":{"$error":"#N/A"}},110.6,null,"https://simpleflying.com/how-much-do-airbus-aircraft-cost/",{"$f":"INDEX('[1]Pt1-AvionicsComponentCosts'!$A:$NE,MATCH(B42,'[1]Pt1-AvionicsComponentCosts'!$A:$A,0),MATCH(\"END MARKER\",'[1]Pt1-AvionicsComponentCosts'!$11:$11,0))","v":1212232},{"$f":"50%","v":0.5},{"$f":"50%","v":0.5},5.480253164556962E-2]
[null,660,{"$f":"INDEX('[1]Pt1-AvionicsComponentCosts'!$A:$B,MATCH(B43,'[1]Pt1-AvionicsComponentCosts'!$A:$A,0),2)","v":"Large Commercial Aircraft"},"Airbus",1,"A320neo","Airbus A321 LR","A321 LR","A321 LR",{"$f":"MATCH(\"*\"&F43&\"*\",Sheet1!C:C,0)","v":{"$error":"#N/A"}},{"$f":"MATCH(\"*\"&H43&\"*\",Sheet1!C:C,0)","v":{"$error":"#N/A"}},{"$f":"MATCH(\"*\"&I43&\"*\",Sheet1!B:B,0)","v":{"$error":"#N/A"}},129.5,"guess","https://www.forbes.com/sites/michaelgoldstein/2019/12/04/united-airlines-to-buy-50-ultra-long-range-airbus-a321xlr-aircraft-in-estimated-6-billion-deal/",{"$f":"INDEX('[1]Pt1-AvionicsComponentCosts'!$A:$NE,MATCH(B43,'[1]Pt1-AvionicsComponentCosts'!$A:$A,0),MATCH(\"END MARKER\",'[1]Pt1-AvionicsComponentCosts'!$11:$11,0))","v":1272840},{"$f":"50%","v":0.5},{"$f":"50%","v":0.5},4.9144401544401542E-2]
[null,662,{"$f":"INDEX('[1]Pt1-AvionicsComponentCosts'!$A:$B,MATCH(B44,'[1]Pt1-AvionicsComponentCosts'!$A:$A,0),2)","v":"Large Commercial Aircraft"},"Airbus",1,"A320neo","Airbus A321 XLR","A321 XLR","A321 XLR",{"$f":"MATCH(\"*\"&F44&\"*\",Sheet1!C:C,0)","v":{"$error":"#N/A"}},{"$f":"MATCH(\"*\"&H44&\"*\",Sheet1!C:C,0)","v":{"$error":"#N/A"}},{"$f":"MATCH(\"*\"&I44&\"*\",Sheet1!B:B,0)","v":{"$error":"#N/A"}},129.5,"guess","https://www.forbes.com/sites/michaelgoldstein/2019/12/04/united-airlines-to-buy-50-ultra-long-range-airbus-a321xlr-aircraft-in-estimated-6-billion-deal/",{"$f":"INDEX('[1]Pt1-AvionicsComponentCosts'!$A:$NE,MATCH(B44,'[1]Pt1-AvionicsComponentCosts'!$A:$A,0),MATCH(\"END MARKER\",'[1]Pt1-AvionicsComponentCosts'!$11:$11,0))","v":1272840},{"$f":"50%","v":0.5},{"$f":"50%","v":0.5},4.9144401544401542E-2]
[null,515,{"$f":"INDEX('[1]Pt1-AvionicsComponentCosts'!$A:$B,MATCH(B45,'[1]Pt1-AvionicsComponentCosts'!$A:$A,0),2)","v":"Large Commercial Aircraft"},"Airbus",1,"A320neo","Airbus A321neo","A321neo","A321neo",{"$f":"MATCH(\"*\"&F45&\"*\",Sheet1!C:C,0)","v":{"$error":"#N/A"}},{"$f":"MATCH(\"*\"&H45&\"*\",Sheet1!C:C,0)","v":{"$error":"#N/A"}},{"$f":"MATCH(\"*\"&I45&\"*\",Sheet1!B:B,0)","v":10},{"$f":"INDEX(Sheet1!$A:$K,MATCH($I45,Sheet1!$B:$B,0),MATCH(M$1,Sheet1!$A$1:$K$1,0))","v":129.5},null,{"$f":"INDEX(Sheet1!$A:$K,MATCH($I45,Sheet1!$B:$B,0),MATCH(O$1,Sheet1!$A$1:$K$1,0))","v":"https://simpleflying.com/how-much-do-airbus-aircraft-cost/"},{"$f":"INDEX('[1]Pt1-AvionicsComponentCosts'!$A:$NE,MATCH(B45,'[1]Pt1-AvionicsComponentCosts'!$A:$A,0),MATCH(\"END MARKER\",'[1]Pt1-AvionicsComponentCosts'!$11:$11,0))","v":1212232},{"$f":"50%","v":0.5},{"$f":"50%","v":0.5},4.6804324324324326E-2]
[null,654,{"$f":"INDEX('[1]Pt1-AvionicsComponentCosts'!$A:$B,MATCH(B46,'[1]Pt1-AvionicsComponentCosts'!$A:$A,0),2)","v":"Large Commercial Aircraft"},"Airbus",1,"A320neo","Airbus A322X","A322X","A322X",{"$f":"MATCH(\"*\"&F46&\"*\",Sheet1!C:C,0)","v":{"$error":"#N/A"}},{"$f":"MATCH(\"*\"&H46&\"*\",Sheet1!C:C,0)","v":{"$error":"#N/A"}},{"$f":"MATCH(\"*\"&I46&\"*\",Sheet1!B:B,0)","v":{"$error":"#N/A"}},"x","concept",null,{"$f":"INDEX('[1]Pt1-AvionicsComponentCosts'!$A:$NE,MATCH(B46,'[1]Pt1-AvionicsComponentCosts'!$A:$A,0),MATCH(\"END MARKER\",'[1]Pt1-AvionicsComponentCosts'!$11:$11,0))","v":1436882},{"$f":"50%","v":0.5},{"$f":"50%","v":0.5},""]
[null,212,{"$f":"INDEX('[1]Pt1-AvionicsComponentCosts'!$A:$B,MATCH(B47,'[1]Pt1-AvionicsComponentCosts'!$A:$A,0),2)","v":"Large Commercial Aircraft"},"Airbus",1,"A330","Airbus A330-200","A330-200","A330-200",{"$f":"MATCH(\"*\"&F47&\"*\",Sheet1!C:C,0)","v":11},{"$f":"MATCH(\"*\"&H47&\"*\",Sheet1!C:C,0)","v":{"$error":"#N/A"}},{"$f":"MATCH(\"*\"&I47&\"*\",Sheet1!B:B,0)","v":11},{"$f":"INDEX(Sheet1!$A:$K,MATCH($I47,Sheet1!$B:$B,0),MATCH(M$1,Sheet1!$A$1:$K$1,0))","v":231.5},null,{"$f":"INDEX(Sheet1!$A:$K,MATCH($I47,Sheet1!$B:$B,0),MATCH(O$1,Sheet1!$A$1:$K$1,0))","v":"http://www.axonaviation.com/commercial-aircraft/aircraft-data/aircraft-pricing"},{"$f":"INDEX('[1]Pt1-AvionicsComponentCosts'!$A:$NE,MATCH(B47,'[1]Pt1-AvionicsComponentCosts'!$A:$A,0),MATCH(\"END MARKER\",'[1]Pt1-AvionicsComponentCosts'!$11:$11,0))","v":1757582},{"$f":"50%","v":0.5},{"$f":"50%","v":0.5},3.7960734341252703E-2]
[null,213,{"$f":"INDEX('[1]Pt1-AvionicsComponentCosts'!$A:$B,MATCH(B48,'[1]Pt1-AvionicsComponentCosts'!$A:$A,0),2)","v":"Large Commercial Aircraft"},"Airbus",1,"A330","Airbus A330-300","A330-300","A330-300",{"$f":"MATCH(\"*\"&F48&\"*\",Sheet1!C:C,0)","v":11},{"$f":"MATCH(\"*\"&H48&\"*\",Sheet1!C:C,0)","v":{"$error":"#N/A"}},{"$f":"MATCH(\"*\"&I48&\"*\",Sheet1!B:B,0)","v":13},{"$f":"INDEX(Sheet1!$A:$K,MATCH($I48,Sheet1!$B:$B,0),MATCH(M$1,Sheet1!$A$1:$K$1,0))","v":256.39999999999998},null,{"$f":"INDEX(Sheet1!$A:$K,MATCH($I48,Sheet1!$B:$B,0),MATCH(O$1,Sheet1!$A$1:$K$1,0))","v":"http://www.axonaviation.com/commercial-aircraft/aircraft-data/aircraft-pricing"},{"$f":"INDEX('[1]Pt1-AvionicsComponentCosts'!$A:$NE,MATCH(B48,'[1]Pt1-AvionicsComponentCosts'!$A:$A,0),MATCH(\"END MARKER\",'[1]Pt1-AvionicsComponentCosts'!$11:$11,0))","v":1757582},{"$f":"50%","v":0.5},{"$f":"50%","v":0.5},3.4274219968798758E-2]
[null,214,{"$f":"INDEX('[1]Pt1-AvionicsComponentCosts'!$A:$B,MATCH(B49,'[1]Pt1-AvionicsComponentCosts'!$A:$A,0),2)","v":"Large Commercial Aircraft"},"Airbus",1,"A330","Airbus A330-800neo","A330-800neo","A330-800neo",{"$f":"MATCH(\"*\"&F49&\"*\",Sheet1!C:C,0)","v":11},{"$f":"MATCH(\"*\"&H49&\"*\",Sheet1!C:C,0)","v":{"$error":"#N/A"}},{"$f":"MATCH(\"*\"&I49&\"*\",Sheet1!B:B,0)","v":14},{"$f":"INDEX(Sheet1!$A:$K,MATCH($I49,Sheet1!$B:$B,0),MATCH(M$1,Sheet1!$A$1:$K$1,0))","v":259.89999999999998},null,{"$f":"INDEX(Sheet1!$A:$K,MATCH($I49,Sheet1!$B:$B,0),MATCH(O$1,Sheet1!$A$1:$K$1,0))","v":"https://simpleflying.com/how-much-do-airbus-aircraft-cost/"},{"$f":"INDEX('[1]Pt1-AvionicsComponentCosts'!$A:$NE,MATCH(B49,'[1]Pt1-AvionicsComponentCosts'!$A:$A,0),MATCH(\"END MARKER\",'[1]Pt1-AvionicsComponentCosts'!$11:$11,0))","v":1757582},{"$f":"50%","v":0.5},{"$f":"50%","v":0.5},3.3812658714890351E-2]
[null,215,{"$f":"INDEX('[1]Pt1-AvionicsComponentCosts'!$A:$B,MATCH(B50,'[1]Pt1-AvionicsComponentCosts'!$A:$A,0),2)","v":"Large Commercial Aircraft"},"Airbus",1,"A330","Airbus A330-900neo","A330-900neo","A330-900neo",{"$f":"MATCH(\"*\"&F50&\"*\",Sheet1!C:C,0)","v":11},{"$f":"MATCH(\"*\"&H50&\"*\",Sheet1!C:C,0)","v":{"$error":"#N/A"}},{"$f":"MATCH(\"*\"&I50&\"*\",Sheet1!B:B,0)","v":15},{"$f":"INDEX(Sheet1!$A:$K,MATCH($I50,Sheet1!$B:$B,0),MATCH(M$1,Sheet1!$A$1:$K$1,0))","v":296.39999999999998},null,{"$f":"INDEX(Sheet1!$A:$K,MATCH($I50,Sheet1!$B:$B,0),MATCH(O$1,Sheet1!$A$1:$K$1,0))","v":"https://simpleflying.com/how-much-do-airbus-aircraft-cost/"},{"$f":"INDEX('[1]Pt1-AvionicsComponentCosts'!$A:$NE,MATCH(B50,'[1]Pt1-AvionicsComponentCosts'!$A:$A,0),MATCH(\"END MARKER\",'[1]Pt1-AvionicsComponentCosts'!$11:$11,0))","v":1757582},{"$f":"50%","v":0.5},{"$f":"50%","v":0.5},2.9648819163292851E-2]
[null,304,{"$f":"INDEX('[1]Pt1-AvionicsComponentCosts'!$A:$B,MATCH(B51,'[1]Pt1-AvionicsComponentCosts'!$A:$A,0),2)","v":"Large Commercial Aircraft"},"Airbus",1,"A340","Airbus A340-200/300","A340-200/300","A340-200/300",{"$f":"MATCH(\"*\"&F51&\"*\",Sheet1!C:C,0)","v":{"$error":"#N/A"}},{"$f":"MATCH(\"*\"&H51&\"*\",Sheet1!C:C,0)","v":{"$error":"#N/A"}},{"$f":"MATCH(\"*\"&I51&\"*\",Sheet1!B:B,0)","v":{"$error":"#N/A"}},"x","OOP",null,{"$f":"INDEX('[1]Pt1-AvionicsComponentCosts'!$A:$NE,MATCH(B51,'[1]Pt1-AvionicsComponentCosts'!$A:$A,0),MATCH(\"END MARKER\",'[1]Pt1-AvionicsComponentCosts'!$11:$11,0))","v":1776818},{"$f":"50%","v":0.5},{"$f":"50%","v":0.5},""]
[null,5,{"$f":"INDEX('[1]Pt1-AvionicsComponentCosts'!$A:$B,MATCH(B52,'[1]Pt1-AvionicsComponentCosts'!$A:$A,0),2)","v":"Large Commercial Aircraft"},"Airbus",1,"A340","Airbus A340-500/600","A340-500/600","A340-500/600",{"$f":"MATCH(\"*\"&F52&\"*\",Sheet1!C:C,0)","v":{"$error":"#N/A"}},{"$f":"MATCH(\"*\"&H52&\"*\",Sheet1!C:C,0)","v":{"$error":"#N/A"}},{"$f":"MATCH(\"*\"&I52&\"*\",Sheet1!B:B,0)","v":{"$error":"#N/A"}},"x","OOP",null,{"$f":"INDEX('[1]Pt1-AvionicsComponentCosts'!$A:$NE,MATCH(B52,'[1]Pt1-AvionicsComponentCosts'!$A:$A,0),MATCH(\"END MARKER\",'[1]Pt1-AvionicsComponentCosts'!$11:$11,0))","v":1787566},{"$f":"50%","v":0.5},{"$f":"50%","v":0.5},""]
[null,6,{"$f":"INDEX('[1]Pt1-AvionicsComponentCosts'!$A:$B,MATCH(B53,'[1]Pt1-AvionicsComponentCosts'!$A:$A,0),2)","v":"Large Commercial Aircraft"},"Airbus",1,"A350","Airbus A350 XWB - A350-900","A350 XWB - A350-900","A350 XWB - A350-900",{"$f":"MATCH(\"*\"&F53&\"*\",Sheet1!C:C,0)","v":17},{"$f":"MATCH(\"*\"&H53&\"*\",Sheet1!C:C,0)","v":{"$error":"#N/A"}},{"$f":"MATCH(\"*\"&I53&\"*\",Sheet1!B:B,0)","v":{"$error":"#N/A"}},308.10000000000002,null,"http://www.axonaviation.com/commercial-aircraft/aircraft-data/aircraft-pricing",{"$f":"INDEX('[1]Pt1-AvionicsComponentCosts'!$A:$NE,MATCH(B53,'[1]Pt1-AvionicsComponentCosts'!$A:$A,0),MATCH(\"END MARKER\",'[1]Pt1-AvionicsComponentCosts'!$11:$11,0))","v":2322085},{"$f":"50%","v":0.5},{"$f":"50%","v":0.5},3.7683950016228492E-2]
[null,7,{"$f":"INDEX('[1]Pt1-AvionicsComponentCosts'!$A:$B,MATCH(B54,'[1]Pt1-AvionicsComponentCosts'!$A:$A,0),2)","v":"Large Commercial Aircraft"},"Airbus",1,"A350","Airbus A350-1000","A350-1000","A350-1000",{"$f":"MATCH(\"*\"&F54&\"*\",Sheet1!C:C,0)","v":17},{"$f":"MATCH(\"*\"&H54&\"*\",Sheet1!C:C,0)","v":{"$error":"#N/A"}},{"$f":"MATCH(\"*\"&I54&\"*\",Sheet1!B:B,0)","v":18},{"$f":"INDEX(Sheet1!$A:$K,MATCH($I54,Sheet1!$B:$B,0),MATCH(M$1,Sheet1!$A$1:$K$1,0))","v":355.7},null,{"$f":"INDEX(Sheet1!$A:$K,MATCH($I54,Sheet1!$B:$B,0),MATCH(O$1,Sheet1!$A$1:$K$1,0))","v":"http://www.axonaviation.com/commercial-aircraft/aircraft-data/aircraft-pricing"},{"$f":"INDEX('[1]Pt1-AvionicsComponentCosts'!$A:$NE,MATCH(B54,'[1]Pt1-AvionicsComponentCosts'!$A:$A,0),MATCH(\"END MARKER\",'[1]Pt1-AvionicsComponentCosts'!$11:$11,0))","v":2322085},{"$f":"50%","v":0.5},{"$f":"50%","v":0.5},3.2641059881922972E-2]
[null,657,{"$f":"INDEX('[1]Pt1-AvionicsComponentCosts'!$A:$B,MATCH(B55,'[1]Pt1-AvionicsComponentCosts'!$A:$A,0),2)","v":"Large Commercial Aircraft"},"Airbus",1,"A350","Airbus A350-1000neo","A350-1000neo","A350-1000neo",{"$f":"MATCH(\"*\"&F55&\"*\",Sheet1!C:C,0)","v":17},{"$f":"MATCH(\"*\"&H55&\"*\",Sheet1!C:C,0)","v":{"$error":"#N/A"}},{"$f":"MATCH(\"*\"&I55&\"*\",Sheet1!B:B,0)","v":{"$error":"#N/A"}},355,null,"http://www.axonaviation.com/commercial-aircraft/aircraft-data/aircraft-pricing",{"$f":"INDEX('[1]Pt1-AvionicsComponentCosts'!$A:$NE,MATCH(B55,'[1]Pt1-AvionicsComponentCosts'!$A:$A,0),MATCH(\"END MARKER\",'[1]Pt1-AvionicsComponentCosts'!$11:$11,0))","v":2322085},{"$f":"50%","v":0.5},{"$f":"50%","v":0.5},3.2705422535211269E-2]
[null,656,{"$f":"INDEX('[1]Pt1-AvionicsComponentCosts'!$A:$B,MATCH(B56,'[1]Pt1-AvionicsComponentCosts'!$A:$A,0),2)","v":"Large Commercial Aircraft"},"Airbus",1,"A350","Airbus A350-900neo","A350-900neo","A350-900neo",{"$f":"MATCH(\"*\"&F56&\"*\",Sheet1!C:C,0)","v":17},{"$f":"MATCH(\"*\"&H56&\"*\",Sheet1!C:C,0)","v":{"$error":"#N/A"}},{"$f":"MATCH(\"*\"&I56&\"*\",Sheet1!B:B,0)","v":{"$error":"#N/A"}},308.10000000000002,null,"http://www.axonaviation.com/commercial-aircraft/aircraft-data/aircraft-pricing",{"$f":"INDEX('[1]Pt1-AvionicsComponentCosts'!$A:$NE,MATCH(B56,'[1]Pt1-AvionicsComponentCosts'!$A:$A,0),MATCH(\"END MARKER\",'[1]Pt1-AvionicsComponentCosts'!$11:$11,0))","v":2322085},{"$f":"50%","v":0.5},{"$f":"50%","v":0.5},3.7683950016228492E-2]
[null,305,{"$f":"INDEX('[1]Pt1-AvionicsComponentCosts'!$A:$B,MATCH(B57,'[1]Pt1-AvionicsComponentCosts'!$A:$A,0),2)","v":"Large Commercial Aircraft"},"Airbus",1,"Airbus A300","Airbus A300","A300","A300",{"$f":"MATCH(\"*\"&F57&\"*\",Sheet1!C:C,0)","v":{"$error":"#N/A"}},{"$f":"MATCH(\"*\"&H57&\"*\",Sheet1!C:C,0)","v":{"$error":"#N/A"}},{"$f":"MATCH(\"*\"&I57&\"*\",Sheet1!B:B,0)","v":{"$error":"#N/A"}},"x","OOP",null,{"$f":"INDEX('[1]Pt1-AvionicsComponentCosts'!$A:$NE,MATCH(B57,'[1]Pt1-AvionicsComponentCosts'!$A:$A,0),MATCH(\"END MARKER\",'[1]Pt1-AvionicsComponentCosts'!$11:$11,0))","v":1733068},{"$f":"50%","v":0.5},{"$f":"50%","v":0.5},""]
[null,216,{"$f":"INDEX('[1]Pt1-AvionicsComponentCosts'!$A:$B,MATCH(B58,'[1]Pt1-AvionicsComponentCosts'!$A:$A,0),2)","v":"Large Commercial Aircraft"},"Airbus",1,"A380","Airbus A380","A380","A380",{"$f":"MATCH(\"*\"&F58&\"*\",Sheet1!C:C,0)","v":19},{"$f":"MATCH(\"*\"&H58&\"*\",Sheet1!C:C,0)","v":19},{"$f":"MATCH(\"*\"&I58&\"*\",Sheet1!B:B,0)","v":19},{"$f":"INDEX(Sheet1!$A:$K,MATCH($I58,Sheet1!$B:$B,0),MATCH(M$1,Sheet1!$A$1:$K$1,0))","v":350},null,{"$f":"INDEX(Sheet1!$A:$K,MATCH($I58,Sheet1!$B:$B,0),MATCH(O$1,Sheet1!$A$1:$K$1,0))","v":"http://www.axonaviation.com/commercial-aircraft/aircraft-data/aircraft-pricing"},{"$f":"INDEX('[1]Pt1-AvionicsComponentCosts'!$A:$NE,MATCH(B58,'[1]Pt1-AvionicsComponentCosts'!$A:$A,0),MATCH(\"END MARKER\",'[1]Pt1-AvionicsComponentCosts'!$11:$11,0))","v":2586470},{"$f":"50%","v":0.5},{"$f":"50%","v":0.5},3.6949571428571429E-2]
[null,551,{"$f":"INDEX('[1]Pt1-AvionicsComponentCosts'!$A:$B,MATCH(B59,'[1]Pt1-AvionicsComponentCosts'!$A:$A,0),2)","v":"Military Transport / Special Mission"},"Airbus",1,"A330 MRTT","Airbus A330 MRTT","A330 MRTT","A330 MRTT",{"$f":"MATCH(\"*\"&F59&\"*\",Sheet1!C:C,0)","v":{"$error":"#N/A"}},{"$f":"MATCH(\"*\"&H59&\"*\",Sheet1!C:C,0)","v":{"$error":"#N/A"}},{"$f":"MATCH(\"*\"&I59&\"*\",Sheet1!B:B,0)","v":{"$error":"#N/A"}},340,null,"https://simpleflying.com/how-much-do-military-transport-aircraft-cost/",{"$f":"INDEX('[1]Pt1-AvionicsComponentCosts'!$A:$NE,MATCH(B59,'[1]Pt1-AvionicsComponentCosts'!$A:$A,0),MATCH(\"END MARKER\",'[1]Pt1-AvionicsComponentCosts'!$11:$11,0))","v":3104657},1,1,9.1313441176470583E-2]
[null,150,{"$f":"INDEX('[1]Pt1-AvionicsComponentCosts'!$A:$B,MATCH(B60,'[1]Pt1-AvionicsComponentCosts'!$A:$A,0),2)","v":"Military Transport / Special Mission"},"Airbus",1,"A400M Atlas","Airbus A400M Atlas","A400M Atlas","A400M Atlas",{"$f":"MATCH(\"*\"&F60&\"*\",Sheet1!C:C,0)","v":{"$error":"#N/A"}},{"$f":"MATCH(\"*\"&H60&\"*\",Sheet1!C:C,0)","v":{"$error":"#N/A"}},{"$f":"MATCH(\"*\"&I60&\"*\",Sheet1!B:B,0)","v":{"$error":"#N/A"}},190,null,"https://weaponsystems.net/system/673-Airbus+A400M+Atlas",{"$f":"INDEX('[1]Pt1-AvionicsComponentCosts'!$A:$NE,MATCH(B60,'[1]Pt1-AvionicsComponentCosts'!$A:$A,0),MATCH(\"END MARKER\",'[1]Pt1-AvionicsComponentCosts'!$11:$11,0))","v":3226806},1,1,0.1698318947368421]
[null,155,{"$f":"INDEX('[1]Pt1-AvionicsComponentCosts'!$A:$B,MATCH(B61,'[1]Pt1-AvionicsComponentCosts'!$A:$A,0),2)","v":"Military Transport / Special Mission"},"Alenia",1,"Alenia C-27J","Alenia C-27J","C-27J","C-27J",{"$f":"MATCH(\"*\"&F61&\"*\",Sheet1!C:C,0)","v":{"$error":"#N/A"}},{"$f":"MATCH(\"*\"&H61&\"*\",Sheet1!C:C,0)","v":{"$error":"#N/A"}},{"$f":"MATCH(\"*\"&I61&\"*\",Sheet1!B:B,0)","v":{"$error":"#N/A"}},40,null,"https://simpleflying.com/how-much-do-military-transport-aircraft-cost/",{"$f":"INDEX('[1]Pt1-AvionicsComponentCosts'!$A:$NE,MATCH(B61,'[1]Pt1-AvionicsComponentCosts'!$A:$A,0),MATCH(\"END MARKER\",'[1]Pt1-AvionicsComponentCosts'!$11:$11,0))","v":3025995},1,1,0.75649875]
[null,668,{"$f":"INDEX('[1]Pt1-AvionicsComponentCosts'!$A:$B,MATCH(B62,'[1]Pt1-AvionicsComponentCosts'!$A:$A,0),2)","v":"Freighter"},"ATR",1,"ATR 42/72","ATR 72-600F","72-600F","72-600F",{"$f":"MATCH(\"*\"&F62&\"*\",Sheet1!C:C,0)","v":{"$error":"#N/A"}},{"$f":"MATCH(\"*\"&H62&\"*\",Sheet1!C:C,0)","v":{"$error":"#N/A"}},{"$f":"MATCH(\"*\"&I62&\"*\",Sheet1!B:B,0)","v":{"$error":"#N/A"}},26,null,"https://www.paramountbusinessjets.com/private-jet-charter/aircraft/atr-72-600",{"$f":"INDEX('[1]Pt1-AvionicsComponentCosts'!$A:$NE,MATCH(B62,'[1]Pt1-AvionicsComponentCosts'!$A:$A,0),MATCH(\"END MARKER\",'[1]Pt1-AvionicsComponentCosts'!$11:$11,0))","v":698861},0.5,0.5,0.13439634615384616]
[null,667,{"$f":"INDEX('[1]Pt1-AvionicsComponentCosts'!$A:$B,MATCH(B63,'[1]Pt1-AvionicsComponentCosts'!$A:$A,0),2)","v":"Freighter"},"ATR",1,"ATR 42/72","ATR 72/42 Freighter Conversion","72/42 Freighter Conversion","72/42 Freighter Conversion",{"$f":"MATCH(\"*\"&F63&\"*\",Sheet1!C:C,0)","v":{"$error":"#N/A"}},{"$f":"MATCH(\"*\"&H63&\"*\",Sheet1!C:C,0)","v":{"$error":"#N/A"}},{"$f":"MATCH(\"*\"&I63&\"*\",Sheet1!B:B,0)","v":{"$error":"#N/A"}},"x",null,null,{"$f":"INDEX('[1]Pt1-AvionicsComponentCosts'!$A:$NE,MATCH(B63,'[1]Pt1-AvionicsComponentCosts'!$A:$A,0),MATCH(\"END MARKER\",'[1]Pt1-AvionicsComponentCosts'!$11:$11,0))","v":698861},0.5,0.5,""]
[null,191,{"$f":"INDEX('[1]Pt1-AvionicsComponentCosts'!$A:$B,MATCH(B64,'[1]Pt1-AvionicsComponentCosts'!$A:$A,0),2)","v":"Regional"},"ATR",1,"ATR 42/72","ATR 42","42","42",{"$f":"MATCH(\"*\"&F64&\"*\",Sheet1!C:C,0)","v":{"$error":"#N/A"}},{"$f":"MATCH(\"*\"&H64&\"*\",Sheet1!C:C,0)","v":{"$error":"#N/A"}},{"$f":"MATCH(\"*\"&I64&\"*\",Sheet1!B:B,0)","v":{"$error":"#N/A"}},"x",null,null,{"$f":"INDEX('[1]Pt1-AvionicsComponentCosts'!$A:$NE,MATCH(B64,'[1]Pt1-AvionicsComponentCosts'!$A:$A,0),MATCH(\"END MARKER\",'[1]Pt1-AvionicsComponentCosts'!$11:$11,0))","v":1028924},0.65,0.65,""]
[null,26,{"$f":"INDEX('[1]Pt1-AvionicsComponentCosts'!$A:$B,MATCH(B65,'[1]Pt1-AvionicsComponentCosts'!$A:$A,0),2)","v":"Regional"},"ATR",1,"ATR 42/72","ATR 72","72","72",{"$f":"MATCH(\"*\"&F65&\"*\",Sheet1!C:C,0)","v":{"$error":"#N/A"}},{"$f":"MATCH(\"*\"&H65&\"*\",Sheet1!C:C,0)","v":{"$error":"#N/A"}},{"$f":"MATCH(\"*\"&I65&\"*\",Sheet1!B:B,0)","v":{"$error":"#N/A"}},"x",null,null,{"$f":"INDEX('[1]Pt1-AvionicsComponentCosts'!$A:$NE,MATCH(B65,'[1]Pt1-AvionicsComponentCosts'!$A:$A,0),MATCH(\"END MARKER\",'[1]Pt1-AvionicsComponentCosts'!$11:$11,0))","v":1028924},0.65,0.65,""]
[null,647,{"$f":"INDEX('[1]Pt1-AvionicsComponentCosts'!$A:$B,MATCH(B66,'[1]Pt1-AvionicsComponentCosts'!$A:$A,0),2)","v":"Regional"},"ATR",1,"ATR 42/72X","ATR 42/72X","42/72X","42/72X",{"$f":"MATCH(\"*\"&F66&\"*\",Sheet1!C:C,0)","v":{"$error":"#N/A"}},{"$f":"MATCH(\"*\"&H66&\"*\",Sheet1!C:C,0)","v":{"$error":"#N/A"}},{"$f":"MATCH(\"*\"&I66&\"*\",Sheet1!B:B,0)","v":{"$error":"#N/A"}},"x",null,null,{"$f":"INDEX('[1]Pt1-AvionicsComponentCosts'!$A:$NE,MATCH(B66,'[1]Pt1-AvionicsComponentCosts'!$A:$A,0),MATCH(\"END MARKER\",'[1]Pt1-AvionicsComponentCosts'!$11:$11,0))","v":1028924},0.65,0.65,""]
[null,616,{"$f":"INDEX('[1]Pt1-AvionicsComponentCosts'!$A:$B,MATCH(B67,'[1]Pt1-AvionicsComponentCosts'!$A:$A,0),2)","v":"Regional"},"AVIC",1,"AVIC MA700","AVIC MA700",{"$f":"TRIM(SUBSTITUTE(G67,D67,\"\"))","v":"MA700"},{"$f":"TRIM(SUBSTITUTE(SUBSTITUTE(SUBSTITUTE(SUBSTITUTE(SUBSTITUTE(H67,\"Family\",\"\"),\"737 Classic:\",\"\"),\"737 MAX:\",\"\"),\"787 Dreamliner:\",\"\"),\"777:\",\"\"))","v":"MA700"},{"$f":"MATCH(\"*\"&F67&\"*\",Sheet1!C:C,0)","v":{"$error":"#N/A"}},{"$f":"MATCH(\"*\"&H67&\"*\",Sheet1!C:C,0)","v":{"$error":"#N/A"}},{"$f":"MATCH(\"*\"&I67&\"*\",Sheet1!B:B,0)","v":{"$error":"#N/A"}},25,null,"https://aerocorner.com/aircraft/xian-ma700/",{"$f":"INDEX('[1]Pt1-AvionicsComponentCosts'!$A:$NE,MATCH(B67,'[1]Pt1-AvionicsComponentCosts'!$A:$A,0),MATCH(\"END MARKER\",'[1]Pt1-AvionicsComponentCosts'!$11:$11,0))","v":919730},0.65,0.65,{"$f":"IFERROR(P67/(M67*100000)*R67,\"\")","v":0.2391298}]
[null,548,{"$f":"INDEX('[1]Pt1-AvionicsComponentCosts'!$A:$B,MATCH(B68,'[1]Pt1-AvionicsComponentCosts'!$A:$A,0),2)","v":"Turbine GA"},"Ayres",1,"Ayres Thrush 510","Ayres Thrush 510","Thrush 510","Thrush 510",{"$f":"MATCH(\"*\"&F68&\"*\",Sheet1!C:C,0)","v":{"$error":"#N/A"}},{"$f":"MATCH(\"*\"&H68&\"*\",Sheet1!C:C,0)","v":{"$error":"#N/A"}},{"$f":"MATCH(\"*\"&I68&\"*\",Sheet1!B:B,0)","v":{"$error":"#N/A"}},null,0.86899999999999999,"https://www.flyingmag.com/aircraft-turboprops-thrush-510g/",{"$f":"INDEX('[1]Pt1-AvionicsComponentCosts'!$A:$NE,MATCH(B68,'[1]Pt1-AvionicsComponentCosts'!$A:$A,0),MATCH(\"END MARKER\",'[1]Pt1-AvionicsComponentCosts'!$11:$11,0))","v":211406},1,1,{"$f":"IFERROR(P68/(M68*100000)*R68,\"\")","v":""}]
[null,549,{"$f":"INDEX('[1]Pt1-AvionicsComponentCosts'!$A:$B,MATCH(B69,'[1]Pt1-AvionicsComponentCosts'!$A:$A,0),2)","v":"Turbine GA"},"Ayres",1,"Ayres Thrush SR2","Ayres Thrush SR2","Thrush SR2","Thrush SR2",{"$f":"MATCH(\"*\"&F69&\"*\",Sheet1!C:C,0)","v":{"$error":"#N/A"}},{"$f":"MATCH(\"*\"&H69&\"*\",Sheet1!C:C,0)","v":{"$error":"#N/A"}},{"$f":"MATCH(\"*\"&I69&\"*\",Sheet1!B:B,0)","v":{"$error":"#N/A"}},null,0.8,"https://janes.migavia.com/usa/thrush/thrush-turbo-thrush-s2r.html",{"$f":"INDEX('[1]Pt1-AvionicsComponentCosts'!$A:$NE,MATCH(B69,'[1]Pt1-AvionicsComponentCosts'!$A:$A,0),MATCH(\"END MARKER\",'[1]Pt1-AvionicsComponentCosts'!$11:$11,0))","v":211406},1,1,{"$f":"IFERROR(P69/(M69*100000)*R69,\"\")","v":""}]
[null,167,{"$f":"INDEX('[1]Pt1-AvionicsComponentCosts'!$A:$B,MATCH(B70,'[1]Pt1-AvionicsComponentCosts'!$A:$A,0),2)","v":"Fighters and Jet Trainers"},"BAE",1,"Hawk","BAE Systems Hawk","Systems Hawk","Systems Hawk",{"$f":"MATCH(\"*\"&F70&\"*\",Sheet1!C:C,0)","v":{"$error":"#N/A"}},{"$f":"MATCH(\"*\"&H70&\"*\",Sheet1!C:C,0)","v":{"$error":"#N/A"}},{"$f":"MATCH(\"*\"&I70&\"*\",Sheet1!B:B,0)","v":{"$error":"#N/A"}},"x",null,null,{"$f":"INDEX('[1]Pt1-AvionicsComponentCosts'!$A:$NE,MATCH(B70,'[1]Pt1-AvionicsComponentCosts'!$A:$A,0),MATCH(\"END MARKER\",'[1]Pt1-AvionicsComponentCosts'!$11:$11,0))","v":1158497},1,1,""]
[null,643,{"$f":"INDEX('[1]Pt1-AvionicsComponentCosts'!$A:$B,MATCH(B71,'[1]Pt1-AvionicsComponentCosts'!$A:$A,0),2)","v":"Fighters and Jet Trainers"},"BAES/Leonardo",1,"BAES/Leonardo Tempest","BAES/Leonardo Tempest","Tempest","Tempest",{"$f":"MATCH(\"*\"&F71&\"*\",Sheet1!C:C,0)","v":{"$error":"#N/A"}},{"$f":"MATCH(\"*\"&H71&\"*\",Sheet1!C:C,0)","v":{"$error":"#N/A"}},{"$f":"MATCH(\"*\"&I71&\"*\",Sheet1!B:B,0)","v":{"$error":"#N/A"}},"x",null,null,{"$f":"INDEX('[1]Pt1-AvionicsComponentCosts'!$A:$NE,MATCH(B71,'[1]Pt1-AvionicsComponentCosts'!$A:$A,0),MATCH(\"END MARKER\",'[1]Pt1-AvionicsComponentCosts'!$11:$11,0))","v":2779270},1,1,""]
[null,901,{"$f":"INDEX('[1]Pt1-AvionicsComponentCosts'!$A:$B,MATCH(B72,'[1]Pt1-AvionicsComponentCosts'!$A:$A,0),2)","v":"UAV"},"Bayraktar",1,"Bayraktar TB-2","Bayraktar TB-2","TB-2","TB-2",{"$f":"MATCH(\"*\"&F72&\"*\",Sheet1!C:C,0)","v":{"$error":"#N/A"}},{"$f":"MATCH(\"*\"&H72&\"*\",Sheet1!C:C,0)","v":{"$error":"#N/A"}},{"$f":"MATCH(\"*\"&I72&\"*\",Sheet1!B:B,0)","v":{"$error":"#N/A"}},2,null,"https://www.defensenews.com/unmanned/2023/06/14/kuwait-to-buy-turkish-made-tb2-drones-in-367-million-deal/",{"$f":"INDEX('[1]Pt1-AvionicsComponentCosts'!$A:$NE,MATCH(B72,'[1]Pt1-AvionicsComponentCosts'!$A:$A,0),MATCH(\"END MARKER\",'[1]Pt1-AvionicsComponentCosts'!$11:$11,0))","v":914017},1,1,4.5700849999999997]
[null,80,{"$f":"INDEX('[1]Pt1-AvionicsComponentCosts'!$A:$B,MATCH(B73,'[1]Pt1-AvionicsComponentCosts'!$A:$A,0),2)","v":"Turbine GA"},"Beechcraft",1,"Beechcraft King Air","Beechcraft King Air","King Air","King Air",{"$f":"MATCH(\"*\"&F73&\"*\",Sheet1!C:C,0)","v":{"$error":"#N/A"}},{"$f":"MATCH(\"*\"&H73&\"*\",Sheet1!C:C,0)","v":{"$error":"#N/A"}},{"$f":"MATCH(\"*\"&I73&\"*\",Sheet1!B:B,0)","v":{"$error":"#N/A"}},8,"350i","https://www.sherpareport.com/aircraft/costs-king-air-350.html",{"$f":"INDEX('[1]Pt1-AvionicsComponentCosts'!$A:$NE,MATCH(B73,'[1]Pt1-AvionicsComponentCosts'!$A:$A,0),MATCH(\"END MARKER\",'[1]Pt1-AvionicsComponentCosts'!$11:$11,0))","v":217209},1,1,0.27151124999999998]
[null,31,{"$f":"INDEX('[1]Pt1-AvionicsComponentCosts'!$A:$B,MATCH(B74,'[1]Pt1-AvionicsComponentCosts'!$A:$A,0),2)","v":"Turbine GA"},"Beechcraft",1,"Other light aircraft","Beechcraft Premier I","Premier I","Premier I",{"$f":"MATCH(\"*\"&F74&\"*\",Sheet1!C:C,0)","v":{"$error":"#N/A"}},{"$f":"MATCH(\"*\"&H74&\"*\",Sheet1!C:C,0)","v":{"$error":"#N/A"}},{"$f":"MATCH(\"*\"&I74&\"*\",Sheet1!B:B,0)","v":{"$error":"#N/A"}},null,"used","https://www.libertyjet.com/private_jets_for_sale/Beechcraft%20Corp./Premier%20I",{"$f":"INDEX('[1]Pt1-AvionicsComponentCosts'!$A:$NE,MATCH(B74,'[1]Pt1-AvionicsComponentCosts'!$A:$A,0),MATCH(\"END MARKER\",'[1]Pt1-AvionicsComponentCosts'!$11:$11,0))","v":228066},1,1,""]
[null,169,{"$f":"INDEX('[1]Pt1-AvionicsComponentCosts'!$A:$B,MATCH(B75,'[1]Pt1-AvionicsComponentCosts'!$A:$A,0),2)","v":"Turboprop Trainers / Light Attack"},"Beechcraft",1,"Beechcraft T-6 Texan II","Beechcraft T-6 Texan II","T-6 Texan II","T-6 Texan II",{"$f":"MATCH(\"*\"&F75&\"*\",Sheet1!C:C,0)","v":{"$error":"#N/A"}},{"$f":"MATCH(\"*\"&H75&\"*\",Sheet1!C:C,0)","v":{"$error":"#N/A"}},{"$f":"MATCH(\"*\"&I75&\"*\",Sheet1!B:B,0)","v":{"$error":"#N/A"}},4.2720000000000002,null,"https://www.af.mil/About-Us/Fact-Sheets/Display/Article/104548/t-6a-texan-ii/",{"$f":"INDEX('[1]Pt1-AvionicsComponentCosts'!$A:$NE,MATCH(B75,'[1]Pt1-AvionicsComponentCosts'!$A:$A,0),MATCH(\"END MARKER\",'[1]Pt1-AvionicsComponentCosts'!$11:$11,0))","v":468525},1,1,1.0967345505617978]
[null,92,{"$f":"INDEX('[1]Pt1-AvionicsComponentCosts'!$A:$B,MATCH(B76,'[1]Pt1-AvionicsComponentCosts'!$A:$A,0),2)","v":"Helicopter"},"Bell",1,"AH-1","Bell AH-1Z Viper","AH-1Z Viper","AH-1Z Viper",{"$f":"MATCH(\"*\"&F76&\"*\",Sheet1!C:C,0)","v":{"$error":"#N/A"}},{"$f":"MATCH(\"*\"&H76&\"*\",Sheet1!C:C,0)","v":{"$error":"#N/A"}},{"$f":"MATCH(\"*\"&I76&\"*\",Sheet1!B:B,0)","v":{"$error":"#N/A"}},31,null,"https://warriorlodge.com/pages/bell-ah-1z-viper",{"$f":"INDEX('[1]Pt1-AvionicsComponentCosts'!$A:$NE,MATCH(B76,'[1]Pt1-AvionicsComponentCosts'!$A:$A,0),MATCH(\"END MARKER\",'[1]Pt1-AvionicsComponentCosts'!$11:$11,0))","v":1457955},0.99,0.99,0.46560498387096777]
[null,132,{"$f":"INDEX('[1]Pt1-AvionicsComponentCosts'!$A:$B,MATCH(B77,'[1]Pt1-AvionicsComponentCosts'!$A:$A,0),2)","v":"Helicopter"},"Bell",1,"Future Attack Reconnaissance Aircraft","Bell V-280 Valor ","V-280 Valor","V-280 Valor",{"$f":"MATCH(\"*\"&F77&\"*\",Sheet1!C:C,0)","v":{"$error":"#N/A"}},{"$f":"MATCH(\"*\"&H77&\"*\",Sheet1!C:C,0)","v":{"$error":"#N/A"}},{"$f":"MATCH(\"*\"&I77&\"*\",Sheet1!B:B,0)","v":{"$error":"#N/A"}},43,null,"https://simpleflying.com/bell-v280-valor-complete-guide/",{"$f":"INDEX('[1]Pt1-AvionicsComponentCosts'!$A:$NE,MATCH(B77,'[1]Pt1-AvionicsComponentCosts'!$A:$A,0),MATCH(\"END MARKER\",'[1]Pt1-AvionicsComponentCosts'!$11:$11,0))","v":1493963},0.99,0.99,0.34395892325581395]
[null,646,{"$f":"INDEX('[1]Pt1-AvionicsComponentCosts'!$A:$B,MATCH(B78,'[1]Pt1-AvionicsComponentCosts'!$A:$A,0),2)","v":"Helicopter"},"Bell",1,"412X","Bell 412X","412X","412X",{"$f":"MATCH(\"*\"&F78&\"*\",Sheet1!C:C,0)","v":{"$error":"#N/A"}},{"$f":"MATCH(\"*\"&H78&\"*\",Sheet1!C:C,0)","v":{"$error":"#N/A"}},{"$f":"MATCH(\"*\"&I78&\"*\",Sheet1!B:B,0)","v":{"$error":"#N/A"}},"x",null,null,{"$f":"INDEX('[1]Pt1-AvionicsComponentCosts'!$A:$NE,MATCH(B78,'[1]Pt1-AvionicsComponentCosts'!$A:$A,0),MATCH(\"END MARKER\",'[1]Pt1-AvionicsComponentCosts'!$11:$11,0))","v":434124},0.99,0.99,""]
[null,90,{"$f":"INDEX('[1]Pt1-AvionicsComponentCosts'!$A:$B,MATCH(B79,'[1]Pt1-AvionicsComponentCosts'!$A:$A,0),2)","v":"Helicopter"},"Bell",1,"Bell 407","Bell 407","407","407",{"$f":"MATCH(\"*\"&F79&\"*\",Sheet1!C:C,0)","v":{"$error":"#N/A"}},{"$f":"MATCH(\"*\"&H79&\"*\",Sheet1!C:C,0)","v":{"$error":"#N/A"}},{"$f":"MATCH(\"*\"&I79&\"*\",Sheet1!B:B,0)","v":{"$error":"#N/A"}},3.75,null,"https://www.businessairnews.com/hb_aircraftpage.html?recnum=B407",{"$f":"INDEX('[1]Pt1-AvionicsComponentCosts'!$A:$NE,MATCH(B79,'[1]Pt1-AvionicsComponentCosts'!$A:$A,0),MATCH(\"END MARKER\",'[1]Pt1-AvionicsComponentCosts'!$11:$11,0))","v":267940},0.99,0.99,0.70736159999999992]
[null,91,{"$f":"INDEX('[1]Pt1-AvionicsComponentCosts'!$A:$B,MATCH(B80,'[1]Pt1-AvionicsComponentCosts'!$A:$A,0),2)","v":"Helicopter"},"Bell",1,"Bell 429 GlobalRanger","Bell 429 GlobalRanger","429 GlobalRanger","429 GlobalRanger",{"$f":"MATCH(\"*\"&F80&\"*\",Sheet1!C:C,0)","v":{"$error":"#N/A"}},{"$f":"MATCH(\"*\"&H80&\"*\",Sheet1!C:C,0)","v":{"$error":"#N/A"}},{"$f":"MATCH(\"*\"&I80&\"*\",Sheet1!B:B,0)","v":{"$error":"#N/A"}},7.5,null,"https://www.fairlifts.com/helicopters/guide-to-2023-helicopter-prices/",{"$f":"INDEX('[1]Pt1-AvionicsComponentCosts'!$A:$NE,MATCH(B80,'[1]Pt1-AvionicsComponentCosts'!$A:$A,0),MATCH(\"END MARKER\",'[1]Pt1-AvionicsComponentCosts'!$11:$11,0))","v":434124},0.99,0.99,0.57304368000000006]
[null,89,{"$f":"INDEX('[1]Pt1-AvionicsComponentCosts'!$A:$B,MATCH(B81,'[1]Pt1-AvionicsComponentCosts'!$A:$A,0),2)","v":"Helicopter"},"Bell",1,"Bell 505 Jet Ranger X","Bell 505 Jet Ranger X","505 Jet Ranger X","505 Jet Ranger X",{"$f":"MATCH(\"*\"&F81&\"*\",Sheet1!C:C,0)","v":{"$error":"#N/A"}},{"$f":"MATCH(\"*\"&H81&\"*\",Sheet1!C:C,0)","v":{"$error":"#N/A"}},{"$f":"MATCH(\"*\"&I81&\"*\",Sheet1!B:B,0)","v":{"$error":"#N/A"}},1.3,null,"https://www.fairlifts.com/helicopters/guide-to-2023-helicopter-prices/",{"$f":"INDEX('[1]Pt1-AvionicsComponentCosts'!$A:$NE,MATCH(B81,'[1]Pt1-AvionicsComponentCosts'!$A:$A,0),MATCH(\"END MARKER\",'[1]Pt1-AvionicsComponentCosts'!$11:$11,0))","v":462138},0.99,0.99,3.5193586153846153]
[null,93,{"$f":"INDEX('[1]Pt1-AvionicsComponentCosts'!$A:$B,MATCH(B82,'[1]Pt1-AvionicsComponentCosts'!$A:$A,0),2)","v":"Helicopter"},"Bell",1,"Bell 525 Relentless","Bell 525 Relentless","525 Relentless","525 Relentless",{"$f":"MATCH(\"*\"&F82&\"*\",Sheet1!C:C,0)","v":{"$error":"#N/A"}},{"$f":"MATCH(\"*\"&H82&\"*\",Sheet1!C:C,0)","v":{"$error":"#N/A"}},{"$f":"MATCH(\"*\"&I82&\"*\",Sheet1!B:B,0)","v":{"$error":"#N/A"}},17,null,"https://www.businessairnews.com/hb_aircraftpage.html?recnum=B525",{"$f":"INDEX('[1]Pt1-AvionicsComponentCosts'!$A:$NE,MATCH(B82,'[1]Pt1-AvionicsComponentCosts'!$A:$A,0),MATCH(\"END MARKER\",'[1]Pt1-AvionicsComponentCosts'!$11:$11,0))","v":462138},0.99,0.99,0.26912742352941177]
[null,182,{"$f":"INDEX('[1]Pt1-AvionicsComponentCosts'!$A:$B,MATCH(B83,'[1]Pt1-AvionicsComponentCosts'!$A:$A,0),2)","v":"Helicopter"},"Bell",1,"OH-58","Bell OH-58D Kiowa","OH-58D Kiowa","OH-58D Kiowa",{"$f":"MATCH(\"*\"&F83&\"*\",Sheet1!C:C,0)","v":{"$error":"#N/A"}},{"$f":"MATCH(\"*\"&H83&\"*\",Sheet1!C:C,0)","v":{"$error":"#N/A"}},{"$f":"MATCH(\"*\"&I83&\"*\",Sheet1!B:B,0)","v":{"$error":"#N/A"}},null,null,null,{"$f":"INDEX('[1]Pt1-AvionicsComponentCosts'!$A:$NE,MATCH(B83,'[1]Pt1-AvionicsComponentCosts'!$A:$A,0),MATCH(\"END MARKER\",'[1]Pt1-AvionicsComponentCosts'!$11:$11,0))","v":1433447},0.99,0.99,""]
[null,94,{"$f":"INDEX('[1]Pt1-AvionicsComponentCosts'!$A:$B,MATCH(B84,'[1]Pt1-AvionicsComponentCosts'!$A:$A,0),2)","v":"Helicopter"},"Bell",1,"UH-1","Bell UH-1 Iroquois/412","UH-1 Iroquois/412","UH-1 Iroquois/412",{"$f":"MATCH(\"*\"&F84&\"*\",Sheet1!C:C,0)","v":{"$error":"#N/A"}},{"$f":"MATCH(\"*\"&H84&\"*\",Sheet1!C:C,0)","v":{"$error":"#N/A"}},{"$f":"MATCH(\"*\"&I84&\"*\",Sheet1!B:B,0)","v":{"$error":"#N/A"}},null,null,null,{"$f":"INDEX('[1]Pt1-AvionicsComponentCosts'!$A:$NE,MATCH(B84,'[1]Pt1-AvionicsComponentCosts'!$A:$A,0),MATCH(\"END MARKER\",'[1]Pt1-AvionicsComponentCosts'!$11:$11,0))","v":481057},0.99,0.99,""]
[null,95,{"$f":"INDEX('[1]Pt1-AvionicsComponentCosts'!$A:$B,MATCH(B85,'[1]Pt1-AvionicsComponentCosts'!$A:$A,0),2)","v":"Helicopter"},"Bell",1,"UH-1","Bell UH-1Y Venom","UH-1Y Venom","UH-1Y Venom",{"$f":"MATCH(\"*\"&F85&\"*\",Sheet1!C:C,0)","v":{"$error":"#N/A"}},{"$f":"MATCH(\"*\"&H85&\"*\",Sheet1!C:C,0)","v":{"$error":"#N/A"}},{"$f":"MATCH(\"*\"&I85&\"*\",Sheet1!B:B,0)","v":{"$error":"#N/A"}},null,null,null,{"$f":"INDEX('[1]Pt1-AvionicsComponentCosts'!$A:$NE,MATCH(B85,'[1]Pt1-AvionicsComponentCosts'!$A:$A,0),MATCH(\"END MARKER\",'[1]Pt1-AvionicsComponentCosts'!$11:$11,0))","v":1452366},0.99,0.99,""]
[null,97,{"$f":"INDEX('[1]Pt1-AvionicsComponentCosts'!$A:$B,MATCH(B86,'[1]Pt1-AvionicsComponentCosts'!$A:$A,0),2)","v":"Helicopter"},"Bell Boeing",1,"V-22","Bell Boeing V-22 Osprey","V-22 Osprey","V-22 Osprey",{"$f":"MATCH(\"*\"&F86&\"*\",Sheet1!C:C,0)","v":{"$error":"#N/A"}},{"$f":"MATCH(\"*\"&H86&\"*\",Sheet1!C:C,0)","v":{"$error":"#N/A"}},{"$f":"MATCH(\"*\"&I86&\"*\",Sheet1!B:B,0)","v":{"$error":"#N/A"}},null,null,null,{"$f":"INDEX('[1]Pt1-AvionicsComponentCosts'!$A:$NE,MATCH(B86,'[1]Pt1-AvionicsComponentCosts'!$A:$A,0),MATCH(\"END MARKER\",'[1]Pt1-AvionicsComponentCosts'!$11:$11,0))","v":1493963},0.99,0.99,""]
[null,529,{"$f":"INDEX('[1]Pt1-AvionicsComponentCosts'!$A:$B,MATCH(B87,'[1]Pt1-AvionicsComponentCosts'!$A:$A,0),2)","v":"Business Jet"},"Boeing",1,"BBJ","Boeing BBJ MAX","BBJ MAX","BBJ MAX",{"$f":"MATCH(\"*\"&F87&\"*\",Sheet1!C:C,0)","v":{"$error":"#N/A"}},{"$f":"MATCH(\"*\"&H87&\"*\",Sheet1!C:C,0)","v":{"$error":"#N/A"}},{"$f":"MATCH(\"*\"&I87&\"*\",Sheet1!B:B,0)","v":{"$error":"#N/A"}},{"$f":"AVERAGE(101.5,110.5,118.5)","v":110.16666666666667},null,null,{"$f":"INDEX('[1]Pt1-AvionicsComponentCosts'!$A:$NE,MATCH(B87,'[1]Pt1-AvionicsComponentCosts'!$A:$A,0),MATCH(\"END MARKER\",'[1]Pt1-AvionicsComponentCosts'!$11:$11,0))","v":1157247},0.75,0.75,7.878383509833585E-2]
[null,297,{"$f":"INDEX('[1]Pt1-AvionicsComponentCosts'!$A:$B,MATCH(B88,'[1]Pt1-AvionicsComponentCosts'!$A:$A,0),2)","v":"Business Jet"},"Boeing",1,"BBJ","Boeing BBJ/BBJ2/BBJ3","BBJ/BBJ2/BBJ3","BBJ/BBJ2/BBJ3",{"$f":"MATCH(\"*\"&F88&\"*\",Sheet1!C:C,0)","v":{"$error":"#N/A"}},{"$f":"MATCH(\"*\"&H88&\"*\",Sheet1!C:C,0)","v":{"$error":"#N/A"}},{"$f":"MATCH(\"*\"&I88&\"*\",Sheet1!B:B,0)","v":{"$error":"#N/A"}},71,null,"https://www.bjtonline.com/business-jet-news/boeings-bbj-3",{"$f":"INDEX('[1]Pt1-AvionicsComponentCosts'!$A:$NE,MATCH(B88,'[1]Pt1-AvionicsComponentCosts'!$A:$A,0),MATCH(\"END MARKER\",'[1]Pt1-AvionicsComponentCosts'!$11:$11,0))","v":1157247},0.75,0.75,0.12224440140845071]
[null,594,{"$f":"INDEX('[1]Pt1-AvionicsComponentCosts'!$A:$B,MATCH(B89,'[1]Pt1-AvionicsComponentCosts'!$A:$A,0),2)","v":"Business Jet"},"Boeing",1,"Boeing 747","Boeing 747-8 VIP","747-8 VIP","747-8 VIP",{"$f":"MATCH(\"*\"&F89&\"*\",Sheet1!C:C,0)","v":{"$error":"#N/A"}},{"$f":"MATCH(\"*\"&H89&\"*\",Sheet1!C:C,0)","v":{"$error":"#N/A"}},{"$f":"MATCH(\"*\"&I89&\"*\",Sheet1!B:B,0)","v":{"$error":"#N/A"}},418.4,null,"https://finance.yahoo.com/news/5-priciest-private-jets-2023-185110930.html",{"$f":"INDEX('[1]Pt1-AvionicsComponentCosts'!$A:$NE,MATCH(B89,'[1]Pt1-AvionicsComponentCosts'!$A:$A,0),MATCH(\"END MARKER\",'[1]Pt1-AvionicsComponentCosts'!$11:$11,0))","v":2376181},0.75,0.75,4.2594066682600379E-2]
[null,298,{"$f":"INDEX('[1]Pt1-AvionicsComponentCosts'!$A:$B,MATCH(B90,'[1]Pt1-AvionicsComponentCosts'!$A:$A,0),2)","v":"Business Jet"},"Boeing",1,"Wide body VIP","Boeing BBJ 777","BBJ 777","BBJ 777",{"$f":"MATCH(\"*\"&F90&\"*\",Sheet1!C:C,0)","v":{"$error":"#N/A"}},{"$f":"MATCH(\"*\"&H90&\"*\",Sheet1!C:C,0)","v":{"$error":"#N/A"}},{"$f":"MATCH(\"*\"&I90&\"*\",Sheet1!B:B,0)","v":{"$error":"#N/A"}},400,null,"https://www.lunajets.com/en/news/new-boeing-business-jet-777x-can-fly-across-the-globe-non-stop",{"$f":"INDEX('[1]Pt1-AvionicsComponentCosts'!$A:$NE,MATCH(B90,'[1]Pt1-AvionicsComponentCosts'!$A:$A,0),MATCH(\"END MARKER\",'[1]Pt1-AvionicsComponentCosts'!$11:$11,0))","v":2329960},0.75,0.75,4.3686750000000003E-2]
[null,553,{"$f":"INDEX('[1]Pt1-AvionicsComponentCosts'!$A:$B,MATCH(B91,'[1]Pt1-AvionicsComponentCosts'!$A:$A,0),2)","v":"Business Jet"},"Boeing",1,"Wide body VIP","Boeing BBJ 777X","BBJ 777X","BBJ 777X",{"$f":"MATCH(\"*\"&F91&\"*\",Sheet1!C:C,0)","v":{"$error":"#N/A"}},{"$f":"MATCH(\"*\"&H91&\"*\",Sheet1!C:C,0)","v":{"$error":"#N/A"}},{"$f":"MATCH(\"*\"&I91&\"*\",Sheet1!B:B,0)","v":{"$error":"#N/A"}},400,null,"https://www.lunajets.com/en/news/new-boeing-business-jet-777x-can-fly-across-the-globe-non-stop",{"$f":"INDEX('[1]Pt1-AvionicsComponentCosts'!$A:$NE,MATCH(B91,'[1]Pt1-AvionicsComponentCosts'!$A:$A,0),MATCH(\"END MARKER\",'[1]Pt1-AvionicsComponentCosts'!$11:$11,0))","v":1766100},0.75,0.75,3.3114375000000001E-2]
[null,554,{"$f":"INDEX('[1]Pt1-AvionicsComponentCosts'!$A:$B,MATCH(B92,'[1]Pt1-AvionicsComponentCosts'!$A:$A,0),2)","v":"Business Jet"},"Boeing",1,"Wide body VIP","Boeing BBJ 787","BBJ 787","BBJ 787",{"$f":"MATCH(\"*\"&F92&\"*\",Sheet1!C:C,0)","v":{"$error":"#N/A"}},{"$f":"MATCH(\"*\"&H92&\"*\",Sheet1!C:C,0)","v":{"$error":"#N/A"}},{"$f":"MATCH(\"*\"&I92&\"*\",Sheet1!B:B,0)","v":{"$error":"#N/A"}},200,null,"https://finance.yahoo.com/news/5-priciest-private-jets-2023-185110930.html",{"$f":"INDEX('[1]Pt1-AvionicsComponentCosts'!$A:$NE,MATCH(B92,'[1]Pt1-AvionicsComponentCosts'!$A:$A,0),MATCH(\"END MARKER\",'[1]Pt1-AvionicsComponentCosts'!$11:$11,0))","v":2358982},0.75,0.75,8.8461824999999994E-2]
[null,179,{"$f":"INDEX('[1]Pt1-AvionicsComponentCosts'!$A:$B,MATCH(B93,'[1]Pt1-AvionicsComponentCosts'!$A:$A,0),2)","v":"Fighters and Jet Trainers"},"Boeing",1,"Boeing/Saab T-X program","Boeing T-7","T-7","T-7",{"$f":"MATCH(\"*\"&F93&\"*\",Sheet1!C:C,0)","v":{"$error":"#N/A"}},{"$f":"MATCH(\"*\"&H93&\"*\",Sheet1!C:C,0)","v":{"$error":"#N/A"}},{"$f":"MATCH(\"*\"&I93&\"*\",Sheet1!B:B,0)","v":{"$error":"#N/A"}},null,null,null,{"$f":"INDEX('[1]Pt1-AvionicsComponentCosts'!$A:$NE,MATCH(B93,'[1]Pt1-AvionicsComponentCosts'!$A:$A,0),MATCH(\"END MARKER\",'[1]Pt1-AvionicsComponentCosts'!$11:$11,0))","v":2685632},1,1,""]
[null,637,{"$f":"INDEX('[1]Pt1-AvionicsComponentCosts'!$A:$B,MATCH(B94,'[1]Pt1-AvionicsComponentCosts'!$A:$A,0),2)","v":"Fighters and Jet Trainers"},"Boeing",1,"F-18","F-18 A/D","F-18 A/D","F-18 A/D",{"$f":"MATCH(\"*\"&F94&\"*\",Sheet1!C:C,0)","v":{"$error":"#N/A"}},{"$f":"MATCH(\"*\"&H94&\"*\",Sheet1!C:C,0)","v":{"$error":"#N/A"}},{"$f":"MATCH(\"*\"&I94&\"*\",Sheet1!B:B,0)","v":{"$error":"#N/A"}},null,null,null,{"$f":"INDEX('[1]Pt1-AvionicsComponentCosts'!$A:$NE,MATCH(B94,'[1]Pt1-AvionicsComponentCosts'!$A:$A,0),MATCH(\"END MARKER\",'[1]Pt1-AvionicsComponentCosts'!$11:$11,0))","v":2728198},1,1,""]
[null,140,{"$f":"INDEX('[1]Pt1-AvionicsComponentCosts'!$A:$B,MATCH(B95,'[1]Pt1-AvionicsComponentCosts'!$A:$A,0),2)","v":"Fighters and Jet Trainers"},"Boeing",1,"F-18","F-18 Super Hornet","F-18 Super Hornet","F-18 Super Hornet",{"$f":"MATCH(\"*\"&F95&\"*\",Sheet1!C:C,0)","v":{"$error":"#N/A"}},{"$f":"MATCH(\"*\"&H95&\"*\",Sheet1!C:C,0)","v":{"$error":"#N/A"}},{"$f":"MATCH(\"*\"&I95&\"*\",Sheet1!B:B,0)","v":{"$error":"#N/A"}},null,null,null,{"$f":"INDEX('[1]Pt1-AvionicsComponentCosts'!$A:$NE,MATCH(B95,'[1]Pt1-AvionicsComponentCosts'!$A:$A,0),MATCH(\"END MARKER\",'[1]Pt1-AvionicsComponentCosts'!$11:$11,0))","v":2728198},1,1,""]
[null,592,{"$f":"INDEX('[1]Pt1-AvionicsComponentCosts'!$A:$B,MATCH(B96,'[1]Pt1-AvionicsComponentCosts'!$A:$A,0),2)","v":"Freighter"},"Boeing",1,"Boeing 747","Boeing 747-400CF","747-400CF","747-400CF",{"$f":"MATCH(\"*\"&F96&\"*\",Sheet1!C:C,0)","v":{"$error":"#N/A"}},{"$f":"MATCH(\"*\"&H96&\"*\",Sheet1!C:C,0)","v":{"$error":"#N/A"}},{"$f":"MATCH(\"*\"&I96&\"*\",Sheet1!B:B,0)","v":{"$error":"#N/A"}},null,null,null,{"$f":"INDEX('[1]Pt1-AvionicsComponentCosts'!$A:$NE,MATCH(B96,'[1]Pt1-AvionicsComponentCosts'!$A:$A,0),MATCH(\"END MARKER\",'[1]Pt1-AvionicsComponentCosts'!$11:$11,0))","v":1813123},0.5,0.5,""]
[null,629,{"$f":"INDEX('[1]Pt1-AvionicsComponentCosts'!$A:$B,MATCH(B97,'[1]Pt1-AvionicsComponentCosts'!$A:$A,0),2)","v":"Freighter"},"Boeing",1,"Boeing 747","Boeing 747-400F/ERF","747-400F/ERF","747-400F/ERF",{"$f":"MATCH(\"*\"&F97&\"*\",Sheet1!C:C,0)","v":{"$error":"#N/A"}},{"$f":"MATCH(\"*\"&H97&\"*\",Sheet1!C:C,0)","v":{"$error":"#N/A"}},{"$f":"MATCH(\"*\"&I97&\"*\",Sheet1!B:B,0)","v":{"$error":"#N/A"}},null,null,null,{"$f":"INDEX('[1]Pt1-AvionicsComponentCosts'!$A:$NE,MATCH(B97,'[1]Pt1-AvionicsComponentCosts'!$A:$A,0),MATCH(\"END MARKER\",'[1]Pt1-AvionicsComponentCosts'!$11:$11,0))","v":1813123},0.5,0.5,""]
[null,567,{"$f":"INDEX('[1]Pt1-AvionicsComponentCosts'!$A:$B,MATCH(B98,'[1]Pt1-AvionicsComponentCosts'!$A:$A,0),2)","v":"Freighter"},"Boeing",1,"Boeing 747","Boeing 747-8F","747-8F","747-8F",{"$f":"MATCH(\"*\"&F98&\"*\",Sheet1!C:C,0)","v":{"$error":"#N/A"}},{"$f":"MATCH(\"*\"&H98&\"*\",Sheet1!C:C,0)","v":{"$error":"#N/A"}},{"$f":"MATCH(\"*\"&I98&\"*\",Sheet1!B:B,0)","v":{"$error":"#N/A"}},419.2,null,"https://www.statista.com/statistics/273941/prices-of-boeing-aircraft-by-type/",{"$f":"INDEX('[1]Pt1-AvionicsComponentCosts'!$A:$NE,MATCH(B98,'[1]Pt1-AvionicsComponentCosts'!$A:$A,0),MATCH(\"END MARKER\",'[1]Pt1-AvionicsComponentCosts'!$11:$11,0))","v":2375378},0.5,0.5,2.8332275763358779E-2]
[null,664,{"$f":"INDEX('[1]Pt1-AvionicsComponentCosts'!$A:$B,MATCH(B99,'[1]Pt1-AvionicsComponentCosts'!$A:$A,0),2)","v":"Freighter"},"Boeing",1,"Boeing 777","Boeing 777-300 ERSF","777-300 ERSF","777-300 ERSF",{"$f":"MATCH(\"*\"&F99&\"*\",Sheet1!C:C,0)","v":{"$error":"#N/A"}},{"$f":"MATCH(\"*\"&H99&\"*\",Sheet1!C:C,0)","v":{"$error":"#N/A"}},{"$f":"MATCH(\"*\"&I99&\"*\",Sheet1!B:B,0)","v":{"$error":"#N/A"}},352.3,null,"https://www.statista.com/statistics/273941/prices-of-boeing-aircraft-by-type/",{"$f":"INDEX('[1]Pt1-AvionicsComponentCosts'!$A:$NE,MATCH(B99,'[1]Pt1-AvionicsComponentCosts'!$A:$A,0),MATCH(\"END MARKER\",'[1]Pt1-AvionicsComponentCosts'!$11:$11,0))","v":2378140},0.5,0.5,3.3751632131705935E-2]
[null,568,{"$f":"INDEX('[1]Pt1-AvionicsComponentCosts'!$A:$B,MATCH(B100,'[1]Pt1-AvionicsComponentCosts'!$A:$A,0),2)","v":"Freighter"},"Boeing",1,"Boeing 777","Boeing 777F","777F","777F",{"$f":"MATCH(\"*\"&F100&\"*\",Sheet1!C:C,0)","v":{"$error":"#N/A"}},{"$f":"MATCH(\"*\"&H100&\"*\",Sheet1!C:C,0)","v":{"$error":"#N/A"}},{"$f":"MATCH(\"*\"&I100&\"*\",Sheet1!B:B,0)","v":33},{"$f":"INDEX(Sheet1!$A:$K,MATCH($I100,Sheet1!$B:$B,0),MATCH(M$1,Sheet1!$A$1:$K$1,0))","v":352.3},null,{"$f":"INDEX(Sheet1!$A:$K,MATCH($I100,Sheet1!$B:$B,0),MATCH(O$1,Sheet1!$A$1:$K$1,0))","v":"http://www.axonaviation.com/commercial-aircraft/aircraft-data/aircraft-pricing"},{"$f":"INDEX('[1]Pt1-AvionicsComponentCosts'!$A:$NE,MATCH(B100,'[1]Pt1-AvionicsComponentCosts'!$A:$A,0),MATCH(\"END MARKER\",'[1]Pt1-AvionicsComponentCosts'!$11:$11,0))","v":2378140},0.5,0.5,3.3751632131705935E-2]
[null,659,{"$f":"INDEX('[1]Pt1-AvionicsComponentCosts'!$A:$B,MATCH(B101,'[1]Pt1-AvionicsComponentCosts'!$A:$A,0),2)","v":"Freighter"},"Boeing",1,"Boeing 777X","Boeing 777XF: 777-9","777XF: 777-9","777XF: 777-9",{"$f":"MATCH(\"*\"&F101&\"*\",Sheet1!C:C,0)","v":{"$error":"#N/A"}},{"$f":"MATCH(\"*\"&H101&\"*\",Sheet1!C:C,0)","v":{"$error":"#N/A"}},{"$f":"MATCH(\"*\"&I101&\"*\",Sheet1!B:B,0)","v":{"$error":"#N/A"}},442.2,null,"https://www.statista.com/statistics/273941/prices-of-boeing-aircraft-by-type/",{"$f":"INDEX('[1]Pt1-AvionicsComponentCosts'!$A:$NE,MATCH(B101,'[1]Pt1-AvionicsComponentCosts'!$A:$A,0),MATCH(\"END MARKER\",'[1]Pt1-AvionicsComponentCosts'!$11:$11,0))","v":1768791},0.5,0.5,1.9999898236092266E-2]
[null,570,{"$f":"INDEX('[1]Pt1-AvionicsComponentCosts'!$A:$B,MATCH(B102,'[1]Pt1-AvionicsComponentCosts'!$A:$A,0),2)","v":"Freighter"},"Boeing",1,"Boeing 767","Boeing 767-300BCF","767-300BCF","767-300BCF",{"$f":"MATCH(\"*\"&F102&\"*\",Sheet1!C:C,0)","v":{"$error":"#N/A"}},{"$f":"MATCH(\"*\"&H102&\"*\",Sheet1!C:C,0)","v":{"$error":"#N/A"}},{"$f":"MATCH(\"*\"&I102&\"*\",Sheet1!B:B,0)","v":{"$error":"#N/A"}},null,null,null,{"$f":"INDEX('[1]Pt1-AvionicsComponentCosts'!$A:$NE,MATCH(B102,'[1]Pt1-AvionicsComponentCosts'!$A:$A,0),MATCH(\"END MARKER\",'[1]Pt1-AvionicsComponentCosts'!$11:$11,0))","v":1740030},0.5,0.5,""]
[null,569,{"$f":"INDEX('[1]Pt1-AvionicsComponentCosts'!$A:$B,MATCH(B103,'[1]Pt1-AvionicsComponentCosts'!$A:$A,0),2)","v":"Freighter"},"Boeing",1,"Boeing 767","Boeing 767-300F","767-300F","767-300F",{"$f":"MATCH(\"*\"&F103&\"*\",Sheet1!C:C,0)","v":{"$error":"#N/A"}},{"$f":"MATCH(\"*\"&H103&\"*\",Sheet1!C:C,0)","v":{"$error":"#N/A"}},{"$f":"MATCH(\"*\"&I103&\"*\",Sheet1!B:B,0)","v":{"$error":"#N/A"}},220.3,null,"https://www.statista.com/statistics/273941/prices-of-boeing-aircraft-by-type/",{"$f":"INDEX('[1]Pt1-AvionicsComponentCosts'!$A:$NE,MATCH(B103,'[1]Pt1-AvionicsComponentCosts'!$A:$A,0),MATCH(\"END MARKER\",'[1]Pt1-AvionicsComponentCosts'!$11:$11,0))","v":1740030},0.5,0.5,3.9492283250113482E-2]
[null,573,{"$f":"INDEX('[1]Pt1-AvionicsComponentCosts'!$A:$B,MATCH(B104,'[1]Pt1-AvionicsComponentCosts'!$A:$A,0),2)","v":"Freighter"},"Boeing",1,"Boeing 737","Boeing 737-300SF","737-300SF","737-300SF",{"$f":"MATCH(\"*\"&F104&\"*\",Sheet1!C:C,0)","v":{"$error":"#N/A"}},{"$f":"MATCH(\"*\"&H104&\"*\",Sheet1!C:C,0)","v":{"$error":"#N/A"}},{"$f":"MATCH(\"*\"&I104&\"*\",Sheet1!B:B,0)","v":{"$error":"#N/A"}},null,null,null,{"$f":"INDEX('[1]Pt1-AvionicsComponentCosts'!$A:$NE,MATCH(B104,'[1]Pt1-AvionicsComponentCosts'!$A:$A,0),MATCH(\"END MARKER\",'[1]Pt1-AvionicsComponentCosts'!$11:$11,0))","v":1164718},0.5,0.5,""]
[null,572,{"$f":"INDEX('[1]Pt1-AvionicsComponentCosts'!$A:$B,MATCH(B105,'[1]Pt1-AvionicsComponentCosts'!$A:$A,0),2)","v":"Freighter"},"Boeing",1,"Boeing 737","Boeing 737-400SF","737-400SF","737-400SF",{"$f":"MATCH(\"*\"&F105&\"*\",Sheet1!C:C,0)","v":{"$error":"#N/A"}},{"$f":"MATCH(\"*\"&H105&\"*\",Sheet1!C:C,0)","v":{"$error":"#N/A"}},{"$f":"MATCH(\"*\"&I105&\"*\",Sheet1!B:B,0)","v":{"$error":"#N/A"}},null,null,null,{"$f":"INDEX('[1]Pt1-AvionicsComponentCosts'!$A:$NE,MATCH(B105,'[1]Pt1-AvionicsComponentCosts'!$A:$A,0),MATCH(\"END MARKER\",'[1]Pt1-AvionicsComponentCosts'!$11:$11,0))","v":1164718},0.5,0.5,""]
[null,591,{"$f":"INDEX('[1]Pt1-AvionicsComponentCosts'!$A:$B,MATCH(B106,'[1]Pt1-AvionicsComponentCosts'!$A:$A,0),2)","v":"Freighter"},"Boeing",1,"Boeing 737","Boeing 737-700C","737-700C","737-700C",{"$f":"MATCH(\"*\"&F106&\"*\",Sheet1!C:C,0)","v":{"$error":"#N/A"}},{"$f":"MATCH(\"*\"&H106&\"*\",Sheet1!C:C,0)","v":{"$error":"#N/A"}},{"$f":"MATCH(\"*\"&I106&\"*\",Sheet1!B:B,0)","v":{"$error":"#N/A"}},89.1,null,"https://www.statista.com/statistics/273941/prices-of-boeing-aircraft-by-type/",{"$f":"INDEX('[1]Pt1-AvionicsComponentCosts'!$A:$NE,MATCH(B106,'[1]Pt1-AvionicsComponentCosts'!$A:$A,0),MATCH(\"END MARKER\",'[1]Pt1-AvionicsComponentCosts'!$11:$11,0))","v":1164718},0.5,0.5,6.536015712682379E-2]
[null,571,{"$f":"INDEX('[1]Pt1-AvionicsComponentCosts'!$A:$B,MATCH(B107,'[1]Pt1-AvionicsComponentCosts'!$A:$A,0),2)","v":"Freighter"},"Boeing",1,"Boeing 737NG","Boeing 737-700/-800CF","737-700/-800CF","737-700/-800CF",{"$f":"MATCH(\"*\"&F107&\"*\",Sheet1!C:C,0)","v":{"$error":"#N/A"}},{"$f":"MATCH(\"*\"&H107&\"*\",Sheet1!C:C,0)","v":{"$error":"#N/A"}},{"$f":"MATCH(\"*\"&I107&\"*\",Sheet1!B:B,0)","v":{"$error":"#N/A"}},89.1,null,"https://www.statista.com/statistics/273941/prices-of-boeing-aircraft-by-type/",{"$f":"INDEX('[1]Pt1-AvionicsComponentCosts'!$A:$NE,MATCH(B107,'[1]Pt1-AvionicsComponentCosts'!$A:$A,0),MATCH(\"END MARKER\",'[1]Pt1-AvionicsComponentCosts'!$11:$11,0))","v":1164718},0.5,0.5,6.536015712682379E-2]
[null,596,{"$f":"INDEX('[1]Pt1-AvionicsComponentCosts'!$A:$B,MATCH(B108,'[1]Pt1-AvionicsComponentCosts'!$A:$A,0),2)","v":"Freighter"},"Boeing",1,"Boeing 757","Boeing 757-200 PF/SF","757-200 PF/SF","757-200 PF/SF",{"$f":"MATCH(\"*\"&F108&\"*\",Sheet1!C:C,0)","v":{"$error":"#N/A"}},{"$f":"MATCH(\"*\"&H108&\"*\",Sheet1!C:C,0)","v":{"$error":"#N/A"}},{"$f":"MATCH(\"*\"&I108&\"*\",Sheet1!B:B,0)","v":{"$error":"#N/A"}},null,null,null,{"$f":"INDEX('[1]Pt1-AvionicsComponentCosts'!$A:$NE,MATCH(B108,'[1]Pt1-AvionicsComponentCosts'!$A:$A,0),MATCH(\"END MARKER\",'[1]Pt1-AvionicsComponentCosts'!$11:$11,0))","v":1164718},0.5,0.5,""]
[null,98,{"$f":"INDEX('[1]Pt1-AvionicsComponentCosts'!$A:$B,MATCH(B109,'[1]Pt1-AvionicsComponentCosts'!$A:$A,0),2)","v":"Helicopter"},"Boeing",1,"AH-64","Boeing AH-64 Apache","AH-64 Apache","AH-64 Apache",{"$f":"MATCH(\"*\"&F109&\"*\",Sheet1!C:C,0)","v":{"$error":"#N/A"}},{"$f":"MATCH(\"*\"&H109&\"*\",Sheet1!C:C,0)","v":{"$error":"#N/A"}},{"$f":"MATCH(\"*\"&I109&\"*\",Sheet1!B:B,0)","v":{"$error":"#N/A"}},null,null,null,{"$f":"INDEX('[1]Pt1-AvionicsComponentCosts'!$A:$NE,MATCH(B109,'[1]Pt1-AvionicsComponentCosts'!$A:$A,0),MATCH(\"END MARKER\",'[1]Pt1-AvionicsComponentCosts'!$11:$11,0))","v":1614184},0.99,0.99,""]
[null,99,{"$f":"INDEX('[1]Pt1-AvionicsComponentCosts'!$A:$B,MATCH(B110,'[1]Pt1-AvionicsComponentCosts'!$A:$A,0),2)","v":"Helicopter"},"Boeing",1,"AH-64","Boeing AH-64 Apache (reman)","AH-64 Apache (reman)","AH-64 Apache (reman)",{"$f":"MATCH(\"*\"&F110&\"*\",Sheet1!C:C,0)","v":{"$error":"#N/A"}},{"$f":"MATCH(\"*\"&H110&\"*\",Sheet1!C:C,0)","v":{"$error":"#N/A"}},{"$f":"MATCH(\"*\"&I110&\"*\",Sheet1!B:B,0)","v":{"$error":"#N/A"}},null,null,null,{"$f":"INDEX('[1]Pt1-AvionicsComponentCosts'!$A:$NE,MATCH(B110,'[1]Pt1-AvionicsComponentCosts'!$A:$A,0),MATCH(\"END MARKER\",'[1]Pt1-AvionicsComponentCosts'!$11:$11,0))","v":1614184},0.99,0.99,""]
[null,100,{"$f":"INDEX('[1]Pt1-AvionicsComponentCosts'!$A:$B,MATCH(B111,'[1]Pt1-AvionicsComponentCosts'!$A:$A,0),2)","v":"Helicopter"},"Boeing",1,"CH-47","Boeing CH-47 Chinook","CH-47 Chinook","CH-47 Chinook",{"$f":"MATCH(\"*\"&F111&\"*\",Sheet1!C:C,0)","v":{"$error":"#N/A"}},{"$f":"MATCH(\"*\"&H111&\"*\",Sheet1!C:C,0)","v":{"$error":"#N/A"}},{"$f":"MATCH(\"*\"&I111&\"*\",Sheet1!B:B,0)","v":{"$error":"#N/A"}},null,null,null,{"$f":"INDEX('[1]Pt1-AvionicsComponentCosts'!$A:$NE,MATCH(B111,'[1]Pt1-AvionicsComponentCosts'!$A:$A,0),MATCH(\"END MARKER\",'[1]Pt1-AvionicsComponentCosts'!$11:$11,0))","v":1611862},0.99,0.99,""]
[null,101,{"$f":"INDEX('[1]Pt1-AvionicsComponentCosts'!$A:$B,MATCH(B112,'[1]Pt1-AvionicsComponentCosts'!$A:$A,0),2)","v":"Helicopter"},"Boeing",1,"CH-47","Boeing CH-47 Chinook (reman)","CH-47 Chinook (reman)","CH-47 Chinook (reman)",{"$f":"MATCH(\"*\"&F112&\"*\",Sheet1!C:C,0)","v":{"$error":"#N/A"}},{"$f":"MATCH(\"*\"&H112&\"*\",Sheet1!C:C,0)","v":{"$error":"#N/A"}},{"$f":"MATCH(\"*\"&I112&\"*\",Sheet1!B:B,0)","v":{"$error":"#N/A"}},null,null,null,{"$f":"INDEX('[1]Pt1-AvionicsComponentCosts'!$A:$NE,MATCH(B112,'[1]Pt1-AvionicsComponentCosts'!$A:$A,0),MATCH(\"END MARKER\",'[1]Pt1-AvionicsComponentCosts'!$11:$11,0))","v":1611862},0.99,0.99,""]
[null,299,{"$f":"INDEX('[1]Pt1-AvionicsComponentCosts'!$A:$B,MATCH(B113,'[1]Pt1-AvionicsComponentCosts'!$A:$A,0),2)","v":"Large Commercial Aircraft"},"Boeing",1,"Boeing 717","Boeing 717","717","717",{"$f":"MATCH(\"*\"&F113&\"*\",Sheet1!C:C,0)","v":{"$error":"#N/A"}},{"$f":"MATCH(\"*\"&H113&\"*\",Sheet1!C:C,0)","v":{"$error":"#N/A"}},{"$f":"MATCH(\"*\"&I113&\"*\",Sheet1!B:B,0)","v":{"$error":"#N/A"}},null,null,null,{"$f":"INDEX('[1]Pt1-AvionicsComponentCosts'!$A:$NE,MATCH(B113,'[1]Pt1-AvionicsComponentCosts'!$A:$A,0),MATCH(\"END MARKER\",'[1]Pt1-AvionicsComponentCosts'!$11:$11,0))","v":1178752},{"$f":"50%","v":0.5},{"$f":"50%","v":0.5},""]
[null,534,{"$f":"INDEX('[1]Pt1-AvionicsComponentCosts'!$A:$B,MATCH(B114,'[1]Pt1-AvionicsComponentCosts'!$A:$A,0),2)","v":"Large Commercial Aircraft"},"Boeing",1,"Boeing 737 Classic","Boeing 737 Classic: 737-300",{"$f":"TRIM(SUBSTITUTE(G114,D114,\"\"))","v":"737 Classic: 737-300"},"737-300",{"$f":"MATCH(\"*\"&F114&\"*\",Sheet1!C:C,0)","v":{"$error":"#N/A"}},{"$f":"MATCH(\"*\"&H114&\"*\",Sheet1!C:C,0)","v":{"$error":"#N/A"}},{"$f":"MATCH(\"*\"&I114&\"*\",Sheet1!B:B,0)","v":{"$error":"#N/A"}},null,"OOP",null,{"$f":"INDEX('[1]Pt1-AvionicsComponentCosts'!$A:$NE,MATCH(B114,'[1]Pt1-AvionicsComponentCosts'!$A:$A,0),MATCH(\"END MARKER\",'[1]Pt1-AvionicsComponentCosts'!$11:$11,0))","v":1212232},{"$f":"50%","v":0.5},{"$f":"50%","v":0.5},""]
[null,535,{"$f":"INDEX('[1]Pt1-AvionicsComponentCosts'!$A:$B,MATCH(B115,'[1]Pt1-AvionicsComponentCosts'!$A:$A,0),2)","v":"Large Commercial Aircraft"},"Boeing",1,"Boeing 737 Classic","Boeing 737 Classic: 737-400","737 Classic: 737-400","737-400",{"$f":"MATCH(\"*\"&F115&\"*\",Sheet1!C:C,0)","v":{"$error":"#N/A"}},{"$f":"MATCH(\"*\"&H115&\"*\",Sheet1!C:C,0)","v":{"$error":"#N/A"}},{"$f":"MATCH(\"*\"&I115&\"*\",Sheet1!B:B,0)","v":{"$error":"#N/A"}},null,"OOP",null,{"$f":"INDEX('[1]Pt1-AvionicsComponentCosts'!$A:$NE,MATCH(B115,'[1]Pt1-AvionicsComponentCosts'!$A:$A,0),MATCH(\"END MARKER\",'[1]Pt1-AvionicsComponentCosts'!$11:$11,0))","v":1212232},{"$f":"50%","v":0.5},{"$f":"50%","v":0.5},""]
[null,536,{"$f":"INDEX('[1]Pt1-AvionicsComponentCosts'!$A:$B,MATCH(B116,'[1]Pt1-AvionicsComponentCosts'!$A:$A,0),2)","v":"Large Commercial Aircraft"},"Boeing",1,"Boeing 737 Classic","Boeing 737 Classic: 737-500","737 Classic: 737-500","737-500",{"$f":"MATCH(\"*\"&F116&\"*\",Sheet1!C:C,0)","v":{"$error":"#N/A"}},{"$f":"MATCH(\"*\"&H116&\"*\",Sheet1!C:C,0)","v":{"$error":"#N/A"}},{"$f":"MATCH(\"*\"&I116&\"*\",Sheet1!B:B,0)","v":{"$error":"#N/A"}},null,"OOP",null,{"$f":"INDEX('[1]Pt1-AvionicsComponentCosts'!$A:$NE,MATCH(B116,'[1]Pt1-AvionicsComponentCosts'!$A:$A,0),MATCH(\"END MARKER\",'[1]Pt1-AvionicsComponentCosts'!$11:$11,0))","v":1212232},{"$f":"50%","v":0.5},{"$f":"50%","v":0.5},""]
[null,309,{"$f":"INDEX('[1]Pt1-AvionicsComponentCosts'!$A:$B,MATCH(B117,'[1]Pt1-AvionicsComponentCosts'!$A:$A,0),2)","v":"Large Commercial Aircraft"},"Boeing",1,"Boeing 737MAX","Boeing 737 MAX: 737 MAX 10","737 MAX: 737 MAX 10","737 MAX 10",{"$f":"MATCH(\"*\"&F117&\"*\",Sheet1!C:C,0)","v":{"$error":"#N/A"}},{"$f":"MATCH(\"*\"&H117&\"*\",Sheet1!C:C,0)","v":{"$error":"#N/A"}},{"$f":"MATCH(\"*\"&I117&\"*\",Sheet1!B:B,0)","v":{"$error":"#N/A"}},134.9,null,"https://www.statista.com/statistics/273941/prices-of-boeing-aircraft-by-type/",{"$f":"INDEX('[1]Pt1-AvionicsComponentCosts'!$A:$NE,MATCH(B117,'[1]Pt1-AvionicsComponentCosts'!$A:$A,0),MATCH(\"END MARKER\",'[1]Pt1-AvionicsComponentCosts'!$11:$11,0))","v":1212232},{"$f":"50%","v":0.5},{"$f":"50%","v":0.5},4.4930763528539662E-2]
[null,195,{"$f":"INDEX('[1]Pt1-AvionicsComponentCosts'!$A:$B,MATCH(B118,'[1]Pt1-AvionicsComponentCosts'!$A:$A,0),2)","v":"Large Commercial Aircraft"},"Boeing",1,"Boeing 737MAX","Boeing 737 MAX: 737 MAX 7","737 MAX: 737 MAX 7","737-MAX 7",{"$f":"MATCH(\"*\"&F118&\"*\",Sheet1!C:C,0)","v":{"$error":"#N/A"}},{"$f":"MATCH(\"*\"&H118&\"*\",Sheet1!C:C,0)","v":{"$error":"#N/A"}},{"$f":"MATCH(\"*\"&I118&\"*\",Sheet1!B:B,0)","v":2},{"$f":"INDEX(Sheet1!$A:$K,MATCH($I118,Sheet1!$B:$B,0),MATCH(M$1,Sheet1!$A$1:$K$1,0))","v":99.7},null,{"$f":"INDEX(Sheet1!$A:$K,MATCH($I118,Sheet1!$B:$B,0),MATCH(O$1,Sheet1!$A$1:$K$1,0))","v":"http://www.axonaviation.com/commercial-aircraft/aircraft-data/aircraft-pricing"},{"$f":"INDEX('[1]Pt1-AvionicsComponentCosts'!$A:$NE,MATCH(B118,'[1]Pt1-AvionicsComponentCosts'!$A:$A,0),MATCH(\"END MARKER\",'[1]Pt1-AvionicsComponentCosts'!$11:$11,0))","v":1212232},{"$f":"50%","v":0.5},{"$f":"50%","v":0.5},6.0793981945837509E-2]
[null,196,{"$f":"INDEX('[1]Pt1-AvionicsComponentCosts'!$A:$B,MATCH(B119,'[1]Pt1-AvionicsComponentCosts'!$A:$A,0),2)","v":"Large Commercial Aircraft"},"Boeing",1,"Boeing 737MAX","Boeing 737 MAX: 737 MAX 8","737 MAX: 737 MAX 8","737 MAX 8",{"$f":"MATCH(\"*\"&F119&\"*\",Sheet1!C:C,0)","v":{"$error":"#N/A"}},{"$f":"MATCH(\"*\"&H119&\"*\",Sheet1!C:C,0)","v":{"$error":"#N/A"}},{"$f":"MATCH(\"*\"&I119&\"*\",Sheet1!B:B,0)","v":{"$error":"#N/A"}},121.6,null,"https://www.statista.com/statistics/273941/prices-of-boeing-aircraft-by-type/",{"$f":"INDEX('[1]Pt1-AvionicsComponentCosts'!$A:$NE,MATCH(B119,'[1]Pt1-AvionicsComponentCosts'!$A:$A,0),MATCH(\"END MARKER\",'[1]Pt1-AvionicsComponentCosts'!$11:$11,0))","v":1212232},{"$f":"50%","v":0.5},{"$f":"50%","v":0.5},4.9845065789473682E-2]
[null,197,{"$f":"INDEX('[1]Pt1-AvionicsComponentCosts'!$A:$B,MATCH(B120,'[1]Pt1-AvionicsComponentCosts'!$A:$A,0),2)","v":"Large Commercial Aircraft"},"Boeing",1,"Boeing 737MAX","Boeing 737 MAX: 737 MAX 9","737 MAX: 737 MAX 9","737 MAX 9",{"$f":"MATCH(\"*\"&F120&\"*\",Sheet1!C:C,0)","v":{"$error":"#N/A"}},{"$f":"MATCH(\"*\"&H120&\"*\",Sheet1!C:C,0)","v":{"$error":"#N/A"}},{"$f":"MATCH(\"*\"&I120&\"*\",Sheet1!B:B,0)","v":{"$error":"#N/A"}},128.9,null,"https://www.statista.com/statistics/273941/prices-of-boeing-aircraft-by-type/",{"$f":"INDEX('[1]Pt1-AvionicsComponentCosts'!$A:$NE,MATCH(B120,'[1]Pt1-AvionicsComponentCosts'!$A:$A,0),MATCH(\"END MARKER\",'[1]Pt1-AvionicsComponentCosts'!$11:$11,0))","v":1212232},{"$f":"50%","v":0.5},{"$f":"50%","v":0.5},4.7022187742435995E-2]
[null,300,{"$f":"INDEX('[1]Pt1-AvionicsComponentCosts'!$A:$B,MATCH(B121,'[1]Pt1-AvionicsComponentCosts'!$A:$A,0),2)","v":"Large Commercial Aircraft"},"Boeing",1,"Boeing 737NG","Boeing 737-600","737-600","737-600",{"$f":"MATCH(\"*\"&F121&\"*\",Sheet1!C:C,0)","v":{"$error":"#N/A"}},{"$f":"MATCH(\"*\"&H121&\"*\",Sheet1!C:C,0)","v":{"$error":"#N/A"}},{"$f":"MATCH(\"*\"&I121&\"*\",Sheet1!B:B,0)","v":{"$error":"#N/A"}},null,null,null,{"$f":"INDEX('[1]Pt1-AvionicsComponentCosts'!$A:$NE,MATCH(B121,'[1]Pt1-AvionicsComponentCosts'!$A:$A,0),MATCH(\"END MARKER\",'[1]Pt1-AvionicsComponentCosts'!$11:$11,0))","v":1212232},{"$f":"50%","v":0.5},{"$f":"50%","v":0.5},""]
[null,192,{"$f":"INDEX('[1]Pt1-AvionicsComponentCosts'!$A:$B,MATCH(B122,'[1]Pt1-AvionicsComponentCosts'!$A:$A,0),2)","v":"Large Commercial Aircraft"},"Boeing",1,"Boeing 737NG","Boeing 737-700","737-700","737-700",{"$f":"MATCH(\"*\"&F122&\"*\",Sheet1!C:C,0)","v":{"$error":"#N/A"}},{"$f":"MATCH(\"*\"&H122&\"*\",Sheet1!C:C,0)","v":{"$error":"#N/A"}},{"$f":"MATCH(\"*\"&I122&\"*\",Sheet1!B:B,0)","v":20},{"$f":"INDEX(Sheet1!$A:$K,MATCH($I122,Sheet1!$B:$B,0),MATCH(M$1,Sheet1!$A$1:$K$1,0))","v":89.1},null,{"$f":"INDEX(Sheet1!$A:$K,MATCH($I122,Sheet1!$B:$B,0),MATCH(O$1,Sheet1!$A$1:$K$1,0))","v":"http://www.axonaviation.com/commercial-aircraft/aircraft-data/aircraft-pricing"},{"$f":"INDEX('[1]Pt1-AvionicsComponentCosts'!$A:$NE,MATCH(B122,'[1]Pt1-AvionicsComponentCosts'!$A:$A,0),MATCH(\"END MARKER\",'[1]Pt1-AvionicsComponentCosts'!$11:$11,0))","v":1212232},{"$f":"50%","v":0.5},{"$f":"50%","v":0.5},6.8026487093153759E-2]
[null,193,{"$f":"INDEX('[1]Pt1-AvionicsComponentCosts'!$A:$B,MATCH(B123,'[1]Pt1-AvionicsComponentCosts'!$A:$A,0),2)","v":"Large Commercial Aircraft"},"Boeing",1,"Boeing 737NG","Boeing 737-800","737-800","737-800",{"$f":"MATCH(\"*\"&F123&\"*\",Sheet1!C:C,0)","v":{"$error":"#N/A"}},{"$f":"MATCH(\"*\"&H123&\"*\",Sheet1!C:C,0)","v":{"$error":"#N/A"}},{"$f":"MATCH(\"*\"&I123&\"*\",Sheet1!B:B,0)","v":21},{"$f":"INDEX(Sheet1!$A:$K,MATCH($I123,Sheet1!$B:$B,0),MATCH(M$1,Sheet1!$A$1:$K$1,0))","v":106.1},null,{"$f":"INDEX(Sheet1!$A:$K,MATCH($I123,Sheet1!$B:$B,0),MATCH(O$1,Sheet1!$A$1:$K$1,0))","v":"http://www.axonaviation.com/commercial-aircraft/aircraft-data/aircraft-pricing"},{"$f":"INDEX('[1]Pt1-AvionicsComponentCosts'!$A:$NE,MATCH(B123,'[1]Pt1-AvionicsComponentCosts'!$A:$A,0),MATCH(\"END MARKER\",'[1]Pt1-AvionicsComponentCosts'!$11:$11,0))","v":1212232},{"$f":"50%","v":0.5},{"$f":"50%","v":0.5},5.7126861451460884E-2]
[null,194,{"$f":"INDEX('[1]Pt1-AvionicsComponentCosts'!$A:$B,MATCH(B124,'[1]Pt1-AvionicsComponentCosts'!$A:$A,0),2)","v":"Large Commercial Aircraft"},"Boeing",1,"Boeing 737NG","Boeing 737-900","737-900","737-900",{"$f":"MATCH(\"*\"&F124&\"*\",Sheet1!C:C,0)","v":{"$error":"#N/A"}},{"$f":"MATCH(\"*\"&H124&\"*\",Sheet1!C:C,0)","v":{"$error":"#N/A"}},{"$f":"MATCH(\"*\"&I124&\"*\",Sheet1!B:B,0)","v":22},112.6,null,"https://www.statista.com/statistics/273941/prices-of-boeing-aircraft-by-type/",{"$f":"INDEX('[1]Pt1-AvionicsComponentCosts'!$A:$NE,MATCH(B124,'[1]Pt1-AvionicsComponentCosts'!$A:$A,0),MATCH(\"END MARKER\",'[1]Pt1-AvionicsComponentCosts'!$11:$11,0))","v":1212232},{"$f":"50%","v":0.5},{"$f":"50%","v":0.5},5.38291296625222E-2]
[null,522,{"$f":"INDEX('[1]Pt1-AvionicsComponentCosts'!$A:$B,MATCH(B125,'[1]Pt1-AvionicsComponentCosts'!$A:$A,0),2)","v":"Large Commercial Aircraft"},"Boeing",1,"Boeing 757","Boeing 757","757","757",{"$f":"MATCH(\"*\"&F125&\"*\",Sheet1!C:C,0)","v":{"$error":"#N/A"}},{"$f":"MATCH(\"*\"&H125&\"*\",Sheet1!C:C,0)","v":26},{"$f":"MATCH(\"*\"&I125&\"*\",Sheet1!B:B,0)","v":26},null,null,null,{"$f":"INDEX('[1]Pt1-AvionicsComponentCosts'!$A:$NE,MATCH(B125,'[1]Pt1-AvionicsComponentCosts'!$A:$A,0),MATCH(\"END MARKER\",'[1]Pt1-AvionicsComponentCosts'!$11:$11,0))","v":1212233},{"$f":"50%","v":0.5},{"$f":"50%","v":0.5},""]
[null,612,{"$f":"INDEX('[1]Pt1-AvionicsComponentCosts'!$A:$B,MATCH(B126,'[1]Pt1-AvionicsComponentCosts'!$A:$A,0),2)","v":"Large Commercial Aircraft"},"Boeing",1,"Boeing New Single Aisle (NSA)","Boeing New Single Aisle (NSA)","New Single Aisle (NSA)","New Single Aisle (NSA)",{"$f":"MATCH(\"*\"&F126&\"*\",Sheet1!C:C,0)","v":{"$error":"#N/A"}},{"$f":"MATCH(\"*\"&H126&\"*\",Sheet1!C:C,0)","v":{"$error":"#N/A"}},{"$f":"MATCH(\"*\"&I126&\"*\",Sheet1!B:B,0)","v":{"$error":"#N/A"}},null,null,null,{"$f":"INDEX('[1]Pt1-AvionicsComponentCosts'!$A:$NE,MATCH(B126,'[1]Pt1-AvionicsComponentCosts'!$A:$A,0),MATCH(\"END MARKER\",'[1]Pt1-AvionicsComponentCosts'!$11:$11,0))","v":1389709},{"$f":"50%","v":0.5},{"$f":"50%","v":0.5},""]
[null,12,{"$f":"INDEX('[1]Pt1-AvionicsComponentCosts'!$A:$B,MATCH(B127,'[1]Pt1-AvionicsComponentCosts'!$A:$A,0),2)","v":"Large Commercial Aircraft"},"Boeing",1,"Boeing 767","Boeing 767","767","767",{"$f":"MATCH(\"*\"&F127&\"*\",Sheet1!C:C,0)","v":{"$error":"#N/A"}},{"$f":"MATCH(\"*\"&H127&\"*\",Sheet1!C:C,0)","v":28},{"$f":"MATCH(\"*\"&I127&\"*\",Sheet1!B:B,0)","v":28},null,null,null,{"$f":"INDEX('[1]Pt1-AvionicsComponentCosts'!$A:$NE,MATCH(B127,'[1]Pt1-AvionicsComponentCosts'!$A:$A,0),MATCH(\"END MARKER\",'[1]Pt1-AvionicsComponentCosts'!$11:$11,0))","v":1737367},{"$f":"50%","v":0.5},{"$f":"50%","v":0.5},""]
[null,539,{"$f":"INDEX('[1]Pt1-AvionicsComponentCosts'!$A:$B,MATCH(B128,'[1]Pt1-AvionicsComponentCosts'!$A:$A,0),2)","v":"Large Commercial Aircraft"},"Boeing",1,"Boeing 777","Boeing 777: 777-200ER","777: 777-200ER","777-200ER",{"$f":"MATCH(\"*\"&F128&\"*\",Sheet1!C:C,0)","v":{"$error":"#N/A"}},{"$f":"MATCH(\"*\"&H128&\"*\",Sheet1!C:C,0)","v":{"$error":"#N/A"}},{"$f":"MATCH(\"*\"&I128&\"*\",Sheet1!B:B,0)","v":30},{"$f":"INDEX(Sheet1!$A:$K,MATCH($I128,Sheet1!$B:$B,0),MATCH(M$1,Sheet1!$A$1:$K$1,0))","v":306.60000000000002},null,{"$f":"INDEX(Sheet1!$A:$K,MATCH($I128,Sheet1!$B:$B,0),MATCH(O$1,Sheet1!$A$1:$K$1,0))","v":"http://www.axonaviation.com/commercial-aircraft/aircraft-data/aircraft-pricing"},{"$f":"INDEX('[1]Pt1-AvionicsComponentCosts'!$A:$NE,MATCH(B128,'[1]Pt1-AvionicsComponentCosts'!$A:$A,0),MATCH(\"END MARKER\",'[1]Pt1-AvionicsComponentCosts'!$11:$11,0))","v":1779536},{"$f":"50%","v":0.5},{"$f":"50%","v":0.5},2.9020482713633396E-2]
[null,201,{"$f":"INDEX('[1]Pt1-AvionicsComponentCosts'!$A:$B,MATCH(B129,'[1]Pt1-AvionicsComponentCosts'!$A:$A,0),2)","v":"Large Commercial Aircraft"},"Boeing",1,"Boeing 777","Boeing 777: 777-200LR","777: 777-200LR","777-200LR",{"$f":"MATCH(\"*\"&F129&\"*\",Sheet1!C:C,0)","v":{"$error":"#N/A"}},{"$f":"MATCH(\"*\"&H129&\"*\",Sheet1!C:C,0)","v":{"$error":"#N/A"}},{"$f":"MATCH(\"*\"&I129&\"*\",Sheet1!B:B,0)","v":31},{"$f":"INDEX(Sheet1!$A:$K,MATCH($I129,Sheet1!$B:$B,0),MATCH(M$1,Sheet1!$A$1:$K$1,0))","v":346.9},null,{"$f":"INDEX(Sheet1!$A:$K,MATCH($I129,Sheet1!$B:$B,0),MATCH(O$1,Sheet1!$A$1:$K$1,0))","v":"http://www.axonaviation.com/commercial-aircraft/aircraft-data/aircraft-pricing"},{"$f":"INDEX('[1]Pt1-AvionicsComponentCosts'!$A:$NE,MATCH(B129,'[1]Pt1-AvionicsComponentCosts'!$A:$A,0),MATCH(\"END MARKER\",'[1]Pt1-AvionicsComponentCosts'!$11:$11,0))","v":2297363},{"$f":"50%","v":0.5},{"$f":"50%","v":0.5},3.3112755837417122E-2]
[null,303,{"$f":"INDEX('[1]Pt1-AvionicsComponentCosts'!$A:$B,MATCH(B130,'[1]Pt1-AvionicsComponentCosts'!$A:$A,0),2)","v":"Large Commercial Aircraft"},"Boeing",1,"Boeing 777","Boeing 777: 777-300","777: 777-300","777-300",{"$f":"MATCH(\"*\"&F130&\"*\",Sheet1!C:C,0)","v":{"$error":"#N/A"}},{"$f":"MATCH(\"*\"&H130&\"*\",Sheet1!C:C,0)","v":{"$error":"#N/A"}},{"$f":"MATCH(\"*\"&I130&\"*\",Sheet1!B:B,0)","v":32},217.9,null,"https://www.statista.com/statistics/273941/prices-of-boeing-aircraft-by-type/",{"$f":"INDEX('[1]Pt1-AvionicsComponentCosts'!$A:$NE,MATCH(B130,'[1]Pt1-AvionicsComponentCosts'!$A:$A,0),MATCH(\"END MARKER\",'[1]Pt1-AvionicsComponentCosts'!$11:$11,0))","v":1779536},{"$f":"50%","v":0.5},{"$f":"50%","v":0.5},4.0833776961909131E-2]
[null,202,{"$f":"INDEX('[1]Pt1-AvionicsComponentCosts'!$A:$B,MATCH(B131,'[1]Pt1-AvionicsComponentCosts'!$A:$A,0),2)","v":"Large Commercial Aircraft"},"Boeing",1,"Boeing 777","Boeing 777: 777-300ER",{"$f":"TRIM(SUBSTITUTE(G131,D131,\"\"))","v":"777: 777-300ER"},{"$f":"TRIM(SUBSTITUTE(SUBSTITUTE(SUBSTITUTE(SUBSTITUTE(SUBSTITUTE(H131,\"Family\",\"\"),\"737 Classic:\",\"\"),\"737 MAX:\",\"\"),\"787 Dreamliner:\",\"\"),\"777:\",\"\"))","v":"777-300ER"},{"$f":"MATCH(\"*\"&F131&\"*\",Sheet1!C:C,0)","v":{"$error":"#N/A"}},{"$f":"MATCH(\"*\"&H131&\"*\",Sheet1!C:C,0)","v":{"$error":"#N/A"}},{"$f":"MATCH(\"*\"&I131&\"*\",Sheet1!B:B,0)","v":32},{"$f":"INDEX(Sheet1!$A:$K,MATCH($I131,Sheet1!$B:$B,0),MATCH(M$1,Sheet1!$A$1:$K$1,0))","v":375.5},null,{"$f":"INDEX(Sheet1!$A:$K,MATCH($I131,Sheet1!$B:$B,0),MATCH(O$1,Sheet1!$A$1:$K$1,0))","v":"http://www.axonaviation.com/commercial-aircraft/aircraft-data/aircraft-pricing"},{"$f":"INDEX('[1]Pt1-AvionicsComponentCosts'!$A:$NE,MATCH(B131,'[1]Pt1-AvionicsComponentCosts'!$A:$A,0),MATCH(\"END MARKER\",'[1]Pt1-AvionicsComponentCosts'!$11:$11,0))","v":2297363},{"$f":"50%","v":0.5},{"$f":"50%","v":0.5},{"$f":"IFERROR(P131/(M131*100000)*R131,\"\")","v":3.0590719041278296E-2}]
[null,203,{"$f":"INDEX('[1]Pt1-AvionicsComponentCosts'!$A:$B,MATCH(B132,'[1]Pt1-AvionicsComponentCosts'!$A:$A,0),2)","v":"Large Commercial Aircraft"},"Boeing",1,"Boeing 777X","Boeing 777X: 777-8","777X: 777-8","777X: 777-8",{"$f":"MATCH(\"*\"&F132&\"*\",Sheet1!C:C,0)","v":{"$error":"#N/A"}},{"$f":"MATCH(\"*\"&H132&\"*\",Sheet1!C:C,0)","v":{"$error":"#N/A"}},{"$f":"MATCH(\"*\"&I132&\"*\",Sheet1!B:B,0)","v":{"$error":"#N/A"}},410.2,null,"https://www.statista.com/statistics/273941/prices-of-boeing-aircraft-by-type/",{"$f":"INDEX('[1]Pt1-AvionicsComponentCosts'!$A:$NE,MATCH(B132,'[1]Pt1-AvionicsComponentCosts'!$A:$A,0),MATCH(\"END MARKER\",'[1]Pt1-AvionicsComponentCosts'!$11:$11,0))","v":2283877},{"$f":"50%","v":0.5},{"$f":"50%","v":0.5},2.7838578742077034E-2]
[null,204,{"$f":"INDEX('[1]Pt1-AvionicsComponentCosts'!$A:$B,MATCH(B133,'[1]Pt1-AvionicsComponentCosts'!$A:$A,0),2)","v":"Large Commercial Aircraft"},"Boeing",1,"Boeing 777X","Boeing 777X: 777-9","777X: 777-9","777X: 777-9",{"$f":"MATCH(\"*\"&F133&\"*\",Sheet1!C:C,0)","v":{"$error":"#N/A"}},{"$f":"MATCH(\"*\"&H133&\"*\",Sheet1!C:C,0)","v":{"$error":"#N/A"}},{"$f":"MATCH(\"*\"&I133&\"*\",Sheet1!B:B,0)","v":{"$error":"#N/A"}},442.2,null,"https://www.statista.com/statistics/273941/prices-of-boeing-aircraft-by-type/",{"$f":"INDEX('[1]Pt1-AvionicsComponentCosts'!$A:$NE,MATCH(B133,'[1]Pt1-AvionicsComponentCosts'!$A:$A,0),MATCH(\"END MARKER\",'[1]Pt1-AvionicsComponentCosts'!$11:$11,0))","v":2261035},{"$f":"50%","v":0.5},{"$f":"50%","v":0.5},2.5565750791497061E-2]
[null,200,{"$f":"INDEX('[1]Pt1-AvionicsComponentCosts'!$A:$B,MATCH(B134,'[1]Pt1-AvionicsComponentCosts'!$A:$A,0),2)","v":"Large Commercial Aircraft"},"Boeing",1,"Boeing 787","Boeing 787 Dreamliner: 787-10","787 Dreamliner: 787-10","787-10",{"$f":"MATCH(\"*\"&F134&\"*\",Sheet1!C:C,0)","v":{"$error":"#N/A"}},{"$f":"MATCH(\"*\"&H134&\"*\",Sheet1!C:C,0)","v":{"$error":"#N/A"}},{"$f":"MATCH(\"*\"&I134&\"*\",Sheet1!B:B,0)","v":36},{"$f":"INDEX(Sheet1!$A:$K,MATCH($I134,Sheet1!$B:$B,0),MATCH(M$1,Sheet1!$A$1:$K$1,0))","v":338.4},null,{"$f":"INDEX(Sheet1!$A:$K,MATCH($I134,Sheet1!$B:$B,0),MATCH(O$1,Sheet1!$A$1:$K$1,0))","v":"http://www.axonaviation.com/commercial-aircraft/aircraft-data/aircraft-pricing"},{"$f":"INDEX('[1]Pt1-AvionicsComponentCosts'!$A:$NE,MATCH(B134,'[1]Pt1-AvionicsComponentCosts'!$A:$A,0),MATCH(\"END MARKER\",'[1]Pt1-AvionicsComponentCosts'!$11:$11,0))","v":2326385},{"$f":"50%","v":0.5},{"$f":"50%","v":0.5},3.4373300827423167E-2]
[null,198,{"$f":"INDEX('[1]Pt1-AvionicsComponentCosts'!$A:$B,MATCH(B135,'[1]Pt1-AvionicsComponentCosts'!$A:$A,0),2)","v":"Large Commercial Aircraft"},"Boeing",1,"Boeing 787","Boeing 787 Dreamliner: 787-8","787 Dreamliner: 787-8","787-8",{"$f":"MATCH(\"*\"&F135&\"*\",Sheet1!C:C,0)","v":{"$error":"#N/A"}},{"$f":"MATCH(\"*\"&H135&\"*\",Sheet1!C:C,0)","v":{"$error":"#N/A"}},{"$f":"MATCH(\"*\"&I135&\"*\",Sheet1!B:B,0)","v":34},{"$f":"INDEX(Sheet1!$A:$K,MATCH($I135,Sheet1!$B:$B,0),MATCH(M$1,Sheet1!$A$1:$K$1,0))","v":248.3},null,{"$f":"INDEX(Sheet1!$A:$K,MATCH($I135,Sheet1!$B:$B,0),MATCH(O$1,Sheet1!$A$1:$K$1,0))","v":"http://www.axonaviation.com/commercial-aircraft/aircraft-data/aircraft-pricing"},{"$f":"INDEX('[1]Pt1-AvionicsComponentCosts'!$A:$NE,MATCH(B135,'[1]Pt1-AvionicsComponentCosts'!$A:$A,0),MATCH(\"END MARKER\",'[1]Pt1-AvionicsComponentCosts'!$11:$11,0))","v":2326385},{"$f":"50%","v":0.5},{"$f":"50%","v":0.5},4.6846254530809504E-2]
[null,199,{"$f":"INDEX('[1]Pt1-AvionicsComponentCosts'!$A:$B,MATCH(B136,'[1]Pt1-AvionicsComponentCosts'!$A:$A,0),2)","v":"Large Commercial Aircraft"},"Boeing",1,"Boeing 787","Boeing 787 Dreamliner: 787-9","787 Dreamliner: 787-9","787-9",{"$f":"MATCH(\"*\"&F136&\"*\",Sheet1!C:C,0)","v":{"$error":"#N/A"}},{"$f":"MATCH(\"*\"&H136&\"*\",Sheet1!C:C,0)","v":{"$error":"#N/A"}},{"$f":"MATCH(\"*\"&I136&\"*\",Sheet1!B:B,0)","v":35},{"$f":"INDEX(Sheet1!$A:$K,MATCH($I136,Sheet1!$B:$B,0),MATCH(M$1,Sheet1!$A$1:$K$1,0))","v":292.5},null,{"$f":"INDEX(Sheet1!$A:$K,MATCH($I136,Sheet1!$B:$B,0),MATCH(O$1,Sheet1!$A$1:$K$1,0))","v":"http://www.axonaviation.com/commercial-aircraft/aircraft-data/aircraft-pricing"},{"$f":"INDEX('[1]Pt1-AvionicsComponentCosts'!$A:$NE,MATCH(B136,'[1]Pt1-AvionicsComponentCosts'!$A:$A,0),MATCH(\"END MARKER\",'[1]Pt1-AvionicsComponentCosts'!$11:$11,0))","v":2326385},{"$f":"50%","v":0.5},{"$f":"50%","v":0.5},3.9767264957264958E-2]
[null,530,{"$f":"INDEX('[1]Pt1-AvionicsComponentCosts'!$A:$B,MATCH(B137,'[1]Pt1-AvionicsComponentCosts'!$A:$A,0),2)","v":"Large Commercial Aircraft"},"Boeing",1,"Boeing 747","Boeing 747-400","747-400","747-400",{"$f":"MATCH(\"*\"&F137&\"*\",Sheet1!C:C,0)","v":{"$error":"#N/A"}},{"$f":"MATCH(\"*\"&H137&\"*\",Sheet1!C:C,0)","v":{"$error":"#N/A"}},{"$f":"MATCH(\"*\"&I137&\"*\",Sheet1!B:B,0)","v":23},{"$f":"INDEX(Sheet1!$A:$K,MATCH($I137,Sheet1!$B:$B,0),MATCH(M$1,Sheet1!$A$1:$K$1,0))","v":0},"OOP",{"$f":"INDEX(Sheet1!$A:$K,MATCH($I137,Sheet1!$B:$B,0),MATCH(O$1,Sheet1!$A$1:$K$1,0))","v":"http://www.axonaviation.com/commercial-aircraft/aircraft-data/aircraft-pricing"},{"$f":"INDEX('[1]Pt1-AvionicsComponentCosts'!$A:$NE,MATCH(B137,'[1]Pt1-AvionicsComponentCosts'!$A:$A,0),MATCH(\"END MARKER\",'[1]Pt1-AvionicsComponentCosts'!$11:$11,0))","v":1844993},{"$f":"50%","v":0.5},{"$f":"50%","v":0.5},""]
[null,16,{"$f":"INDEX('[1]Pt1-AvionicsComponentCosts'!$A:$B,MATCH(B138,'[1]Pt1-AvionicsComponentCosts'!$A:$A,0),2)","v":"Large Commercial Aircraft"},"Boeing",1,"Boeing 747","Boeing 747-8I","747-8I","747-8I",{"$f":"MATCH(\"*\"&F138&\"*\",Sheet1!C:C,0)","v":{"$error":"#N/A"}},{"$f":"MATCH(\"*\"&H138&\"*\",Sheet1!C:C,0)","v":{"$error":"#N/A"}},{"$f":"MATCH(\"*\"&I138&\"*\",Sheet1!B:B,0)","v":25},{"$f":"INDEX(Sheet1!$A:$K,MATCH($I138,Sheet1!$B:$B,0),MATCH(M$1,Sheet1!$A$1:$K$1,0))","v":418.4},null,{"$f":"INDEX(Sheet1!$A:$K,MATCH($I138,Sheet1!$B:$B,0),MATCH(O$1,Sheet1!$A$1:$K$1,0))","v":"http://www.axonaviation.com/commercial-aircraft/aircraft-data/aircraft-pricing"},{"$f":"INDEX('[1]Pt1-AvionicsComponentCosts'!$A:$NE,MATCH(B138,'[1]Pt1-AvionicsComponentCosts'!$A:$A,0),MATCH(\"END MARKER\",'[1]Pt1-AvionicsComponentCosts'!$11:$11,0))","v":2432906},{"$f":"50%","v":0.5},{"$f":"50%","v":0.5},2.9073924474187381E-2]
[null,636,{"$f":"INDEX('[1]Pt1-AvionicsComponentCosts'!$A:$B,MATCH(B139,'[1]Pt1-AvionicsComponentCosts'!$A:$A,0),2)","v":"Military Transport / Special Mission"},"Boeing",1,"B-52 Stratofortress","Boeing B-52 Stratofortress","B-52 Stratofortress","B-52 Stratofortress",{"$f":"MATCH(\"*\"&F139&\"*\",Sheet1!C:C,0)","v":{"$error":"#N/A"}},{"$f":"MATCH(\"*\"&H139&\"*\",Sheet1!C:C,0)","v":{"$error":"#N/A"}},{"$f":"MATCH(\"*\"&I139&\"*\",Sheet1!B:B,0)","v":{"$error":"#N/A"}},null,null,null,{"$f":"INDEX('[1]Pt1-AvionicsComponentCosts'!$A:$NE,MATCH(B139,'[1]Pt1-AvionicsComponentCosts'!$A:$A,0),MATCH(\"END MARKER\",'[1]Pt1-AvionicsComponentCosts'!$11:$11,0))","v":2713300},1,1,""]
[null,676,{"$f":"INDEX('[1]Pt1-AvionicsComponentCosts'!$A:$B,MATCH(B140,'[1]Pt1-AvionicsComponentCosts'!$A:$A,0),2)","v":"Military Transport / Special Mission"},"Boeing",1,"B-52 Stratofortress","Boeing B-52 Stratofortress re-engine","B-52 Stratofortress re-engine","B-52 Stratofortress re-engine",{"$f":"MATCH(\"*\"&F140&\"*\",Sheet1!C:C,0)","v":{"$error":"#N/A"}},{"$f":"MATCH(\"*\"&H140&\"*\",Sheet1!C:C,0)","v":{"$error":"#N/A"}},{"$f":"MATCH(\"*\"&I140&\"*\",Sheet1!B:B,0)","v":{"$error":"#N/A"}},null,null,null,{"$f":"INDEX('[1]Pt1-AvionicsComponentCosts'!$A:$NE,MATCH(B140,'[1]Pt1-AvionicsComponentCosts'!$A:$A,0),MATCH(\"END MARKER\",'[1]Pt1-AvionicsComponentCosts'!$11:$11,0))","v":2713300},1,1,""]
[null,157,{"$f":"INDEX('[1]Pt1-AvionicsComponentCosts'!$A:$B,MATCH(B141,'[1]Pt1-AvionicsComponentCosts'!$A:$A,0),2)","v":"Military Transport / Special Mission"},"Boeing",1,"Boeing KC-46 Pegasus","Boeing KC-46 Pegasus","KC-46 Pegasus","KC-46 Pegasus",{"$f":"MATCH(\"*\"&F141&\"*\",Sheet1!C:C,0)","v":{"$error":"#N/A"}},{"$f":"MATCH(\"*\"&H141&\"*\",Sheet1!C:C,0)","v":{"$error":"#N/A"}},{"$f":"MATCH(\"*\"&I141&\"*\",Sheet1!B:B,0)","v":{"$error":"#N/A"}},220,null,"https://simpleflying.com/how-much-do-military-transport-aircraft-cost/",{"$f":"INDEX('[1]Pt1-AvionicsComponentCosts'!$A:$NE,MATCH(B141,'[1]Pt1-AvionicsComponentCosts'!$A:$A,0),MATCH(\"END MARKER\",'[1]Pt1-AvionicsComponentCosts'!$11:$11,0))","v":3107955},1,1,0.14127068181818181]
[null,156,{"$f":"INDEX('[1]Pt1-AvionicsComponentCosts'!$A:$B,MATCH(B142,'[1]Pt1-AvionicsComponentCosts'!$A:$A,0),2)","v":"Military Transport / Special Mission"},"Boeing",1,"Boeing P-8 Poseidon","Boeing P-8 Poseidon","P-8 Poseidon","P-8 Poseidon",{"$f":"MATCH(\"*\"&F142&\"*\",Sheet1!C:C,0)","v":{"$error":"#N/A"}},{"$f":"MATCH(\"*\"&H142&\"*\",Sheet1!C:C,0)","v":{"$error":"#N/A"}},{"$f":"MATCH(\"*\"&I142&\"*\",Sheet1!B:B,0)","v":{"$error":"#N/A"}},null,null,null,{"$f":"INDEX('[1]Pt1-AvionicsComponentCosts'!$A:$NE,MATCH(B142,'[1]Pt1-AvionicsComponentCosts'!$A:$A,0),MATCH(\"END MARKER\",'[1]Pt1-AvionicsComponentCosts'!$11:$11,0))","v":2713300},1,1,""]
[null,158,{"$f":"INDEX('[1]Pt1-AvionicsComponentCosts'!$A:$B,MATCH(B143,'[1]Pt1-AvionicsComponentCosts'!$A:$A,0),2)","v":"Military Transport / Special Mission"},"Boeing",1,"C-17","Boeing C-17 Globemaster III","C-17 Globemaster III","C-17 Globemaster III",{"$f":"MATCH(\"*\"&F143&\"*\",Sheet1!C:C,0)","v":{"$error":"#N/A"}},{"$f":"MATCH(\"*\"&H143&\"*\",Sheet1!C:C,0)","v":{"$error":"#N/A"}},{"$f":"MATCH(\"*\"&I143&\"*\",Sheet1!B:B,0)","v":{"$error":"#N/A"}},null,null,null,{"$f":"INDEX('[1]Pt1-AvionicsComponentCosts'!$A:$NE,MATCH(B143,'[1]Pt1-AvionicsComponentCosts'!$A:$A,0),MATCH(\"END MARKER\",'[1]Pt1-AvionicsComponentCosts'!$11:$11,0))","v":3098550},1,1,""]
[null,574,{"$f":"INDEX('[1]Pt1-AvionicsComponentCosts'!$A:$B,MATCH(B144,'[1]Pt1-AvionicsComponentCosts'!$A:$A,0),2)","v":"Military Transport / Special Mission"},"Boeing",1,"Boeing C-40 Clipper ","Boeing C-40 Clipper","C-40 Clipper","C-40 Clipper",{"$f":"MATCH(\"*\"&F144&\"*\",Sheet1!C:C,0)","v":{"$error":"#N/A"}},{"$f":"MATCH(\"*\"&H144&\"*\",Sheet1!C:C,0)","v":{"$error":"#N/A"}},{"$f":"MATCH(\"*\"&I144&\"*\",Sheet1!B:B,0)","v":{"$error":"#N/A"}},null,null,null,{"$f":"INDEX('[1]Pt1-AvionicsComponentCosts'!$A:$NE,MATCH(B144,'[1]Pt1-AvionicsComponentCosts'!$A:$A,0),MATCH(\"END MARKER\",'[1]Pt1-AvionicsComponentCosts'!$11:$11,0))","v":2713300},1,1,""]
[null,620,{"$f":"INDEX('[1]Pt1-AvionicsComponentCosts'!$A:$B,MATCH(B145,'[1]Pt1-AvionicsComponentCosts'!$A:$A,0),2)","v":"Military Transport / Special Mission"},"Boeing",1,"Boeing KC-135 Stratotanker","Boeing KC-135 Stratotanker","KC-135 Stratotanker","KC-135 Stratotanker",{"$f":"MATCH(\"*\"&F145&\"*\",Sheet1!C:C,0)","v":{"$error":"#N/A"}},{"$f":"MATCH(\"*\"&H145&\"*\",Sheet1!C:C,0)","v":{"$error":"#N/A"}},{"$f":"MATCH(\"*\"&I145&\"*\",Sheet1!B:B,0)","v":{"$error":"#N/A"}},null,null,null,{"$f":"INDEX('[1]Pt1-AvionicsComponentCosts'!$A:$NE,MATCH(B145,'[1]Pt1-AvionicsComponentCosts'!$A:$A,0),MATCH(\"END MARKER\",'[1]Pt1-AvionicsComponentCosts'!$11:$11,0))","v":3098550},1,1,""]
[null,582,{"$f":"INDEX('[1]Pt1-AvionicsComponentCosts'!$A:$B,MATCH(B146,'[1]Pt1-AvionicsComponentCosts'!$A:$A,0),2)","v":"Helicopter"},"Boeing/Leonardo",1,"MH139","Boeing/Leonardo MH139","MH139","MH139",{"$f":"MATCH(\"*\"&F146&\"*\",Sheet1!C:C,0)","v":{"$error":"#N/A"}},{"$f":"MATCH(\"*\"&H146&\"*\",Sheet1!C:C,0)","v":{"$error":"#N/A"}},{"$f":"MATCH(\"*\"&I146&\"*\",Sheet1!B:B,0)","v":{"$error":"#N/A"}},null,null,null,{"$f":"INDEX('[1]Pt1-AvionicsComponentCosts'!$A:$NE,MATCH(B146,'[1]Pt1-AvionicsComponentCosts'!$A:$A,0),MATCH(\"END MARKER\",'[1]Pt1-AvionicsComponentCosts'!$11:$11,0))","v":1267554},0.99,0.99,""]
[null,35,{"$f":"INDEX('[1]Pt1-AvionicsComponentCosts'!$A:$B,MATCH(B147,'[1]Pt1-AvionicsComponentCosts'!$A:$A,0),2)","v":"Business Jet"},"Bombardier",1,"Challenger 600 series","Bombardier Challenger 600 series","Challenger 600 series","Challenger 600 series",{"$f":"MATCH(\"*\"&F147&\"*\",Sheet1!C:C,0)","v":{"$error":"#N/A"}},{"$f":"MATCH(\"*\"&H147&\"*\",Sheet1!C:C,0)","v":{"$error":"#N/A"}},{"$f":"MATCH(\"*\"&I147&\"*\",Sheet1!B:B,0)","v":{"$error":"#N/A"}},{"$f":"INDEX('Bombardier Prices'!A:D,MATCH(I147,'Bombardier Prices'!D:D,0),2)","v":31.9},null,"https://www.wijet.com/bombardier-private-jet-price-list/#google_vignette",{"$f":"INDEX('[1]Pt1-AvionicsComponentCosts'!$A:$NE,MATCH(B147,'[1]Pt1-AvionicsComponentCosts'!$A:$A,0),MATCH(\"END MARKER\",'[1]Pt1-AvionicsComponentCosts'!$11:$11,0))","v":971537},0.75,0.75,0.22841778996865203]
[null,635,{"$f":"INDEX('[1]Pt1-AvionicsComponentCosts'!$A:$B,MATCH(B148,'[1]Pt1-AvionicsComponentCosts'!$A:$A,0),2)","v":"Business Jet"},"Bombardier",1,"Challenger 600 series","Bombardier Challenger 6XX series","Challenger 6XX series","Challenger 6XX series",{"$f":"MATCH(\"*\"&F148&\"*\",Sheet1!C:C,0)","v":{"$error":"#N/A"}},{"$f":"MATCH(\"*\"&H148&\"*\",Sheet1!C:C,0)","v":{"$error":"#N/A"}},{"$f":"MATCH(\"*\"&I148&\"*\",Sheet1!B:B,0)","v":{"$error":"#N/A"}},{"$f":"INDEX('Bombardier Prices'!A:D,MATCH(I148,'Bombardier Prices'!D:D,0),2)","v":31.9},null,"https://www.wijet.com/bombardier-private-jet-price-list/#google_vignette",{"$f":"INDEX('[1]Pt1-AvionicsComponentCosts'!$A:$NE,MATCH(B148,'[1]Pt1-AvionicsComponentCosts'!$A:$A,0),MATCH(\"END MARKER\",'[1]Pt1-AvionicsComponentCosts'!$11:$11,0))","v":981344},0.75,0.75,0.23072351097178684]
[null,72,{"$f":"INDEX('[1]Pt1-AvionicsComponentCosts'!$A:$B,MATCH(B149,'[1]Pt1-AvionicsComponentCosts'!$A:$A,0),2)","v":"Business Jet"},"Bombardier",1,"Challenger 850","Bombardier Challenger 850","Challenger 850","Challenger 850",{"$f":"MATCH(\"*\"&F149&\"*\",Sheet1!C:C,0)","v":{"$error":"#N/A"}},{"$f":"MATCH(\"*\"&H149&\"*\",Sheet1!C:C,0)","v":{"$error":"#N/A"}},{"$f":"MATCH(\"*\"&I149&\"*\",Sheet1!B:B,0)","v":{"$error":"#N/A"}},{"$f":"INDEX('Bombardier Prices'!A:D,MATCH(I149,'Bombardier Prices'!D:D,0),2)","v":39.9},null,"https://www.wijet.com/bombardier-private-jet-price-list/#google_vignette",{"$f":"INDEX('[1]Pt1-AvionicsComponentCosts'!$A:$NE,MATCH(B149,'[1]Pt1-AvionicsComponentCosts'!$A:$A,0),MATCH(\"END MARKER\",'[1]Pt1-AvionicsComponentCosts'!$11:$11,0))","v":971537},0.75,0.75,0.18261973684210525]
[null,38,{"$f":"INDEX('[1]Pt1-AvionicsComponentCosts'!$A:$B,MATCH(B150,'[1]Pt1-AvionicsComponentCosts'!$A:$A,0),2)","v":"Business Jet"},"Bombardier",1,"Global 7000","Bombardier Global 7500/8000","Global 7500/8000","Global 7500/8000",{"$f":"MATCH(\"*\"&F150&\"*\",Sheet1!C:C,0)","v":{"$error":"#N/A"}},{"$f":"MATCH(\"*\"&H150&\"*\",Sheet1!C:C,0)","v":{"$error":"#N/A"}},{"$f":"MATCH(\"*\"&I150&\"*\",Sheet1!B:B,0)","v":{"$error":"#N/A"}},80,null,"https://infogram.com/bca-table-2023-jets-ultra-long-range-1ho16vorwrqkx4n",{"$f":"INDEX('[1]Pt1-AvionicsComponentCosts'!$A:$NE,MATCH(B150,'[1]Pt1-AvionicsComponentCosts'!$A:$A,0),MATCH(\"END MARKER\",'[1]Pt1-AvionicsComponentCosts'!$11:$11,0))","v":1086106},0.75,0.75,0.1018224375]
[null,36,{"$f":"INDEX('[1]Pt1-AvionicsComponentCosts'!$A:$B,MATCH(B151,'[1]Pt1-AvionicsComponentCosts'!$A:$A,0),2)","v":"Business Jet"},"Bombardier",1,"Global Express - 5000/6000","Bombardier Global 5000","Global 5000","Global 5000",{"$f":"MATCH(\"*\"&F151&\"*\",Sheet1!C:C,0)","v":{"$error":"#N/A"}},{"$f":"MATCH(\"*\"&H151&\"*\",Sheet1!C:C,0)","v":{"$error":"#N/A"}},{"$f":"MATCH(\"*\"&I151&\"*\",Sheet1!B:B,0)","v":{"$error":"#N/A"}},{"$f":"INDEX('Bombardier Prices'!A:D,MATCH(I151,'Bombardier Prices'!D:D,0),2)","v":46},null,"https://www.wijet.com/bombardier-private-jet-price-list/#google_vignette",{"$f":"INDEX('[1]Pt1-AvionicsComponentCosts'!$A:$NE,MATCH(B151,'[1]Pt1-AvionicsComponentCosts'!$A:$A,0),MATCH(\"END MARKER\",'[1]Pt1-AvionicsComponentCosts'!$11:$11,0))","v":1086106},0.75,0.75,0.17708249999999998]
[null,576,{"$f":"INDEX('[1]Pt1-AvionicsComponentCosts'!$A:$B,MATCH(B152,'[1]Pt1-AvionicsComponentCosts'!$A:$A,0),2)","v":"Business Jet"},"Bombardier",1,"Global Express - 5000/6000","Bombardier Global 5500","Global 5500","Global 5500",{"$f":"MATCH(\"*\"&F152&\"*\",Sheet1!C:C,0)","v":{"$error":"#N/A"}},{"$f":"MATCH(\"*\"&H152&\"*\",Sheet1!C:C,0)","v":{"$error":"#N/A"}},{"$f":"MATCH(\"*\"&I152&\"*\",Sheet1!B:B,0)","v":{"$error":"#N/A"}},{"$f":"INDEX('Bombardier Prices'!A:D,MATCH(I152,'Bombardier Prices'!D:D,0),2)","v":46},null,"https://www.wijet.com/bombardier-private-jet-price-list/#google_vignette",{"$f":"INDEX('[1]Pt1-AvionicsComponentCosts'!$A:$NE,MATCH(B152,'[1]Pt1-AvionicsComponentCosts'!$A:$A,0),MATCH(\"END MARKER\",'[1]Pt1-AvionicsComponentCosts'!$11:$11,0))","v":1086106},0.75,0.75,0.17708249999999998]
[null,37,{"$f":"INDEX('[1]Pt1-AvionicsComponentCosts'!$A:$B,MATCH(B153,'[1]Pt1-AvionicsComponentCosts'!$A:$A,0),2)","v":"Business Jet"},"Bombardier",1,"Global Express - 5000/6000","Bombardier Global 6000","Global 6000","Global 6000",{"$f":"MATCH(\"*\"&F153&\"*\",Sheet1!C:C,0)","v":{"$error":"#N/A"}},{"$f":"MATCH(\"*\"&H153&\"*\",Sheet1!C:C,0)","v":{"$error":"#N/A"}},{"$f":"MATCH(\"*\"&I153&\"*\",Sheet1!B:B,0)","v":{"$error":"#N/A"}},{"$f":"INDEX('Bombardier Prices'!A:D,MATCH(I153,'Bombardier Prices'!D:D,0),2)","v":55.8},null,"https://www.wijet.com/bombardier-private-jet-price-list/#google_vignette",{"$f":"INDEX('[1]Pt1-AvionicsComponentCosts'!$A:$NE,MATCH(B153,'[1]Pt1-AvionicsComponentCosts'!$A:$A,0),MATCH(\"END MARKER\",'[1]Pt1-AvionicsComponentCosts'!$11:$11,0))","v":1086106},0.75,0.75,0.14598198924731184]
[null,577,{"$f":"INDEX('[1]Pt1-AvionicsComponentCosts'!$A:$B,MATCH(B154,'[1]Pt1-AvionicsComponentCosts'!$A:$A,0),2)","v":"Business Jet"},"Bombardier",1,"Global Express - 5000/6000","Bombardier Global 6500","Global 6500","Global 6500",{"$f":"MATCH(\"*\"&F154&\"*\",Sheet1!C:C,0)","v":{"$error":"#N/A"}},{"$f":"MATCH(\"*\"&H154&\"*\",Sheet1!C:C,0)","v":{"$error":"#N/A"}},{"$f":"MATCH(\"*\"&I154&\"*\",Sheet1!B:B,0)","v":{"$error":"#N/A"}},58,null,"https://infogram.com/bca-table-2023-jets-ultra-long-range-1ho16vorwrqkx4n",{"$f":"INDEX('[1]Pt1-AvionicsComponentCosts'!$A:$NE,MATCH(B154,'[1]Pt1-AvionicsComponentCosts'!$A:$A,0),MATCH(\"END MARKER\",'[1]Pt1-AvionicsComponentCosts'!$11:$11,0))","v":1086106},0.75,0.75,0.14044474137931034]
[null,34,{"$f":"INDEX('[1]Pt1-AvionicsComponentCosts'!$A:$B,MATCH(B155,'[1]Pt1-AvionicsComponentCosts'!$A:$A,0),2)","v":"Business Jet"},"Bombardier",1,"Bombardier Challenger 300/350","Bombardier Challenger 300/350","Challenger 300/350","Challenger 300/350",{"$f":"MATCH(\"*\"&F155&\"*\",Sheet1!C:C,0)","v":{"$error":"#N/A"}},{"$f":"MATCH(\"*\"&H155&\"*\",Sheet1!C:C,0)","v":{"$error":"#N/A"}},{"$f":"MATCH(\"*\"&I155&\"*\",Sheet1!B:B,0)","v":{"$error":"#N/A"}},{"$f":"INDEX('Bombardier Prices'!A:D,MATCH(I155,'Bombardier Prices'!D:D,0),2)","v":14},null,"https://www.wijet.com/bombardier-private-jet-price-list/#google_vignette",{"$f":"INDEX('[1]Pt1-AvionicsComponentCosts'!$A:$NE,MATCH(B155,'[1]Pt1-AvionicsComponentCosts'!$A:$A,0),MATCH(\"END MARKER\",'[1]Pt1-AvionicsComponentCosts'!$11:$11,0))","v":732140},0.75,0.75,0.39221785714285717]
[null,649,{"$f":"INDEX('[1]Pt1-AvionicsComponentCosts'!$A:$B,MATCH(B156,'[1]Pt1-AvionicsComponentCosts'!$A:$A,0),2)","v":"Business Jet"},"Bombardier",1,"Bombardier Challenger 3500","Bombardier Challenger 3500","Challenger 3500","Challenger 3500",{"$f":"MATCH(\"*\"&F156&\"*\",Sheet1!C:C,0)","v":{"$error":"#N/A"}},{"$f":"MATCH(\"*\"&H156&\"*\",Sheet1!C:C,0)","v":{"$error":"#N/A"}},{"$f":"MATCH(\"*\"&I156&\"*\",Sheet1!B:B,0)","v":{"$error":"#N/A"}},{"$f":"INDEX('Bombardier Prices'!A:D,MATCH(I156,'Bombardier Prices'!D:D,0),2)","v":14.9},null,"https://www.wijet.com/bombardier-private-jet-price-list/#google_vignette",{"$f":"INDEX('[1]Pt1-AvionicsComponentCosts'!$A:$NE,MATCH(B156,'[1]Pt1-AvionicsComponentCosts'!$A:$A,0),MATCH(\"END MARKER\",'[1]Pt1-AvionicsComponentCosts'!$11:$11,0))","v":732140},0.75,0.75,0.36852684563758387]
[null,618,{"$f":"INDEX('[1]Pt1-AvionicsComponentCosts'!$A:$B,MATCH(B157,'[1]Pt1-AvionicsComponentCosts'!$A:$A,0),2)","v":"Regional"},"Bombardier",1,"Bombardier CRJ","Bombardier CRJ200","CRJ200","CRJ200",{"$f":"MATCH(\"*\"&F157&\"*\",Sheet1!C:C,0)","v":{"$error":"#N/A"}},{"$f":"MATCH(\"*\"&H157&\"*\",Sheet1!C:C,0)","v":{"$error":"#N/A"}},{"$f":"MATCH(\"*\"&I157&\"*\",Sheet1!B:B,0)","v":38},null,null,null,{"$f":"INDEX('[1]Pt1-AvionicsComponentCosts'!$A:$NE,MATCH(B157,'[1]Pt1-AvionicsComponentCosts'!$A:$A,0),MATCH(\"END MARKER\",'[1]Pt1-AvionicsComponentCosts'!$11:$11,0))","v":925102},0.65,0.65,""]
[null,220,{"$f":"INDEX('[1]Pt1-AvionicsComponentCosts'!$A:$B,MATCH(B158,'[1]Pt1-AvionicsComponentCosts'!$A:$A,0),2)","v":"Regional"},"Bombardier",1,"Bombardier CRJ","Bombardier CRJ700-1000","CRJ700-1000","CRJ700-1000",{"$f":"MATCH(\"*\"&F158&\"*\",Sheet1!C:C,0)","v":{"$error":"#N/A"}},{"$f":"MATCH(\"*\"&H158&\"*\",Sheet1!C:C,0)","v":{"$error":"#N/A"}},{"$f":"MATCH(\"*\"&I158&\"*\",Sheet1!B:B,0)","v":{"$error":"#N/A"}},null,null,null,{"$f":"INDEX('[1]Pt1-AvionicsComponentCosts'!$A:$NE,MATCH(B158,'[1]Pt1-AvionicsComponentCosts'!$A:$A,0),MATCH(\"END MARKER\",'[1]Pt1-AvionicsComponentCosts'!$11:$11,0))","v":925102},0.65,0.65,""]
[null,218,{"$f":"INDEX('[1]Pt1-AvionicsComponentCosts'!$A:$B,MATCH(B159,'[1]Pt1-AvionicsComponentCosts'!$A:$A,0),2)","v":"Regional"},"Bombardier",1,"Bombardier CRJ","Bombardier CRJ700-700","CRJ700-700","CRJ700-700",{"$f":"MATCH(\"*\"&F159&\"*\",Sheet1!C:C,0)","v":{"$error":"#N/A"}},{"$f":"MATCH(\"*\"&H159&\"*\",Sheet1!C:C,0)","v":{"$error":"#N/A"}},{"$f":"MATCH(\"*\"&I159&\"*\",Sheet1!B:B,0)","v":{"$error":"#N/A"}},null,null,null,{"$f":"INDEX('[1]Pt1-AvionicsComponentCosts'!$A:$NE,MATCH(B159,'[1]Pt1-AvionicsComponentCosts'!$A:$A,0),MATCH(\"END MARKER\",'[1]Pt1-AvionicsComponentCosts'!$11:$11,0))","v":925102},0.65,0.65,""]
[null,219,{"$f":"INDEX('[1]Pt1-AvionicsComponentCosts'!$A:$B,MATCH(B160,'[1]Pt1-AvionicsComponentCosts'!$A:$A,0),2)","v":"Regional"},"Bombardier",1,"Bombardier CRJ","Bombardier CRJ700-900","CRJ700-900","CRJ700-900",{"$f":"MATCH(\"*\"&F160&\"*\",Sheet1!C:C,0)","v":{"$error":"#N/A"}},{"$f":"MATCH(\"*\"&H160&\"*\",Sheet1!C:C,0)","v":{"$error":"#N/A"}},{"$f":"MATCH(\"*\"&I160&\"*\",Sheet1!B:B,0)","v":{"$error":"#N/A"}},null,null,null,{"$f":"INDEX('[1]Pt1-AvionicsComponentCosts'!$A:$NE,MATCH(B160,'[1]Pt1-AvionicsComponentCosts'!$A:$A,0),MATCH(\"END MARKER\",'[1]Pt1-AvionicsComponentCosts'!$11:$11,0))","v":925102},0.65,0.65,""]
[null,226,{"$f":"INDEX('[1]Pt1-AvionicsComponentCosts'!$A:$B,MATCH(B161,'[1]Pt1-AvionicsComponentCosts'!$A:$A,0),2)","v":"Turbine GA"},"Canadair",1,"Canadair CL-415","Canadair CL-415","CL-415","CL-415",{"$f":"MATCH(\"*\"&F161&\"*\",Sheet1!C:C,0)","v":{"$error":"#N/A"}},{"$f":"MATCH(\"*\"&H161&\"*\",Sheet1!C:C,0)","v":{"$error":"#N/A"}},{"$f":"MATCH(\"*\"&I161&\"*\",Sheet1!B:B,0)","v":{"$error":"#N/A"}},36.9,"in 2014","https://en.wikipedia.org/wiki/Canadair_CL-415",{"$f":"INDEX('[1]Pt1-AvionicsComponentCosts'!$A:$NE,MATCH(B161,'[1]Pt1-AvionicsComponentCosts'!$A:$A,0),MATCH(\"END MARKER\",'[1]Pt1-AvionicsComponentCosts'!$11:$11,0))","v":903607},1,1,0.24487994579945799]
[null,152,{"$f":"INDEX('[1]Pt1-AvionicsComponentCosts'!$A:$B,MATCH(B162,'[1]Pt1-AvionicsComponentCosts'!$A:$A,0),2)","v":"Military Transport / Special Mission"},"CASA",1,"CASA C-212 Aviocar","CASA C-212 Aviocar","C-212 Aviocar","C-212 Aviocar",{"$f":"MATCH(\"*\"&F162&\"*\",Sheet1!C:C,0)","v":{"$error":"#N/A"}},{"$f":"MATCH(\"*\"&H162&\"*\",Sheet1!C:C,0)","v":{"$error":"#N/A"}},{"$f":"MATCH(\"*\"&I162&\"*\",Sheet1!B:B,0)","v":{"$error":"#N/A"}},null,null,null,{"$f":"INDEX('[1]Pt1-AvionicsComponentCosts'!$A:$NE,MATCH(B162,'[1]Pt1-AvionicsComponentCosts'!$A:$A,0),MATCH(\"END MARKER\",'[1]Pt1-AvionicsComponentCosts'!$11:$11,0))","v":2984826},1,1,""]
[null,153,{"$f":"INDEX('[1]Pt1-AvionicsComponentCosts'!$A:$B,MATCH(B163,'[1]Pt1-AvionicsComponentCosts'!$A:$A,0),2)","v":"Military Transport / Special Mission"},"CASA/IPTN",1,"CASA/IPTN CN-235","CASA/IPTN CN-235","CN-235","CN-235",{"$f":"MATCH(\"*\"&F163&\"*\",Sheet1!C:C,0)","v":{"$error":"#N/A"}},{"$f":"MATCH(\"*\"&H163&\"*\",Sheet1!C:C,0)","v":{"$error":"#N/A"}},{"$f":"MATCH(\"*\"&I163&\"*\",Sheet1!B:B,0)","v":{"$error":"#N/A"}},null,null,null,{"$f":"INDEX('[1]Pt1-AvionicsComponentCosts'!$A:$NE,MATCH(B163,'[1]Pt1-AvionicsComponentCosts'!$A:$A,0),MATCH(\"END MARKER\",'[1]Pt1-AvionicsComponentCosts'!$11:$11,0))","v":3024812},1,1,""]
[null,48,{"$f":"INDEX('[1]Pt1-AvionicsComponentCosts'!$A:$B,MATCH(B164,'[1]Pt1-AvionicsComponentCosts'!$A:$A,0),2)","v":"Business Jet"},"Cessna",1,"Citation Hemisphere","Cessna Citation Hemisphere","Citation Hemisphere","Citation Hemisphere",{"$f":"MATCH(\"*\"&F164&\"*\",Sheet1!C:C,0)","v":{"$error":"#N/A"}},{"$f":"MATCH(\"*\"&H164&\"*\",Sheet1!C:C,0)","v":{"$error":"#N/A"}},{"$f":"MATCH(\"*\"&I164&\"*\",Sheet1!B:B,0)","v":{"$error":"#N/A"}},null,null,null,{"$f":"INDEX('[1]Pt1-AvionicsComponentCosts'!$A:$NE,MATCH(B164,'[1]Pt1-AvionicsComponentCosts'!$A:$A,0),MATCH(\"END MARKER\",'[1]Pt1-AvionicsComponentCosts'!$11:$11,0))","v":971537},0.75,0.75,""]
[null,47,{"$f":"INDEX('[1]Pt1-AvionicsComponentCosts'!$A:$B,MATCH(B165,'[1]Pt1-AvionicsComponentCosts'!$A:$A,0),2)","v":"Business Jet"},"Cessna",1,"Citation Longitude","Cessna Citation Longitude","Citation Longitude","Citation Longitude",{"$f":"MATCH(\"*\"&F165&\"*\",Sheet1!C:C,0)","v":{"$error":"#N/A"}},{"$f":"MATCH(\"*\"&H165&\"*\",Sheet1!C:C,0)","v":{"$error":"#N/A"}},{"$f":"MATCH(\"*\"&I165&\"*\",Sheet1!B:B,0)","v":{"$error":"#N/A"}},29.9,null,"https://aviationweek.com/business-aviation/aircraft-propulsion/20twenty-longitude-cessnas-super-mid-flagship",{"$f":"INDEX('[1]Pt1-AvionicsComponentCosts'!$A:$NE,MATCH(B165,'[1]Pt1-AvionicsComponentCosts'!$A:$A,0),MATCH(\"END MARKER\",'[1]Pt1-AvionicsComponentCosts'!$11:$11,0))","v":971537},0.75,0.75,0.24369657190635452]
[null,42,{"$f":"INDEX('[1]Pt1-AvionicsComponentCosts'!$A:$B,MATCH(B166,'[1]Pt1-AvionicsComponentCosts'!$A:$A,0),2)","v":"Business Jet"},"Cessna",1,"Citation CJ3","Cessna Citation CJ3","Citation CJ3","Citation CJ3",{"$f":"MATCH(\"*\"&F166&\"*\",Sheet1!C:C,0)","v":{"$error":"#N/A"}},{"$f":"MATCH(\"*\"&H166&\"*\",Sheet1!C:C,0)","v":{"$error":"#N/A"}},{"$f":"MATCH(\"*\"&I166&\"*\",Sheet1!B:B,0)","v":{"$error":"#N/A"}},null,null,null,{"$f":"INDEX('[1]Pt1-AvionicsComponentCosts'!$A:$NE,MATCH(B166,'[1]Pt1-AvionicsComponentCosts'!$A:$A,0),MATCH(\"END MARKER\",'[1]Pt1-AvionicsComponentCosts'!$11:$11,0))","v":452749},0.75,0.75,""]
[null,43,{"$f":"INDEX('[1]Pt1-AvionicsComponentCosts'!$A:$B,MATCH(B167,'[1]Pt1-AvionicsComponentCosts'!$A:$A,0),2)","v":"Business Jet"},"Cessna",1,"Citation CJ4","Cessna Citation CJ4","Citation CJ4","Citation CJ4",{"$f":"MATCH(\"*\"&F167&\"*\",Sheet1!C:C,0)","v":{"$error":"#N/A"}},{"$f":"MATCH(\"*\"&H167&\"*\",Sheet1!C:C,0)","v":{"$error":"#N/A"}},{"$f":"MATCH(\"*\"&I167&\"*\",Sheet1!B:B,0)","v":{"$error":"#N/A"}},9.1999999999999993,null,"https://www.bjtonline.com/aircraft/cessna-citation-cj4",{"$f":"INDEX('[1]Pt1-AvionicsComponentCosts'!$A:$NE,MATCH(B167,'[1]Pt1-AvionicsComponentCosts'!$A:$A,0),MATCH(\"END MARKER\",'[1]Pt1-AvionicsComponentCosts'!$11:$11,0))","v":452749},0.75,0.75,0.36908885869565222]
[null,39,{"$f":"INDEX('[1]Pt1-AvionicsComponentCosts'!$A:$B,MATCH(B168,'[1]Pt1-AvionicsComponentCosts'!$A:$A,0),2)","v":"Business Jet"},"Cessna",1,"Citation V","Cessna Citation Encore","Citation Encore","Citation Encore",{"$f":"MATCH(\"*\"&F168&\"*\",Sheet1!C:C,0)","v":{"$error":"#N/A"}},{"$f":"MATCH(\"*\"&H168&\"*\",Sheet1!C:C,0)","v":{"$error":"#N/A"}},{"$f":"MATCH(\"*\"&I168&\"*\",Sheet1!B:B,0)","v":{"$error":"#N/A"}},null,null,null,{"$f":"INDEX('[1]Pt1-AvionicsComponentCosts'!$A:$NE,MATCH(B168,'[1]Pt1-AvionicsComponentCosts'!$A:$A,0),MATCH(\"END MARKER\",'[1]Pt1-AvionicsComponentCosts'!$11:$11,0))","v":452749},0.75,0.75,""]
[null,46,{"$f":"INDEX('[1]Pt1-AvionicsComponentCosts'!$A:$B,MATCH(B169,'[1]Pt1-AvionicsComponentCosts'!$A:$A,0),2)","v":"Business Jet"},"Cessna",1,"Citation Latitude","Cessna Citation Latitude","Citation Latitude","Citation Latitude",{"$f":"MATCH(\"*\"&F169&\"*\",Sheet1!C:C,0)","v":{"$error":"#N/A"}},{"$f":"MATCH(\"*\"&H169&\"*\",Sheet1!C:C,0)","v":{"$error":"#N/A"}},{"$f":"MATCH(\"*\"&I169&\"*\",Sheet1!B:B,0)","v":{"$error":"#N/A"}},20,null,"https://www.avbuyer.com/articles/private-jet-price-guides/cessna-citation-latitude-price-guide-112581#price-guide-full-dtl",{"$f":"INDEX('[1]Pt1-AvionicsComponentCosts'!$A:$NE,MATCH(B169,'[1]Pt1-AvionicsComponentCosts'!$A:$A,0),MATCH(\"END MARKER\",'[1]Pt1-AvionicsComponentCosts'!$11:$11,0))","v":725690},0.75,0.75,0.27213374999999995]
[null,45,{"$f":"INDEX('[1]Pt1-AvionicsComponentCosts'!$A:$B,MATCH(B170,'[1]Pt1-AvionicsComponentCosts'!$A:$A,0),2)","v":"Business Jet"},"Cessna",1,"Citation Sovereign","Cessna Citation Sovereign","Citation Sovereign","Citation Sovereign",{"$f":"MATCH(\"*\"&F170&\"*\",Sheet1!C:C,0)","v":{"$error":"#N/A"}},{"$f":"MATCH(\"*\"&H170&\"*\",Sheet1!C:C,0)","v":{"$error":"#N/A"}},{"$f":"MATCH(\"*\"&I170&\"*\",Sheet1!B:B,0)","v":{"$error":"#N/A"}},null,null,null,{"$f":"INDEX('[1]Pt1-AvionicsComponentCosts'!$A:$NE,MATCH(B170,'[1]Pt1-AvionicsComponentCosts'!$A:$A,0),MATCH(\"END MARKER\",'[1]Pt1-AvionicsComponentCosts'!$11:$11,0))","v":725690},0.75,0.75,""]
[null,49,{"$f":"INDEX('[1]Pt1-AvionicsComponentCosts'!$A:$B,MATCH(B171,'[1]Pt1-AvionicsComponentCosts'!$A:$A,0),2)","v":"Business Jet"},"Cessna",1,"Citation X","Cessna Citation X","Citation X","Citation X",{"$f":"MATCH(\"*\"&F171&\"*\",Sheet1!C:C,0)","v":{"$error":"#N/A"}},{"$f":"MATCH(\"*\"&H171&\"*\",Sheet1!C:C,0)","v":{"$error":"#N/A"}},{"$f":"MATCH(\"*\"&I171&\"*\",Sheet1!B:B,0)","v":{"$error":"#N/A"}},null,null,null,{"$f":"INDEX('[1]Pt1-AvionicsComponentCosts'!$A:$NE,MATCH(B171,'[1]Pt1-AvionicsComponentCosts'!$A:$A,0),MATCH(\"END MARKER\",'[1]Pt1-AvionicsComponentCosts'!$11:$11,0))","v":725690},0.75,0.75,""]
[null,40,{"$f":"INDEX('[1]Pt1-AvionicsComponentCosts'!$A:$B,MATCH(B172,'[1]Pt1-AvionicsComponentCosts'!$A:$A,0),2)","v":"Business Jet"},"Cessna",1,"Citation XLS","Cessna Citation XLS","Citation XLS","Citation XLS",{"$f":"MATCH(\"*\"&F172&\"*\",Sheet1!C:C,0)","v":{"$error":"#N/A"}},{"$f":"MATCH(\"*\"&H172&\"*\",Sheet1!C:C,0)","v":{"$error":"#N/A"}},{"$f":"MATCH(\"*\"&I172&\"*\",Sheet1!B:B,0)","v":{"$error":"#N/A"}},null,null,null,{"$f":"INDEX('[1]Pt1-AvionicsComponentCosts'!$A:$NE,MATCH(B172,'[1]Pt1-AvionicsComponentCosts'!$A:$A,0),MATCH(\"END MARKER\",'[1]Pt1-AvionicsComponentCosts'!$11:$11,0))","v":725690},0.75,0.75,""]
[null,41,{"$f":"INDEX('[1]Pt1-AvionicsComponentCosts'!$A:$B,MATCH(B173,'[1]Pt1-AvionicsComponentCosts'!$A:$A,0),2)","v":"Business Jet"},"Cessna",1,"Citation M2","Cessna Citation M2","Citation M2","Citation M2",{"$f":"MATCH(\"*\"&F173&\"*\",Sheet1!C:C,0)","v":{"$error":"#N/A"}},{"$f":"MATCH(\"*\"&H173&\"*\",Sheet1!C:C,0)","v":{"$error":"#N/A"}},{"$f":"MATCH(\"*\"&I173&\"*\",Sheet1!B:B,0)","v":{"$error":"#N/A"}},4.7,null,"https://www.bjtonline.com/aircraft/cessna-citation-m2",{"$f":"INDEX('[1]Pt1-AvionicsComponentCosts'!$A:$NE,MATCH(B173,'[1]Pt1-AvionicsComponentCosts'!$A:$A,0),MATCH(\"END MARKER\",'[1]Pt1-AvionicsComponentCosts'!$11:$11,0))","v":206293},0.75,0.75,0.32919095744680854]
[null,44,{"$f":"INDEX('[1]Pt1-AvionicsComponentCosts'!$A:$B,MATCH(B174,'[1]Pt1-AvionicsComponentCosts'!$A:$A,0),2)","v":"Business Jet"},"Cessna",1,"Citation Mustang","Cessna Citation Mustang","Citation Mustang","Citation Mustang",{"$f":"MATCH(\"*\"&F174&\"*\",Sheet1!C:C,0)","v":{"$error":"#N/A"}},{"$f":"MATCH(\"*\"&H174&\"*\",Sheet1!C:C,0)","v":{"$error":"#N/A"}},{"$f":"MATCH(\"*\"&I174&\"*\",Sheet1!B:B,0)","v":{"$error":"#N/A"}},null,null,null,{"$f":"INDEX('[1]Pt1-AvionicsComponentCosts'!$A:$NE,MATCH(B174,'[1]Pt1-AvionicsComponentCosts'!$A:$A,0),MATCH(\"END MARKER\",'[1]Pt1-AvionicsComponentCosts'!$11:$11,0))","v":206293},0.75,0.75,""]
[null,82,{"$f":"INDEX('[1]Pt1-AvionicsComponentCosts'!$A:$B,MATCH(B175,'[1]Pt1-AvionicsComponentCosts'!$A:$A,0),2)","v":"Turbine GA"},"Cessna",1,"Cessna 208 Caravan","Cessna 208 Caravan","208 Caravan","208 Caravan",{"$f":"MATCH(\"*\"&F175&\"*\",Sheet1!C:C,0)","v":{"$error":"#N/A"}},{"$f":"MATCH(\"*\"&H175&\"*\",Sheet1!C:C,0)","v":{"$error":"#N/A"}},{"$f":"MATCH(\"*\"&I175&\"*\",Sheet1!B:B,0)","v":{"$error":"#N/A"}},2.6,null,"https://www.bjtonline.com/aircraft/cessna-208b-grand-caravan-ex",{"$f":"INDEX('[1]Pt1-AvionicsComponentCosts'!$A:$NE,MATCH(B175,'[1]Pt1-AvionicsComponentCosts'!$A:$A,0),MATCH(\"END MARKER\",'[1]Pt1-AvionicsComponentCosts'!$11:$11,0))","v":214523},1,1,0.82508846153846149]
[null,308,{"$f":"INDEX('[1]Pt1-AvionicsComponentCosts'!$A:$B,MATCH(B176,'[1]Pt1-AvionicsComponentCosts'!$A:$A,0),2)","v":"Turbine GA"},"Cessna",1,"Cessna 408 SkyCourier","Cessna 408 SkyCourier","408 SkyCourier","408 SkyCourier",{"$f":"MATCH(\"*\"&F176&\"*\",Sheet1!C:C,0)","v":{"$error":"#N/A"}},{"$f":"MATCH(\"*\"&H176&\"*\",Sheet1!C:C,0)","v":{"$error":"#N/A"}},{"$f":"MATCH(\"*\"&I176&\"*\",Sheet1!B:B,0)","v":{"$error":"#N/A"}},5.5,null,"https://www.bjtonline.com/business-jet-news/cessna-408-skycourier",{"$f":"INDEX('[1]Pt1-AvionicsComponentCosts'!$A:$NE,MATCH(B176,'[1]Pt1-AvionicsComponentCosts'!$A:$A,0),MATCH(\"END MARKER\",'[1]Pt1-AvionicsComponentCosts'!$11:$11,0))","v":217209},1,1,0.39492545454545452]
[null,81,{"$f":"INDEX('[1]Pt1-AvionicsComponentCosts'!$A:$B,MATCH(B177,'[1]Pt1-AvionicsComponentCosts'!$A:$A,0),2)","v":"Turbine GA"},"Cessna",1,"Cessna Denali","Cessna Denali","Denali","Denali",{"$f":"MATCH(\"*\"&F177&\"*\",Sheet1!C:C,0)","v":{"$error":"#N/A"}},{"$f":"MATCH(\"*\"&H177&\"*\",Sheet1!C:C,0)","v":{"$error":"#N/A"}},{"$f":"MATCH(\"*\"&I177&\"*\",Sheet1!B:B,0)","v":{"$error":"#N/A"}},6.4,null,"https://www.aircharteradvisors.com/beechcraft-denali/",{"$f":"INDEX('[1]Pt1-AvionicsComponentCosts'!$A:$NE,MATCH(B177,'[1]Pt1-AvionicsComponentCosts'!$A:$A,0),MATCH(\"END MARKER\",'[1]Pt1-AvionicsComponentCosts'!$11:$11,0))","v":228066},1,1,0.35635312499999999]
[null,550,{"$f":"INDEX('[1]Pt1-AvionicsComponentCosts'!$A:$B,MATCH(B178,'[1]Pt1-AvionicsComponentCosts'!$A:$A,0),2)","v":"Business Jet"},"Cirrus",1,"Cirrus Vision Jet SF50","Cirrus Vision Jet SF50","Vision Jet SF50","Vision Jet SF50",{"$f":"MATCH(\"*\"&F178&\"*\",Sheet1!C:C,0)","v":{"$error":"#N/A"}},{"$f":"MATCH(\"*\"&H178&\"*\",Sheet1!C:C,0)","v":{"$error":"#N/A"}},{"$f":"MATCH(\"*\"&I178&\"*\",Sheet1!B:B,0)","v":{"$error":"#N/A"}},null,null,null,{"$f":"INDEX('[1]Pt1-AvionicsComponentCosts'!$A:$NE,MATCH(B178,'[1]Pt1-AvionicsComponentCosts'!$A:$A,0),MATCH(\"END MARKER\",'[1]Pt1-AvionicsComponentCosts'!$11:$11,0))","v":206293},0.75,0.75,""]
[null,18,{"$f":"INDEX('[1]Pt1-AvionicsComponentCosts'!$A:$B,MATCH(B179,'[1]Pt1-AvionicsComponentCosts'!$A:$A,0),2)","v":"Large Commercial Aircraft"},"Comac",1,"Comac C919","Comac C919","C919","C919",{"$f":"MATCH(\"*\"&F179&\"*\",Sheet1!C:C,0)","v":{"$error":"#N/A"}},{"$f":"MATCH(\"*\"&H179&\"*\",Sheet1!C:C,0)","v":{"$error":"#N/A"}},{"$f":"MATCH(\"*\"&I179&\"*\",Sheet1!B:B,0)","v":{"$error":"#N/A"}},null,null,null,{"$f":"INDEX('[1]Pt1-AvionicsComponentCosts'!$A:$NE,MATCH(B179,'[1]Pt1-AvionicsComponentCosts'!$A:$A,0),MATCH(\"END MARKER\",'[1]Pt1-AvionicsComponentCosts'!$11:$11,0))","v":1368462},{"$f":"50%","v":0.5},{"$f":"50%","v":0.5},""]
[null,27,{"$f":"INDEX('[1]Pt1-AvionicsComponentCosts'!$A:$B,MATCH(B180,'[1]Pt1-AvionicsComponentCosts'!$A:$A,0),2)","v":"Regional"},"Comac",1,"Comac ARJ21","Comac ARJ21","ARJ21","ARJ21",{"$f":"MATCH(\"*\"&F180&\"*\",Sheet1!C:C,0)","v":{"$error":"#N/A"}},{"$f":"MATCH(\"*\"&H180&\"*\",Sheet1!C:C,0)","v":{"$error":"#N/A"}},{"$f":"MATCH(\"*\"&I180&\"*\",Sheet1!B:B,0)","v":{"$error":"#N/A"}},null,null,null,{"$f":"INDEX('[1]Pt1-AvionicsComponentCosts'!$A:$NE,MATCH(B180,'[1]Pt1-AvionicsComponentCosts'!$A:$A,0),MATCH(\"END MARKER\",'[1]Pt1-AvionicsComponentCosts'!$11:$11,0))","v":977179},0.65,0.65,""]
[null,587,{"$f":"INDEX('[1]Pt1-AvionicsComponentCosts'!$A:$B,MATCH(B181,'[1]Pt1-AvionicsComponentCosts'!$A:$A,0),2)","v":"Business Jet"},"Dassault",1,"Falcon 10X","Dassault Falcon 10X","Falcon 10X","Falcon 10X",{"$f":"MATCH(\"*\"&F181&\"*\",Sheet1!C:C,0)","v":{"$error":"#N/A"}},{"$f":"MATCH(\"*\"&H181&\"*\",Sheet1!C:C,0)","v":{"$error":"#N/A"}},{"$f":"MATCH(\"*\"&I181&\"*\",Sheet1!B:B,0)","v":{"$error":"#N/A"}},null,null,null,{"$f":"INDEX('[1]Pt1-AvionicsComponentCosts'!$A:$NE,MATCH(B181,'[1]Pt1-AvionicsComponentCosts'!$A:$A,0),MATCH(\"END MARKER\",'[1]Pt1-AvionicsComponentCosts'!$11:$11,0))","v":1095913},0.75,0.75,""]
[null,51,{"$f":"INDEX('[1]Pt1-AvionicsComponentCosts'!$A:$B,MATCH(B182,'[1]Pt1-AvionicsComponentCosts'!$A:$A,0),2)","v":"Business Jet"},"Dassault",1,"Falcon 6X","Dassault Falcon 6X","Falcon 6X","Falcon 6X",{"$f":"MATCH(\"*\"&F182&\"*\",Sheet1!C:C,0)","v":{"$error":"#N/A"}},{"$f":"MATCH(\"*\"&H182&\"*\",Sheet1!C:C,0)","v":{"$error":"#N/A"}},{"$f":"MATCH(\"*\"&I182&\"*\",Sheet1!B:B,0)","v":{"$error":"#N/A"}},null,null,null,{"$f":"INDEX('[1]Pt1-AvionicsComponentCosts'!$A:$NE,MATCH(B182,'[1]Pt1-AvionicsComponentCosts'!$A:$A,0),MATCH(\"END MARKER\",'[1]Pt1-AvionicsComponentCosts'!$11:$11,0))","v":1086106},0.75,0.75,""]
[null,54,{"$f":"INDEX('[1]Pt1-AvionicsComponentCosts'!$A:$B,MATCH(B183,'[1]Pt1-AvionicsComponentCosts'!$A:$A,0),2)","v":"Business Jet"},"Dassault",1,"Falcon 7X/8X","Dassault Falcon 7X/8X","Falcon 7X/8X","Falcon 7X/8X",{"$f":"MATCH(\"*\"&F183&\"*\",Sheet1!C:C,0)","v":{"$error":"#N/A"}},{"$f":"MATCH(\"*\"&H183&\"*\",Sheet1!C:C,0)","v":{"$error":"#N/A"}},{"$f":"MATCH(\"*\"&I183&\"*\",Sheet1!B:B,0)","v":{"$error":"#N/A"}},63.8,null,"https://infogram.com/bca-table-2023-jets-ultra-long-range-1ho16vorwrqkx4n",{"$f":"INDEX('[1]Pt1-AvionicsComponentCosts'!$A:$NE,MATCH(B183,'[1]Pt1-AvionicsComponentCosts'!$A:$A,0),MATCH(\"END MARKER\",'[1]Pt1-AvionicsComponentCosts'!$11:$11,0))","v":1086106},0.75,0.75,0.12767703761755486]
[null,50,{"$f":"INDEX('[1]Pt1-AvionicsComponentCosts'!$A:$B,MATCH(B184,'[1]Pt1-AvionicsComponentCosts'!$A:$A,0),2)","v":"Business Jet"},"Dassault",1,"Falcon 900","Dassault Falcon 900","Falcon 900","Falcon 900",{"$f":"MATCH(\"*\"&F184&\"*\",Sheet1!C:C,0)","v":{"$error":"#N/A"}},{"$f":"MATCH(\"*\"&H184&\"*\",Sheet1!C:C,0)","v":{"$error":"#N/A"}},{"$f":"MATCH(\"*\"&I184&\"*\",Sheet1!B:B,0)","v":{"$error":"#N/A"}},null,null,null,{"$f":"INDEX('[1]Pt1-AvionicsComponentCosts'!$A:$NE,MATCH(B184,'[1]Pt1-AvionicsComponentCosts'!$A:$A,0),MATCH(\"END MARKER\",'[1]Pt1-AvionicsComponentCosts'!$11:$11,0))","v":1086106},0.75,0.75,""]
[null,53,{"$f":"INDEX('[1]Pt1-AvionicsComponentCosts'!$A:$B,MATCH(B185,'[1]Pt1-AvionicsComponentCosts'!$A:$A,0),2)","v":"Business Jet"},"Dassault",1,"Falcon 2000","Dassault Falcon 2000","Falcon 2000","Falcon 2000",{"$f":"MATCH(\"*\"&F185&\"*\",Sheet1!C:C,0)","v":{"$error":"#N/A"}},{"$f":"MATCH(\"*\"&H185&\"*\",Sheet1!C:C,0)","v":{"$error":"#N/A"}},{"$f":"MATCH(\"*\"&I185&\"*\",Sheet1!B:B,0)","v":{"$error":"#N/A"}},null,null,null,{"$f":"INDEX('[1]Pt1-AvionicsComponentCosts'!$A:$NE,MATCH(B185,'[1]Pt1-AvionicsComponentCosts'!$A:$A,0),MATCH(\"END MARKER\",'[1]Pt1-AvionicsComponentCosts'!$11:$11,0))","v":846709},0.75,0.75,""]
[null,640,{"$f":"INDEX('[1]Pt1-AvionicsComponentCosts'!$A:$B,MATCH(B186,'[1]Pt1-AvionicsComponentCosts'!$A:$A,0),2)","v":"Business Jet"},"Dassault",1,"Falcon 2X","Dassault Falcon 2X","Falcon 2X","Falcon 2X",{"$f":"MATCH(\"*\"&F186&\"*\",Sheet1!C:C,0)","v":{"$error":"#N/A"}},{"$f":"MATCH(\"*\"&H186&\"*\",Sheet1!C:C,0)","v":{"$error":"#N/A"}},{"$f":"MATCH(\"*\"&I186&\"*\",Sheet1!B:B,0)","v":{"$error":"#N/A"}},null,null,null,{"$f":"INDEX('[1]Pt1-AvionicsComponentCosts'!$A:$NE,MATCH(B186,'[1]Pt1-AvionicsComponentCosts'!$A:$A,0),MATCH(\"END MARKER\",'[1]Pt1-AvionicsComponentCosts'!$11:$11,0))","v":732140},0.75,0.75,""]
[null,141,{"$f":"INDEX('[1]Pt1-AvionicsComponentCosts'!$A:$B,MATCH(B187,'[1]Pt1-AvionicsComponentCosts'!$A:$A,0),2)","v":"Fighters and Jet Trainers"},"Dassault",1,"Dassault Rafale","Dassault Rafale","Rafale","Rafale",{"$f":"MATCH(\"*\"&F187&\"*\",Sheet1!C:C,0)","v":{"$error":"#N/A"}},{"$f":"MATCH(\"*\"&H187&\"*\",Sheet1!C:C,0)","v":{"$error":"#N/A"}},{"$f":"MATCH(\"*\"&I187&\"*\",Sheet1!B:B,0)","v":{"$error":"#N/A"}},null,null,null,{"$f":"INDEX('[1]Pt1-AvionicsComponentCosts'!$A:$NE,MATCH(B187,'[1]Pt1-AvionicsComponentCosts'!$A:$A,0),MATCH(\"END MARKER\",'[1]Pt1-AvionicsComponentCosts'!$11:$11,0))","v":2711860},1,1,""]
[null,621,{"$f":"INDEX('[1]Pt1-AvionicsComponentCosts'!$A:$B,MATCH(B188,'[1]Pt1-AvionicsComponentCosts'!$A:$A,0),2)","v":"Regional"},"De Havilland Canada",1,"De Havilland Canada DHC-8","De Havilland Canada DHC-8-100","DHC-8-100","DHC-8-100",{"$f":"MATCH(\"*\"&F188&\"*\",Sheet1!C:C,0)","v":{"$error":"#N/A"}},{"$f":"MATCH(\"*\"&H188&\"*\",Sheet1!C:C,0)","v":{"$error":"#N/A"}},{"$f":"MATCH(\"*\"&I188&\"*\",Sheet1!B:B,0)","v":{"$error":"#N/A"}},12.5,null,"https://www.modernairliners.com/bombardier-dhc-dash-8",{"$f":"INDEX('[1]Pt1-AvionicsComponentCosts'!$A:$NE,MATCH(B188,'[1]Pt1-AvionicsComponentCosts'!$A:$A,0),MATCH(\"END MARKER\",'[1]Pt1-AvionicsComponentCosts'!$11:$11,0))","v":919730},0.65,0.65,0.47825960000000001]
[null,622,{"$f":"INDEX('[1]Pt1-AvionicsComponentCosts'!$A:$B,MATCH(B189,'[1]Pt1-AvionicsComponentCosts'!$A:$A,0),2)","v":"Regional"},"De Havilland Canada",1,"De Havilland Canada DHC-8","De Havilland Canada DHC-8-200","DHC-8-200","DHC-8-200",{"$f":"MATCH(\"*\"&F189&\"*\",Sheet1!C:C,0)","v":{"$error":"#N/A"}},{"$f":"MATCH(\"*\"&H189&\"*\",Sheet1!C:C,0)","v":{"$error":"#N/A"}},{"$f":"MATCH(\"*\"&I189&\"*\",Sheet1!B:B,0)","v":{"$error":"#N/A"}},13,null,"https://www.modernairliners.com/bombardier-dhc-dash-8",{"$f":"INDEX('[1]Pt1-AvionicsComponentCosts'!$A:$NE,MATCH(B189,'[1]Pt1-AvionicsComponentCosts'!$A:$A,0),MATCH(\"END MARKER\",'[1]Pt1-AvionicsComponentCosts'!$11:$11,0))","v":919730},0.65,0.65,0.45986500000000002]
[null,623,{"$f":"INDEX('[1]Pt1-AvionicsComponentCosts'!$A:$B,MATCH(B190,'[1]Pt1-AvionicsComponentCosts'!$A:$A,0),2)","v":"Regional"},"De Havilland Canada",1,"De Havilland Canada DHC-8","De Havilland Canada DHC-8-300","DHC-8-300","DHC-8-300",{"$f":"MATCH(\"*\"&F190&\"*\",Sheet1!C:C,0)","v":{"$error":"#N/A"}},{"$f":"MATCH(\"*\"&H190&\"*\",Sheet1!C:C,0)","v":{"$error":"#N/A"}},{"$f":"MATCH(\"*\"&I190&\"*\",Sheet1!B:B,0)","v":{"$error":"#N/A"}},17,null,"https://www.modernairliners.com/bombardier-dhc-dash-8",{"$f":"INDEX('[1]Pt1-AvionicsComponentCosts'!$A:$NE,MATCH(B190,'[1]Pt1-AvionicsComponentCosts'!$A:$A,0),MATCH(\"END MARKER\",'[1]Pt1-AvionicsComponentCosts'!$11:$11,0))","v":919730},0.65,0.65,0.35166147058823527]
[null,21,{"$f":"INDEX('[1]Pt1-AvionicsComponentCosts'!$A:$B,MATCH(B191,'[1]Pt1-AvionicsComponentCosts'!$A:$A,0),2)","v":"Regional"},"De Havilland Canada",1,"De Havilland Canada DHC-8","De Havilland Canada DHC-8-400","DHC-8-400","DHC-8-400",{"$f":"MATCH(\"*\"&F191&\"*\",Sheet1!C:C,0)","v":{"$error":"#N/A"}},{"$f":"MATCH(\"*\"&H191&\"*\",Sheet1!C:C,0)","v":{"$error":"#N/A"}},{"$f":"MATCH(\"*\"&I191&\"*\",Sheet1!B:B,0)","v":{"$error":"#N/A"}},27,null,"https://www.modernairliners.com/bombardier-dhc-dash-8",{"$f":"INDEX('[1]Pt1-AvionicsComponentCosts'!$A:$NE,MATCH(B191,'[1]Pt1-AvionicsComponentCosts'!$A:$A,0),MATCH(\"END MARKER\",'[1]Pt1-AvionicsComponentCosts'!$11:$11,0))","v":919730},0.65,0.65,0.22141648148148149]
[null,624,{"$f":"INDEX('[1]Pt1-AvionicsComponentCosts'!$A:$B,MATCH(B192,'[1]Pt1-AvionicsComponentCosts'!$A:$A,0),2)","v":"Regional"},"Dornier",1,"Dornier Do 328-100","Dornier Do 328-100","Do 328-100","Do 328-100",{"$f":"MATCH(\"*\"&F192&\"*\",Sheet1!C:C,0)","v":{"$error":"#N/A"}},{"$f":"MATCH(\"*\"&H192&\"*\",Sheet1!C:C,0)","v":{"$error":"#N/A"}},{"$f":"MATCH(\"*\"&I192&\"*\",Sheet1!B:B,0)","v":{"$error":"#N/A"}},null,null,null,{"$f":"INDEX('[1]Pt1-AvionicsComponentCosts'!$A:$NE,MATCH(B192,'[1]Pt1-AvionicsComponentCosts'!$A:$A,0),MATCH(\"END MARKER\",'[1]Pt1-AvionicsComponentCosts'!$11:$11,0))","v":919730},0.65,0.65,""]
[null,224,{"$f":"INDEX('[1]Pt1-AvionicsComponentCosts'!$A:$B,MATCH(B193,'[1]Pt1-AvionicsComponentCosts'!$A:$A,0),2)","v":"Turbine GA"},"Dornier",1,"Dornier Do 228","Dornier Do 228","Do 228","Do 228",{"$f":"MATCH(\"*\"&F193&\"*\",Sheet1!C:C,0)","v":{"$error":"#N/A"}},{"$f":"MATCH(\"*\"&H193&\"*\",Sheet1!C:C,0)","v":{"$error":"#N/A"}},{"$f":"MATCH(\"*\"&I193&\"*\",Sheet1!B:B,0)","v":{"$error":"#N/A"}},null,null,null,{"$f":"INDEX('[1]Pt1-AvionicsComponentCosts'!$A:$NE,MATCH(B193,'[1]Pt1-AvionicsComponentCosts'!$A:$A,0),MATCH(\"END MARKER\",'[1]Pt1-AvionicsComponentCosts'!$11:$11,0))","v":228066},1,1,""]
[null,154,{"$f":"INDEX('[1]Pt1-AvionicsComponentCosts'!$A:$B,MATCH(B194,'[1]Pt1-AvionicsComponentCosts'!$A:$A,0),2)","v":"Military Transport / Special Mission"},"EADS",1,"EADS CASA C-295","EADS CASA C-295","CASA C-295","CASA C-295",{"$f":"MATCH(\"*\"&F194&\"*\",Sheet1!C:C,0)","v":{"$error":"#N/A"}},{"$f":"MATCH(\"*\"&H194&\"*\",Sheet1!C:C,0)","v":{"$error":"#N/A"}},{"$f":"MATCH(\"*\"&I194&\"*\",Sheet1!B:B,0)","v":{"$error":"#N/A"}},null,null,null,{"$f":"INDEX('[1]Pt1-AvionicsComponentCosts'!$A:$NE,MATCH(B194,'[1]Pt1-AvionicsComponentCosts'!$A:$A,0),MATCH(\"END MARKER\",'[1]Pt1-AvionicsComponentCosts'!$11:$11,0))","v":3025995},1,1,""]
[null,70,{"$f":"INDEX('[1]Pt1-AvionicsComponentCosts'!$A:$B,MATCH(B195,'[1]Pt1-AvionicsComponentCosts'!$A:$A,0),2)","v":"Business Jet"},"Eclipse",1,"Eclipse 550","Eclipse 550",{"$f":"TRIM(SUBSTITUTE(G195,D195,\"\"))","v":"550"},{"$f":"TRIM(SUBSTITUTE(SUBSTITUTE(SUBSTITUTE(SUBSTITUTE(SUBSTITUTE(H195,\"Family\",\"\"),\"737 Classic:\",\"\"),\"737 MAX:\",\"\"),\"787 Dreamliner:\",\"\"),\"777:\",\"\"))","v":"550"},{"$f":"MATCH(\"*\"&F195&\"*\",Sheet1!C:C,0)","v":{"$error":"#N/A"}},{"$f":"MATCH(\"*\"&H195&\"*\",Sheet1!C:C,0)","v":{"$error":"#N/A"}},{"$f":"MATCH(\"*\"&I195&\"*\",Sheet1!B:B,0)","v":{"$error":"#N/A"}},null,null,null,{"$f":"INDEX('[1]Pt1-AvionicsComponentCosts'!$A:$NE,MATCH(B195,'[1]Pt1-AvionicsComponentCosts'!$A:$A,0),MATCH(\"END MARKER\",'[1]Pt1-AvionicsComponentCosts'!$11:$11,0))","v":206293},0.75,0.75,{"$f":"IFERROR(P195/(M195*100000)*R195,\"\")","v":""}]
[null,74,{"$f":"INDEX('[1]Pt1-AvionicsComponentCosts'!$A:$B,MATCH(B196,'[1]Pt1-AvionicsComponentCosts'!$A:$A,0),2)","v":"Business Jet"},"Embraer",1,"Legacy 600/650","Embraer Legacy 600/650","Legacy 600/650","Legacy 600/650",{"$f":"MATCH(\"*\"&F196&\"*\",Sheet1!C:C,0)","v":{"$error":"#N/A"}},{"$f":"MATCH(\"*\"&H196&\"*\",Sheet1!C:C,0)","v":{"$error":"#N/A"}},{"$f":"MATCH(\"*\"&I196&\"*\",Sheet1!B:B,0)","v":{"$error":"#N/A"}},null,null,null,{"$f":"INDEX('[1]Pt1-AvionicsComponentCosts'!$A:$NE,MATCH(B196,'[1]Pt1-AvionicsComponentCosts'!$A:$A,0),MATCH(\"END MARKER\",'[1]Pt1-AvionicsComponentCosts'!$11:$11,0))","v":971537},0.75,0.75,""]
[null,652,{"$f":"INDEX('[1]Pt1-AvionicsComponentCosts'!$A:$B,MATCH(B197,'[1]Pt1-AvionicsComponentCosts'!$A:$A,0),2)","v":"Business Jet"},"Embraer",1,"Legacy 700","Embraer legacy 700","legacy 700","legacy 700",{"$f":"MATCH(\"*\"&F197&\"*\",Sheet1!C:C,0)","v":{"$error":"#N/A"}},{"$f":"MATCH(\"*\"&H197&\"*\",Sheet1!C:C,0)","v":{"$error":"#N/A"}},{"$f":"MATCH(\"*\"&I197&\"*\",Sheet1!B:B,0)","v":{"$error":"#N/A"}},null,null,null,{"$f":"INDEX('[1]Pt1-AvionicsComponentCosts'!$A:$NE,MATCH(B197,'[1]Pt1-AvionicsComponentCosts'!$A:$A,0),MATCH(\"END MARKER\",'[1]Pt1-AvionicsComponentCosts'!$11:$11,0))","v":971537},0.75,0.75,""]
[null,73,{"$f":"INDEX('[1]Pt1-AvionicsComponentCosts'!$A:$B,MATCH(B198,'[1]Pt1-AvionicsComponentCosts'!$A:$A,0),2)","v":"Business Jet"},"Embraer",1,"Lineage 1000","Embraer Lineage 1000","Lineage 1000","Lineage 1000",{"$f":"MATCH(\"*\"&F198&\"*\",Sheet1!C:C,0)","v":{"$error":"#N/A"}},{"$f":"MATCH(\"*\"&H198&\"*\",Sheet1!C:C,0)","v":{"$error":"#N/A"}},{"$f":"MATCH(\"*\"&I198&\"*\",Sheet1!B:B,0)","v":{"$error":"#N/A"}},53,null,"https://www.jetfinder.com/most-expensive-private-jets/",{"$f":"INDEX('[1]Pt1-AvionicsComponentCosts'!$A:$NE,MATCH(B198,'[1]Pt1-AvionicsComponentCosts'!$A:$A,0),MATCH(\"END MARKER\",'[1]Pt1-AvionicsComponentCosts'!$11:$11,0))","v":975297},0.75,0.75,0.13801372641509432]
[null,56,{"$f":"INDEX('[1]Pt1-AvionicsComponentCosts'!$A:$B,MATCH(B199,'[1]Pt1-AvionicsComponentCosts'!$A:$A,0),2)","v":"Business Jet"},"Embraer",1,"Phenom 300","Embraer Phenom 300","Phenom 300","Phenom 300",{"$f":"MATCH(\"*\"&F199&\"*\",Sheet1!C:C,0)","v":{"$error":"#N/A"}},{"$f":"MATCH(\"*\"&H199&\"*\",Sheet1!C:C,0)","v":{"$error":"#N/A"}},{"$f":"MATCH(\"*\"&I199&\"*\",Sheet1!B:B,0)","v":{"$error":"#N/A"}},12,null,"https://privatejetcardcomparisons.com/aircraft/embraer/phenom-300/",{"$f":"INDEX('[1]Pt1-AvionicsComponentCosts'!$A:$NE,MATCH(B199,'[1]Pt1-AvionicsComponentCosts'!$A:$A,0),MATCH(\"END MARKER\",'[1]Pt1-AvionicsComponentCosts'!$11:$11,0))","v":452749},0.75,0.75,0.28296812500000001]
[null,641,{"$f":"INDEX('[1]Pt1-AvionicsComponentCosts'!$A:$B,MATCH(B200,'[1]Pt1-AvionicsComponentCosts'!$A:$A,0),2)","v":"Business Jet"},"Embraer",1,"Phenom 300X","Embraer Phenom 300X","Phenom 300X","Phenom 300X",{"$f":"MATCH(\"*\"&F200&\"*\",Sheet1!C:C,0)","v":{"$error":"#N/A"}},{"$f":"MATCH(\"*\"&H200&\"*\",Sheet1!C:C,0)","v":{"$error":"#N/A"}},{"$f":"MATCH(\"*\"&I200&\"*\",Sheet1!B:B,0)","v":{"$error":"#N/A"}},null,null,null,{"$f":"INDEX('[1]Pt1-AvionicsComponentCosts'!$A:$NE,MATCH(B200,'[1]Pt1-AvionicsComponentCosts'!$A:$A,0),MATCH(\"END MARKER\",'[1]Pt1-AvionicsComponentCosts'!$11:$11,0))","v":452749},0.75,0.75,""]
[null,57,{"$f":"INDEX('[1]Pt1-AvionicsComponentCosts'!$A:$B,MATCH(B201,'[1]Pt1-AvionicsComponentCosts'!$A:$A,0),2)","v":"Business Jet"},"Embraer",1,"Legacy 450/Praetor 500","Legacy 450/Praetor 500","Legacy 450/Praetor 500","Legacy 450/Praetor 500",{"$f":"MATCH(\"*\"&F201&\"*\",Sheet1!C:C,0)","v":{"$error":"#N/A"}},{"$f":"MATCH(\"*\"&H201&\"*\",Sheet1!C:C,0)","v":{"$error":"#N/A"}},{"$f":"MATCH(\"*\"&I201&\"*\",Sheet1!B:B,0)","v":{"$error":"#N/A"}},null,null,null,{"$f":"INDEX('[1]Pt1-AvionicsComponentCosts'!$A:$NE,MATCH(B201,'[1]Pt1-AvionicsComponentCosts'!$A:$A,0),MATCH(\"END MARKER\",'[1]Pt1-AvionicsComponentCosts'!$11:$11,0))","v":725690},0.75,0.75,""]
[null,58,{"$f":"INDEX('[1]Pt1-AvionicsComponentCosts'!$A:$B,MATCH(B202,'[1]Pt1-AvionicsComponentCosts'!$A:$A,0),2)","v":"Business Jet"},"Embraer",1,"Legacy 500/Praetor 600","Legacy 500/Praetor 600","Legacy 500/Praetor 600","Legacy 500/Praetor 600",{"$f":"MATCH(\"*\"&F202&\"*\",Sheet1!C:C,0)","v":{"$error":"#N/A"}},{"$f":"MATCH(\"*\"&H202&\"*\",Sheet1!C:C,0)","v":{"$error":"#N/A"}},{"$f":"MATCH(\"*\"&I202&\"*\",Sheet1!B:B,0)","v":{"$error":"#N/A"}},20,null,"https://www.jetfinder.com/most-expensive-private-jets/",{"$f":"INDEX('[1]Pt1-AvionicsComponentCosts'!$A:$NE,MATCH(B202,'[1]Pt1-AvionicsComponentCosts'!$A:$A,0),MATCH(\"END MARKER\",'[1]Pt1-AvionicsComponentCosts'!$11:$11,0))","v":725690},0.75,0.75,0.27213374999999995]
[null,55,{"$f":"INDEX('[1]Pt1-AvionicsComponentCosts'!$A:$B,MATCH(B203,'[1]Pt1-AvionicsComponentCosts'!$A:$A,0),2)","v":"Business Jet"},"Embraer",1,"Phenom 100","Embraer Phenom 100","Phenom 100","Phenom 100",{"$f":"MATCH(\"*\"&F203&\"*\",Sheet1!C:C,0)","v":{"$error":"#N/A"}},{"$f":"MATCH(\"*\"&H203&\"*\",Sheet1!C:C,0)","v":{"$error":"#N/A"}},{"$f":"MATCH(\"*\"&I203&\"*\",Sheet1!B:B,0)","v":{"$error":"#N/A"}},null,null,null,{"$f":"INDEX('[1]Pt1-AvionicsComponentCosts'!$A:$NE,MATCH(B203,'[1]Pt1-AvionicsComponentCosts'!$A:$A,0),MATCH(\"END MARKER\",'[1]Pt1-AvionicsComponentCosts'!$11:$11,0))","v":206293},0.75,0.75,""]
[null,671,{"$f":"INDEX('[1]Pt1-AvionicsComponentCosts'!$A:$B,MATCH(B204,'[1]Pt1-AvionicsComponentCosts'!$A:$A,0),2)","v":"Freighter"},"Embraer",1,"Embraer E170/190","Embraer E190F (P2F)","E190F (P2F)","E190F (P2F)",{"$f":"MATCH(\"*\"&F204&\"*\",Sheet1!C:C,0)","v":{"$error":"#N/A"}},{"$f":"MATCH(\"*\"&H204&\"*\",Sheet1!C:C,0)","v":{"$error":"#N/A"}},{"$f":"MATCH(\"*\"&I204&\"*\",Sheet1!B:B,0)","v":{"$error":"#N/A"}},null,null,null,{"$f":"INDEX('[1]Pt1-AvionicsComponentCosts'!$A:$NE,MATCH(B204,'[1]Pt1-AvionicsComponentCosts'!$A:$A,0),MATCH(\"END MARKER\",'[1]Pt1-AvionicsComponentCosts'!$11:$11,0))","v":990021},0.5,0.5,""]
[null,672,{"$f":"INDEX('[1]Pt1-AvionicsComponentCosts'!$A:$B,MATCH(B205,'[1]Pt1-AvionicsComponentCosts'!$A:$A,0),2)","v":"Freighter"},"Embraer",1,"Embraer E170/190","Embraer E195F (P2F)","E195F (P2F)","E195F (P2F)",{"$f":"MATCH(\"*\"&F205&\"*\",Sheet1!C:C,0)","v":{"$error":"#N/A"}},{"$f":"MATCH(\"*\"&H205&\"*\",Sheet1!C:C,0)","v":{"$error":"#N/A"}},{"$f":"MATCH(\"*\"&I205&\"*\",Sheet1!B:B,0)","v":{"$error":"#N/A"}},null,null,null,{"$f":"INDEX('[1]Pt1-AvionicsComponentCosts'!$A:$NE,MATCH(B205,'[1]Pt1-AvionicsComponentCosts'!$A:$A,0),MATCH(\"END MARKER\",'[1]Pt1-AvionicsComponentCosts'!$11:$11,0))","v":990021},0.5,0.5,""]
[null,159,{"$f":"INDEX('[1]Pt1-AvionicsComponentCosts'!$A:$B,MATCH(B206,'[1]Pt1-AvionicsComponentCosts'!$A:$A,0),2)","v":"Military Transport / Special Mission"},"Embraer",1,"Embraer KC-390","Embraer KC-390","KC-390","KC-390",{"$f":"MATCH(\"*\"&F206&\"*\",Sheet1!C:C,0)","v":{"$error":"#N/A"}},{"$f":"MATCH(\"*\"&H206&\"*\",Sheet1!C:C,0)","v":{"$error":"#N/A"}},{"$f":"MATCH(\"*\"&I206&\"*\",Sheet1!B:B,0)","v":{"$error":"#N/A"}},null,null,null,{"$f":"INDEX('[1]Pt1-AvionicsComponentCosts'!$A:$NE,MATCH(B206,'[1]Pt1-AvionicsComponentCosts'!$A:$A,0),MATCH(\"END MARKER\",'[1]Pt1-AvionicsComponentCosts'!$11:$11,0))","v":3043730},1,1,""]
[null,580,{"$f":"INDEX('[1]Pt1-AvionicsComponentCosts'!$A:$B,MATCH(B207,'[1]Pt1-AvionicsComponentCosts'!$A:$A,0),2)","v":"Regional"},"Embraer",1,"Embraer E170/190","Embraer E170","E170","E170",{"$f":"MATCH(\"*\"&F207&\"*\",Sheet1!C:C,0)","v":{"$error":"#N/A"}},{"$f":"MATCH(\"*\"&H207&\"*\",Sheet1!C:C,0)","v":{"$error":"#N/A"}},{"$f":"MATCH(\"*\"&I207&\"*\",Sheet1!B:B,0)","v":{"$error":"#N/A"}},46.3,null,"https://www.aeroflap.com.br/en/find-out-how-much-an-embraer-plane-and-jet-costs/",{"$f":"INDEX('[1]Pt1-AvionicsComponentCosts'!$A:$NE,MATCH(B207,'[1]Pt1-AvionicsComponentCosts'!$A:$A,0),MATCH(\"END MARKER\",'[1]Pt1-AvionicsComponentCosts'!$11:$11,0))","v":977179},0.65,0.65,0.13718495680345572]
[null,22,{"$f":"INDEX('[1]Pt1-AvionicsComponentCosts'!$A:$B,MATCH(B208,'[1]Pt1-AvionicsComponentCosts'!$A:$A,0),2)","v":"Regional"},"Embraer",1,"Embraer E170/190","Embraer E175","E175","E175",{"$f":"MATCH(\"*\"&F208&\"*\",Sheet1!C:C,0)","v":{"$error":"#N/A"}},{"$f":"MATCH(\"*\"&H208&\"*\",Sheet1!C:C,0)","v":{"$error":"#N/A"}},{"$f":"MATCH(\"*\"&I208&\"*\",Sheet1!B:B,0)","v":{"$error":"#N/A"}},49.9,null,"https://www.aeroflap.com.br/en/find-out-how-much-an-embraer-plane-and-jet-costs/",{"$f":"INDEX('[1]Pt1-AvionicsComponentCosts'!$A:$NE,MATCH(B208,'[1]Pt1-AvionicsComponentCosts'!$A:$A,0),MATCH(\"END MARKER\",'[1]Pt1-AvionicsComponentCosts'!$11:$11,0))","v":977179},0.65,0.65,0.12728784569138277]
[null,24,{"$f":"INDEX('[1]Pt1-AvionicsComponentCosts'!$A:$B,MATCH(B209,'[1]Pt1-AvionicsComponentCosts'!$A:$A,0),2)","v":"Regional"},"Embraer",1,"Embraer E170/190","Embraer E175-E2","E175-E2","E175-E2",{"$f":"MATCH(\"*\"&F209&\"*\",Sheet1!C:C,0)","v":{"$error":"#N/A"}},{"$f":"MATCH(\"*\"&H209&\"*\",Sheet1!C:C,0)","v":{"$error":"#N/A"}},{"$f":"MATCH(\"*\"&I209&\"*\",Sheet1!B:B,0)","v":{"$error":"#N/A"}},56.4,null,"https://www.aeroflap.com.br/en/find-out-how-much-an-embraer-plane-and-jet-costs/",{"$f":"INDEX('[1]Pt1-AvionicsComponentCosts'!$A:$NE,MATCH(B209,'[1]Pt1-AvionicsComponentCosts'!$A:$A,0),MATCH(\"END MARKER\",'[1]Pt1-AvionicsComponentCosts'!$11:$11,0))","v":987930},0.65,0.65,0.11385718085106383]
[null,23,{"$f":"INDEX('[1]Pt1-AvionicsComponentCosts'!$A:$B,MATCH(B210,'[1]Pt1-AvionicsComponentCosts'!$A:$A,0),2)","v":"Regional"},"Embraer",1,"Embraer E170/190","Embraer E190","E190","E190",{"$f":"MATCH(\"*\"&F210&\"*\",Sheet1!C:C,0)","v":{"$error":"#N/A"}},{"$f":"MATCH(\"*\"&H210&\"*\",Sheet1!C:C,0)","v":{"$error":"#N/A"}},{"$f":"MATCH(\"*\"&I210&\"*\",Sheet1!B:B,0)","v":{"$error":"#N/A"}},55.3,null,"https://www.aeroflap.com.br/en/find-out-how-much-an-embraer-plane-and-jet-costs/",{"$f":"INDEX('[1]Pt1-AvionicsComponentCosts'!$A:$NE,MATCH(B210,'[1]Pt1-AvionicsComponentCosts'!$A:$A,0),MATCH(\"END MARKER\",'[1]Pt1-AvionicsComponentCosts'!$11:$11,0))","v":977179},0.65,0.65,0.11485829113924051]
[null,25,{"$f":"INDEX('[1]Pt1-AvionicsComponentCosts'!$A:$B,MATCH(B211,'[1]Pt1-AvionicsComponentCosts'!$A:$A,0),2)","v":"Regional"},"Embraer",1,"Embraer E170/190","Embraer E190-E2","E190-E2","E190-E2",{"$f":"MATCH(\"*\"&F211&\"*\",Sheet1!C:C,0)","v":{"$error":"#N/A"}},{"$f":"MATCH(\"*\"&H211&\"*\",Sheet1!C:C,0)","v":{"$error":"#N/A"}},{"$f":"MATCH(\"*\"&I211&\"*\",Sheet1!B:B,0)","v":{"$error":"#N/A"}},64.599999999999994,null,"https://www.aeroflap.com.br/en/find-out-how-much-an-embraer-plane-and-jet-costs/",{"$f":"INDEX('[1]Pt1-AvionicsComponentCosts'!$A:$NE,MATCH(B211,'[1]Pt1-AvionicsComponentCosts'!$A:$A,0),MATCH(\"END MARKER\",'[1]Pt1-AvionicsComponentCosts'!$11:$11,0))","v":977179},0.65,0.65,9.8322964396284837E-2]
[null,558,{"$f":"INDEX('[1]Pt1-AvionicsComponentCosts'!$A:$B,MATCH(B212,'[1]Pt1-AvionicsComponentCosts'!$A:$A,0),2)","v":"Regional"},"Embraer",1,"Embraer E170/190","Embraer E195","E195","E195",{"$f":"MATCH(\"*\"&F212&\"*\",Sheet1!C:C,0)","v":{"$error":"#N/A"}},{"$f":"MATCH(\"*\"&H212&\"*\",Sheet1!C:C,0)","v":{"$error":"#N/A"}},{"$f":"MATCH(\"*\"&I212&\"*\",Sheet1!B:B,0)","v":{"$error":"#N/A"}},58.5,null,"https://www.aeroflap.com.br/en/find-out-how-much-an-embraer-plane-and-jet-costs/",{"$f":"INDEX('[1]Pt1-AvionicsComponentCosts'!$A:$NE,MATCH(B212,'[1]Pt1-AvionicsComponentCosts'!$A:$A,0),MATCH(\"END MARKER\",'[1]Pt1-AvionicsComponentCosts'!$11:$11,0))","v":977179},0.65,0.65,0.10857544444444445]
[null,559,{"$f":"INDEX('[1]Pt1-AvionicsComponentCosts'!$A:$B,MATCH(B213,'[1]Pt1-AvionicsComponentCosts'!$A:$A,0),2)","v":"Regional"},"Embraer",1,"Embraer E170/190","Embraer E195-E2","E195-E2","E195-E2",{"$f":"MATCH(\"*\"&F213&\"*\",Sheet1!C:C,0)","v":{"$error":"#N/A"}},{"$f":"MATCH(\"*\"&H213&\"*\",Sheet1!C:C,0)","v":{"$error":"#N/A"}},{"$f":"MATCH(\"*\"&I213&\"*\",Sheet1!B:B,0)","v":{"$error":"#N/A"}},72.8,null,"https://www.aeroflap.com.br/en/find-out-how-much-an-embraer-plane-and-jet-costs/",{"$f":"INDEX('[1]Pt1-AvionicsComponentCosts'!$A:$NE,MATCH(B213,'[1]Pt1-AvionicsComponentCosts'!$A:$A,0),MATCH(\"END MARKER\",'[1]Pt1-AvionicsComponentCosts'!$11:$11,0))","v":977179},0.65,0.65,8.724812500000001E-2]
[null,617,{"$f":"INDEX('[1]Pt1-AvionicsComponentCosts'!$A:$B,MATCH(B214,'[1]Pt1-AvionicsComponentCosts'!$A:$A,0),2)","v":"Regional"},"Embraer",1,"ERJ 135/140/145","Embraer ERJ 135/140/145","ERJ 135/140/145","ERJ 135/140/145",{"$f":"MATCH(\"*\"&F214&\"*\",Sheet1!C:C,0)","v":{"$error":"#N/A"}},{"$f":"MATCH(\"*\"&H214&\"*\",Sheet1!C:C,0)","v":{"$error":"#N/A"}},{"$f":"MATCH(\"*\"&I214&\"*\",Sheet1!B:B,0)","v":{"$error":"#N/A"}},null,null,null,{"$f":"INDEX('[1]Pt1-AvionicsComponentCosts'!$A:$NE,MATCH(B214,'[1]Pt1-AvionicsComponentCosts'!$A:$A,0),MATCH(\"END MARKER\",'[1]Pt1-AvionicsComponentCosts'!$11:$11,0))","v":925102},0.65,0.65,""]
[null,170,{"$f":"INDEX('[1]Pt1-AvionicsComponentCosts'!$A:$B,MATCH(B215,'[1]Pt1-AvionicsComponentCosts'!$A:$A,0),2)","v":"Turboprop Trainers / Light Attack"},"Embraer",1,"Tucano","Embraer EMB 312/314 Tucano","EMB 312/314 Tucano","EMB 312/314 Tucano",{"$f":"MATCH(\"*\"&F215&\"*\",Sheet1!C:C,0)","v":{"$error":"#N/A"}},{"$f":"MATCH(\"*\"&H215&\"*\",Sheet1!C:C,0)","v":{"$error":"#N/A"}},{"$f":"MATCH(\"*\"&I215&\"*\",Sheet1!B:B,0)","v":{"$error":"#N/A"}},null,null,null,{"$f":"INDEX('[1]Pt1-AvionicsComponentCosts'!$A:$NE,MATCH(B215,'[1]Pt1-AvionicsComponentCosts'!$A:$A,0),MATCH(\"END MARKER\",'[1]Pt1-AvionicsComponentCosts'!$11:$11,0))","v":471641},1,1,""]
[null,613,{"$f":"INDEX('[1]Pt1-AvionicsComponentCosts'!$A:$B,MATCH(B216,'[1]Pt1-AvionicsComponentCosts'!$A:$A,0),2)","v":"Regional"},"Embraer ",1,"Embraer ","New Embraer turboprop","New turboprop","New turboprop",{"$f":"MATCH(\"*\"&F216&\"*\",Sheet1!C:C,0)","v":{"$error":"#N/A"}},{"$f":"MATCH(\"*\"&H216&\"*\",Sheet1!C:C,0)","v":{"$error":"#N/A"}},{"$f":"MATCH(\"*\"&I216&\"*\",Sheet1!B:B,0)","v":{"$error":"#N/A"}},null,null,null,{"$f":"INDEX('[1]Pt1-AvionicsComponentCosts'!$A:$NE,MATCH(B216,'[1]Pt1-AvionicsComponentCosts'!$A:$A,0),MATCH(\"END MARKER\",'[1]Pt1-AvionicsComponentCosts'!$11:$11,0))","v":922416},0.65,0.65,""]
[null,680,{"$f":"INDEX('[1]Pt1-AvionicsComponentCosts'!$A:$B,MATCH(B217,'[1]Pt1-AvionicsComponentCosts'!$A:$A,0),2)","v":"Turbine GA"},"Epic",1,"Epic E1000","Epic E1000GX","E1000GX","E1000GX",{"$f":"MATCH(\"*\"&F217&\"*\",Sheet1!C:C,0)","v":{"$error":"#N/A"}},{"$f":"MATCH(\"*\"&H217&\"*\",Sheet1!C:C,0)","v":{"$error":"#N/A"}},{"$f":"MATCH(\"*\"&I217&\"*\",Sheet1!B:B,0)","v":{"$error":"#N/A"}},4.45,null,"https://www.ainonline.com/aviation-news/business-aviation/2023-07-24/epic-gradually-raising-production-turboprop-single",{"$f":"INDEX('[1]Pt1-AvionicsComponentCosts'!$A:$NE,MATCH(B217,'[1]Pt1-AvionicsComponentCosts'!$A:$A,0),MATCH(\"END MARKER\",'[1]Pt1-AvionicsComponentCosts'!$11:$11,0))","v":217209},1,1,0.48811011235955054]
[null,673,{"$f":"INDEX('[1]Pt1-AvionicsComponentCosts'!$A:$B,MATCH(B218,'[1]Pt1-AvionicsComponentCosts'!$A:$A,0),2)","v":"UAV"},"Eurodrone",1,"Eurodrone","Eurodrone",{"$f":"G218","v":"Eurodrone"},"Eurodrone",{"$f":"MATCH(\"*\"&F218&\"*\",Sheet1!C:C,0)","v":{"$error":"#N/A"}},{"$f":"MATCH(\"*\"&H218&\"*\",Sheet1!C:C,0)","v":{"$error":"#N/A"}},{"$f":"MATCH(\"*\"&I218&\"*\",Sheet1!B:B,0)","v":{"$error":"#N/A"}},null,null,null,{"$f":"INDEX('[1]Pt1-AvionicsComponentCosts'!$A:$NE,MATCH(B218,'[1]Pt1-AvionicsComponentCosts'!$A:$A,0),MATCH(\"END MARKER\",'[1]Pt1-AvionicsComponentCosts'!$11:$11,0))","v":959716},1,1,""]
[null,142,{"$f":"INDEX('[1]Pt1-AvionicsComponentCosts'!$A:$B,MATCH(B219,'[1]Pt1-AvionicsComponentCosts'!$A:$A,0),2)","v":"Fighters and Jet Trainers"},"Eurofighter",1,"Eurofighter Typhoon","Eurofighter Typhoon","Typhoon","Typhoon",{"$f":"MATCH(\"*\"&F219&\"*\",Sheet1!C:C,0)","v":{"$error":"#N/A"}},{"$f":"MATCH(\"*\"&H219&\"*\",Sheet1!C:C,0)","v":{"$error":"#N/A"}},{"$f":"MATCH(\"*\"&I219&\"*\",Sheet1!B:B,0)","v":{"$error":"#N/A"}},null,null,null,{"$f":"INDEX('[1]Pt1-AvionicsComponentCosts'!$A:$NE,MATCH(B219,'[1]Pt1-AvionicsComponentCosts'!$A:$A,0),MATCH(\"END MARKER\",'[1]Pt1-AvionicsComponentCosts'!$11:$11,0))","v":2713901},1,1,""]
[null,171,{"$f":"INDEX('[1]Pt1-AvionicsComponentCosts'!$A:$B,MATCH(B220,'[1]Pt1-AvionicsComponentCosts'!$A:$A,0),2)","v":"Fighters and Jet Trainers"},"FMA",1,"FMA IA 63 Pampa","FMA IA 63 Pampa","IA 63 Pampa","IA 63 Pampa",{"$f":"MATCH(\"*\"&F220&\"*\",Sheet1!C:C,0)","v":{"$error":"#N/A"}},{"$f":"MATCH(\"*\"&H220&\"*\",Sheet1!C:C,0)","v":{"$error":"#N/A"}},{"$f":"MATCH(\"*\"&I220&\"*\",Sheet1!B:B,0)","v":{"$error":"#N/A"}},null,null,null,{"$f":"INDEX('[1]Pt1-AvionicsComponentCosts'!$A:$NE,MATCH(B220,'[1]Pt1-AvionicsComponentCosts'!$A:$A,0),MATCH(\"END MARKER\",'[1]Pt1-AvionicsComponentCosts'!$11:$11,0))","v":1158497},1,1,""]
[null,144,{"$f":"INDEX('[1]Pt1-AvionicsComponentCosts'!$A:$B,MATCH(B221,'[1]Pt1-AvionicsComponentCosts'!$A:$A,0),2)","v":"Fighters and Jet Trainers"},"General Dynamics",1,"F-16","General Dynamics F-16 Fighting Falcon","F-16 Fighting Falcon","F-16 Fighting Falcon",{"$f":"MATCH(\"*\"&F221&\"*\",Sheet1!C:C,0)","v":{"$error":"#N/A"}},{"$f":"MATCH(\"*\"&H221&\"*\",Sheet1!C:C,0)","v":{"$error":"#N/A"}},{"$f":"MATCH(\"*\"&I221&\"*\",Sheet1!B:B,0)","v":{"$error":"#N/A"}},null,null,null,{"$f":"INDEX('[1]Pt1-AvionicsComponentCosts'!$A:$NE,MATCH(B221,'[1]Pt1-AvionicsComponentCosts'!$A:$A,0),MATCH(\"END MARKER\",'[1]Pt1-AvionicsComponentCosts'!$11:$11,0))","v":2990958},1,1,""]
[null,545,{"$f":"INDEX('[1]Pt1-AvionicsComponentCosts'!$A:$B,MATCH(B222,'[1]Pt1-AvionicsComponentCosts'!$A:$A,0),2)","v":"Turbine GA"},"GippsAero",1,"Airvan 10","GippsAero GA10 Airvan","GA10 Airvan","GA10 Airvan",{"$f":"MATCH(\"*\"&F222&\"*\",Sheet1!C:C,0)","v":{"$error":"#N/A"}},{"$f":"MATCH(\"*\"&H222&\"*\",Sheet1!C:C,0)","v":{"$error":"#N/A"}},{"$f":"MATCH(\"*\"&I222&\"*\",Sheet1!B:B,0)","v":{"$error":"#N/A"}},null,"OOP","https://www.avweb.com/aviation-news/mahindra-shutters-gippsaero-puts-it-up-for-sale/",{"$f":"INDEX('[1]Pt1-AvionicsComponentCosts'!$A:$NE,MATCH(B222,'[1]Pt1-AvionicsComponentCosts'!$A:$A,0),MATCH(\"END MARKER\",'[1]Pt1-AvionicsComponentCosts'!$11:$11,0))","v":211406},1,1,""]
[null,172,{"$f":"INDEX('[1]Pt1-AvionicsComponentCosts'!$A:$B,MATCH(B223,'[1]Pt1-AvionicsComponentCosts'!$A:$A,0),2)","v":"Turboprop Trainers / Light Attack"},"Grob",1,"Grob G 120TP","Grob G 120TP","G 120TP","G 120TP",{"$f":"MATCH(\"*\"&F223&\"*\",Sheet1!C:C,0)","v":{"$error":"#N/A"}},{"$f":"MATCH(\"*\"&H223&\"*\",Sheet1!C:C,0)","v":{"$error":"#N/A"}},{"$f":"MATCH(\"*\"&I223&\"*\",Sheet1!B:B,0)","v":{"$error":"#N/A"}},null,null,null,{"$f":"INDEX('[1]Pt1-AvionicsComponentCosts'!$A:$NE,MATCH(B223,'[1]Pt1-AvionicsComponentCosts'!$A:$A,0),MATCH(\"END MARKER\",'[1]Pt1-AvionicsComponentCosts'!$11:$11,0))","v":466911},1,1,""]
[null,651,{"$f":"INDEX('[1]Pt1-AvionicsComponentCosts'!$A:$B,MATCH(B224,'[1]Pt1-AvionicsComponentCosts'!$A:$A,0),2)","v":"Business Jet"},"Gulfstream",1,"G400","Gulfstream G400","G400","G400",{"$f":"MATCH(\"*\"&F224&\"*\",Sheet1!C:C,0)","v":{"$error":"#N/A"}},{"$f":"MATCH(\"*\"&H224&\"*\",Sheet1!C:C,0)","v":{"$error":"#N/A"}},{"$f":"MATCH(\"*\"&I224&\"*\",Sheet1!B:B,0)","v":{"$error":"#N/A"}},34.5,null,"https://www.corporatejetinvestor.com/aircraft/buyers-guide-gulfstream-g400-business-jet/",{"$f":"INDEX('[1]Pt1-AvionicsComponentCosts'!$A:$NE,MATCH(B224,'[1]Pt1-AvionicsComponentCosts'!$A:$A,0),MATCH(\"END MARKER\",'[1]Pt1-AvionicsComponentCosts'!$11:$11,0))","v":1020113},0.75,0.75,0.22176369565217391]
[null,59,{"$f":"INDEX('[1]Pt1-AvionicsComponentCosts'!$A:$B,MATCH(B225,'[1]Pt1-AvionicsComponentCosts'!$A:$A,0),2)","v":"Business Jet"},"Gulfstream",1,"G450","Gulfstream G450","G450","G450",{"$f":"MATCH(\"*\"&F225&\"*\",Sheet1!C:C,0)","v":{"$error":"#N/A"}},{"$f":"MATCH(\"*\"&H225&\"*\",Sheet1!C:C,0)","v":{"$error":"#N/A"}},{"$f":"MATCH(\"*\"&I225&\"*\",Sheet1!B:B,0)","v":{"$error":"#N/A"}},38,"2016 PRICE","https://www.sherpareport.com/aircraft/costs-gulfstream-g450.html",{"$f":"INDEX('[1]Pt1-AvionicsComponentCosts'!$A:$NE,MATCH(B225,'[1]Pt1-AvionicsComponentCosts'!$A:$A,0),MATCH(\"END MARKER\",'[1]Pt1-AvionicsComponentCosts'!$11:$11,0))","v":971537},0.75,0.75,0.19175072368421051]
[null,61,{"$f":"INDEX('[1]Pt1-AvionicsComponentCosts'!$A:$B,MATCH(B226,'[1]Pt1-AvionicsComponentCosts'!$A:$A,0),2)","v":"Business Jet"},"Gulfstream",1,"G500/G600","Gulfstream G500","G500","G500",{"$f":"MATCH(\"*\"&F226&\"*\",Sheet1!C:C,0)","v":{"$error":"#N/A"}},{"$f":"MATCH(\"*\"&H226&\"*\",Sheet1!C:C,0)","v":{"$error":"#N/A"}},{"$f":"MATCH(\"*\"&I226&\"*\",Sheet1!B:B,0)","v":{"$error":"#N/A"}},44,null,"https://www.jetfinder.com/most-expensive-private-jets/",{"$f":"INDEX('[1]Pt1-AvionicsComponentCosts'!$A:$NE,MATCH(B226,'[1]Pt1-AvionicsComponentCosts'!$A:$A,0),MATCH(\"END MARKER\",'[1]Pt1-AvionicsComponentCosts'!$11:$11,0))","v":971537},0.75,0.75,0.16560289772727274]
[null,62,{"$f":"INDEX('[1]Pt1-AvionicsComponentCosts'!$A:$B,MATCH(B227,'[1]Pt1-AvionicsComponentCosts'!$A:$A,0),2)","v":"Business Jet"},"Gulfstream",1,"G500/G600","Gulfstream G600 ","G600","G600",{"$f":"MATCH(\"*\"&F227&\"*\",Sheet1!C:C,0)","v":{"$error":"#N/A"}},{"$f":"MATCH(\"*\"&H227&\"*\",Sheet1!C:C,0)","v":{"$error":"#N/A"}},{"$f":"MATCH(\"*\"&I227&\"*\",Sheet1!B:B,0)","v":{"$error":"#N/A"}},59.5,null,"https://infogram.com/bca-table-2023-jets-ultra-long-range-1ho16vorwrqkx4n",{"$f":"INDEX('[1]Pt1-AvionicsComponentCosts'!$A:$NE,MATCH(B227,'[1]Pt1-AvionicsComponentCosts'!$A:$A,0),MATCH(\"END MARKER\",'[1]Pt1-AvionicsComponentCosts'!$11:$11,0))","v":971537},0.75,0.75,0.12246264705882354]
[null,60,{"$f":"INDEX('[1]Pt1-AvionicsComponentCosts'!$A:$B,MATCH(B228,'[1]Pt1-AvionicsComponentCosts'!$A:$A,0),2)","v":"Business Jet"},"Gulfstream",1,"G550","Gulfstream G550","G550","G550",{"$f":"MATCH(\"*\"&F228&\"*\",Sheet1!C:C,0)","v":{"$error":"#N/A"}},{"$f":"MATCH(\"*\"&H228&\"*\",Sheet1!C:C,0)","v":{"$error":"#N/A"}},{"$f":"MATCH(\"*\"&I228&\"*\",Sheet1!B:B,0)","v":{"$error":"#N/A"}},62,null,"https://privatejetcardcomparisons.com/aircraft/gulfstream/g550/",{"$f":"INDEX('[1]Pt1-AvionicsComponentCosts'!$A:$NE,MATCH(B228,'[1]Pt1-AvionicsComponentCosts'!$A:$A,0),MATCH(\"END MARKER\",'[1]Pt1-AvionicsComponentCosts'!$11:$11,0))","v":971537},0.75,0.75,0.1175246370967742]
[null,63,{"$f":"INDEX('[1]Pt1-AvionicsComponentCosts'!$A:$B,MATCH(B229,'[1]Pt1-AvionicsComponentCosts'!$A:$A,0),2)","v":"Business Jet"},"Gulfstream",1,"G650","Gulfstream G650","G650","G650",{"$f":"MATCH(\"*\"&F229&\"*\",Sheet1!C:C,0)","v":{"$error":"#N/A"}},{"$f":"MATCH(\"*\"&H229&\"*\",Sheet1!C:C,0)","v":{"$error":"#N/A"}},{"$f":"MATCH(\"*\"&I229&\"*\",Sheet1!B:B,0)","v":{"$error":"#N/A"}},68.5,null,"https://infogram.com/bca-table-2023-jets-ultra-long-range-1ho16vorwrqkx4n",{"$f":"INDEX('[1]Pt1-AvionicsComponentCosts'!$A:$NE,MATCH(B229,'[1]Pt1-AvionicsComponentCosts'!$A:$A,0),MATCH(\"END MARKER\",'[1]Pt1-AvionicsComponentCosts'!$11:$11,0))","v":971537},0.75,0.75,0.10637266423357664]
[null,598,{"$f":"INDEX('[1]Pt1-AvionicsComponentCosts'!$A:$B,MATCH(B230,'[1]Pt1-AvionicsComponentCosts'!$A:$A,0),2)","v":"Business Jet"},"Gulfstream",1,"G700","Gulfstream G700","G700","G700",{"$f":"MATCH(\"*\"&F230&\"*\",Sheet1!C:C,0)","v":{"$error":"#N/A"}},{"$f":"MATCH(\"*\"&H230&\"*\",Sheet1!C:C,0)","v":{"$error":"#N/A"}},{"$f":"MATCH(\"*\"&I230&\"*\",Sheet1!B:B,0)","v":{"$error":"#N/A"}},79.900000000000006,null,"https://infogram.com/bca-table-2023-jets-ultra-long-range-1ho16vorwrqkx4n",{"$f":"INDEX('[1]Pt1-AvionicsComponentCosts'!$A:$NE,MATCH(B230,'[1]Pt1-AvionicsComponentCosts'!$A:$A,0),MATCH(\"END MARKER\",'[1]Pt1-AvionicsComponentCosts'!$11:$11,0))","v":971537},0.75,0.75,9.1195588235294112E-2]
[null,670,{"$f":"INDEX('[1]Pt1-AvionicsComponentCosts'!$A:$B,MATCH(B231,'[1]Pt1-AvionicsComponentCosts'!$A:$A,0),2)","v":"Business Jet"},"Gulfstream",1,"G800","Gulfstream G800","G800","G800",{"$f":"MATCH(\"*\"&F231&\"*\",Sheet1!C:C,0)","v":{"$error":"#N/A"}},{"$f":"MATCH(\"*\"&H231&\"*\",Sheet1!C:C,0)","v":{"$error":"#N/A"}},{"$f":"MATCH(\"*\"&I231&\"*\",Sheet1!B:B,0)","v":{"$error":"#N/A"}},72.5,null,"https://infogram.com/bca-table-2023-jets-ultra-long-range-1ho16vorwrqkx4n",{"$f":"INDEX('[1]Pt1-AvionicsComponentCosts'!$A:$NE,MATCH(B231,'[1]Pt1-AvionicsComponentCosts'!$A:$A,0),MATCH(\"END MARKER\",'[1]Pt1-AvionicsComponentCosts'!$11:$11,0))","v":1020113},0.75,0.75,0.10552893103448276]
[null,64,{"$f":"INDEX('[1]Pt1-AvionicsComponentCosts'!$A:$B,MATCH(B232,'[1]Pt1-AvionicsComponentCosts'!$A:$A,0),2)","v":"Business Jet"},"Gulfstream",1,"G100","Gulfstream G100","G100","G100",{"$f":"MATCH(\"*\"&F232&\"*\",Sheet1!C:C,0)","v":{"$error":"#N/A"}},{"$f":"MATCH(\"*\"&H232&\"*\",Sheet1!C:C,0)","v":{"$error":"#N/A"}},{"$f":"MATCH(\"*\"&I232&\"*\",Sheet1!B:B,0)","v":{"$error":"#N/A"}},12,"OOP 2006","https://www.bjtonline.com/aircraft/gulfstream-g100",{"$f":"INDEX('[1]Pt1-AvionicsComponentCosts'!$A:$NE,MATCH(B232,'[1]Pt1-AvionicsComponentCosts'!$A:$A,0),MATCH(\"END MARKER\",'[1]Pt1-AvionicsComponentCosts'!$11:$11,0))","v":732140},0.75,0.75,0.45758749999999998]
[null,454,{"$f":"INDEX('[1]Pt1-AvionicsComponentCosts'!$A:$B,MATCH(B233,'[1]Pt1-AvionicsComponentCosts'!$A:$A,0),2)","v":"Business Jet"},"Gulfstream",1,"G280","Gulfstream G280","G280","G280",{"$f":"MATCH(\"*\"&F233&\"*\",Sheet1!C:C,0)","v":{"$error":"#N/A"}},{"$f":"MATCH(\"*\"&H233&\"*\",Sheet1!C:C,0)","v":{"$error":"#N/A"}},{"$f":"MATCH(\"*\"&I233&\"*\",Sheet1!B:B,0)","v":{"$error":"#N/A"}},25,null,"https://www.bjtonline.com/aircraft/gulfstream-g280",{"$f":"INDEX('[1]Pt1-AvionicsComponentCosts'!$A:$NE,MATCH(B233,'[1]Pt1-AvionicsComponentCosts'!$A:$A,0),MATCH(\"END MARKER\",'[1]Pt1-AvionicsComponentCosts'!$11:$11,0))","v":748383},0.75,0.75,0.22451489999999999]
[null,642,{"$f":"INDEX('[1]Pt1-AvionicsComponentCosts'!$A:$B,MATCH(B234,'[1]Pt1-AvionicsComponentCosts'!$A:$A,0),2)","v":"Business Jet"},"Gulfstream",1,"G285X","Gulfstream G285X","G285X","G285X",{"$f":"MATCH(\"*\"&F234&\"*\",Sheet1!C:C,0)","v":{"$error":"#N/A"}},{"$f":"MATCH(\"*\"&H234&\"*\",Sheet1!C:C,0)","v":{"$error":"#N/A"}},{"$f":"MATCH(\"*\"&I234&\"*\",Sheet1!B:B,0)","v":{"$error":"#N/A"}},null,null,null,{"$f":"INDEX('[1]Pt1-AvionicsComponentCosts'!$A:$NE,MATCH(B234,'[1]Pt1-AvionicsComponentCosts'!$A:$A,0),MATCH(\"END MARKER\",'[1]Pt1-AvionicsComponentCosts'!$11:$11,0))","v":785800},0.75,0.75,""]
[null,174,{"$f":"INDEX('[1]Pt1-AvionicsComponentCosts'!$A:$B,MATCH(B235,'[1]Pt1-AvionicsComponentCosts'!$A:$A,0),2)","v":"Fighters and Jet Trainers"},"HAL",1,"HJT-36 Sitara","HAL HJT-36 Sitara","HJT-36 Sitara","HJT-36 Sitara",{"$f":"MATCH(\"*\"&F235&\"*\",Sheet1!C:C,0)","v":{"$error":"#N/A"}},{"$f":"MATCH(\"*\"&H235&\"*\",Sheet1!C:C,0)","v":{"$error":"#N/A"}},{"$f":"MATCH(\"*\"&I235&\"*\",Sheet1!B:B,0)","v":{"$error":"#N/A"}},null,null,null,{"$f":"INDEX('[1]Pt1-AvionicsComponentCosts'!$A:$NE,MATCH(B235,'[1]Pt1-AvionicsComponentCosts'!$A:$A,0),MATCH(\"END MARKER\",'[1]Pt1-AvionicsComponentCosts'!$11:$11,0))","v":1158497},1,1,""]
[null,143,{"$f":"INDEX('[1]Pt1-AvionicsComponentCosts'!$A:$B,MATCH(B236,'[1]Pt1-AvionicsComponentCosts'!$A:$A,0),2)","v":"Fighters and Jet Trainers"},"HAL",1,"Tejas","HAL Tejas","Tejas","Tejas",{"$f":"MATCH(\"*\"&F236&\"*\",Sheet1!C:C,0)","v":{"$error":"#N/A"}},{"$f":"MATCH(\"*\"&H236&\"*\",Sheet1!C:C,0)","v":{"$error":"#N/A"}},{"$f":"MATCH(\"*\"&I236&\"*\",Sheet1!B:B,0)","v":{"$error":"#N/A"}},null,null,null,{"$f":"INDEX('[1]Pt1-AvionicsComponentCosts'!$A:$NE,MATCH(B236,'[1]Pt1-AvionicsComponentCosts'!$A:$A,0),MATCH(\"END MARKER\",'[1]Pt1-AvionicsComponentCosts'!$11:$11,0))","v":1171288},1,1,""]
[null,116,{"$f":"INDEX('[1]Pt1-AvionicsComponentCosts'!$A:$B,MATCH(B237,'[1]Pt1-AvionicsComponentCosts'!$A:$A,0),2)","v":"Helicopter"},"HAL",1,"HAL Dhruv","HAL Dhruv","Dhruv","Dhruv",{"$f":"MATCH(\"*\"&F237&\"*\",Sheet1!C:C,0)","v":{"$error":"#N/A"}},{"$f":"MATCH(\"*\"&H237&\"*\",Sheet1!C:C,0)","v":{"$error":"#N/A"}},{"$f":"MATCH(\"*\"&I237&\"*\",Sheet1!B:B,0)","v":{"$error":"#N/A"}},null,null,null,{"$f":"INDEX('[1]Pt1-AvionicsComponentCosts'!$A:$NE,MATCH(B237,'[1]Pt1-AvionicsComponentCosts'!$A:$A,0),MATCH(\"END MARKER\",'[1]Pt1-AvionicsComponentCosts'!$11:$11,0))","v":1310929},0.99,0.99,""]
[null,137,{"$f":"INDEX('[1]Pt1-AvionicsComponentCosts'!$A:$B,MATCH(B238,'[1]Pt1-AvionicsComponentCosts'!$A:$A,0),2)","v":"Helicopter"},"HAL",1,"HAL Light Utility Helicopter","HAL Light Utility Helicopter","Light Utility Helicopter","Light Utility Helicopter",{"$f":"MATCH(\"*\"&F238&\"*\",Sheet1!C:C,0)","v":{"$error":"#N/A"}},{"$f":"MATCH(\"*\"&H238&\"*\",Sheet1!C:C,0)","v":{"$error":"#N/A"}},{"$f":"MATCH(\"*\"&I238&\"*\",Sheet1!B:B,0)","v":{"$error":"#N/A"}},null,null,null,{"$f":"INDEX('[1]Pt1-AvionicsComponentCosts'!$A:$NE,MATCH(B238,'[1]Pt1-AvionicsComponentCosts'!$A:$A,0),MATCH(\"END MARKER\",'[1]Pt1-AvionicsComponentCosts'!$11:$11,0))","v":1307315},0.99,0.99,""]
[null,136,{"$f":"INDEX('[1]Pt1-AvionicsComponentCosts'!$A:$B,MATCH(B239,'[1]Pt1-AvionicsComponentCosts'!$A:$A,0),2)","v":"Helicopter"},"HAL",1,"HAL Medium Lift","HAL Medium Lift","Medium Lift","Medium Lift",{"$f":"MATCH(\"*\"&F239&\"*\",Sheet1!C:C,0)","v":{"$error":"#N/A"}},{"$f":"MATCH(\"*\"&H239&\"*\",Sheet1!C:C,0)","v":{"$error":"#N/A"}},{"$f":"MATCH(\"*\"&I239&\"*\",Sheet1!B:B,0)","v":{"$error":"#N/A"}},null,null,null,{"$f":"INDEX('[1]Pt1-AvionicsComponentCosts'!$A:$NE,MATCH(B239,'[1]Pt1-AvionicsComponentCosts'!$A:$A,0),MATCH(\"END MARKER\",'[1]Pt1-AvionicsComponentCosts'!$11:$11,0))","v":1316669},0.99,0.99,""]
[null,677,{"$f":"INDEX('[1]Pt1-AvionicsComponentCosts'!$A:$B,MATCH(B240,'[1]Pt1-AvionicsComponentCosts'!$A:$A,0),2)","v":"Turboprop Trainers / Light Attack"},"HAL",1,"HHT-40","HAL HHT-40","HHT-40","HHT-40",{"$f":"MATCH(\"*\"&F240&\"*\",Sheet1!C:C,0)","v":{"$error":"#N/A"}},{"$f":"MATCH(\"*\"&H240&\"*\",Sheet1!C:C,0)","v":{"$error":"#N/A"}},{"$f":"MATCH(\"*\"&I240&\"*\",Sheet1!B:B,0)","v":{"$error":"#N/A"}},null,null,null,{"$f":"INDEX('[1]Pt1-AvionicsComponentCosts'!$A:$NE,MATCH(B240,'[1]Pt1-AvionicsComponentCosts'!$A:$A,0),MATCH(\"END MARKER\",'[1]Pt1-AvionicsComponentCosts'!$11:$11,0))","v":468525},1,1,""]
[null,30,{"$f":"INDEX('[1]Pt1-AvionicsComponentCosts'!$A:$B,MATCH(B241,'[1]Pt1-AvionicsComponentCosts'!$A:$A,0),2)","v":"Business Jet"},"Hawker",1,"Hawker 400","Hawker 400","400","400",{"$f":"MATCH(\"*\"&F241&\"*\",Sheet1!C:C,0)","v":{"$error":"#N/A"}},{"$f":"MATCH(\"*\"&H241&\"*\",Sheet1!C:C,0)","v":{"$error":"#N/A"}},{"$f":"MATCH(\"*\"&I241&\"*\",Sheet1!B:B,0)","v":23},null,null,null,{"$f":"INDEX('[1]Pt1-AvionicsComponentCosts'!$A:$NE,MATCH(B241,'[1]Pt1-AvionicsComponentCosts'!$A:$A,0),MATCH(\"END MARKER\",'[1]Pt1-AvionicsComponentCosts'!$11:$11,0))","v":452749},0.75,0.75,""]
[null,33,{"$f":"INDEX('[1]Pt1-AvionicsComponentCosts'!$A:$B,MATCH(B242,'[1]Pt1-AvionicsComponentCosts'!$A:$A,0),2)","v":"Business Jet"},"Hawker",1,"Hawker 4000","Hawker 4000","4000","4000",{"$f":"MATCH(\"*\"&F242&\"*\",Sheet1!C:C,0)","v":{"$error":"#N/A"}},{"$f":"MATCH(\"*\"&H242&\"*\",Sheet1!C:C,0)","v":{"$error":"#N/A"}},{"$f":"MATCH(\"*\"&I242&\"*\",Sheet1!B:B,0)","v":{"$error":"#N/A"}},null,null,null,{"$f":"INDEX('[1]Pt1-AvionicsComponentCosts'!$A:$NE,MATCH(B242,'[1]Pt1-AvionicsComponentCosts'!$A:$A,0),MATCH(\"END MARKER\",'[1]Pt1-AvionicsComponentCosts'!$11:$11,0))","v":732140},0.75,0.75,""]
[null,32,{"$f":"INDEX('[1]Pt1-AvionicsComponentCosts'!$A:$B,MATCH(B243,'[1]Pt1-AvionicsComponentCosts'!$A:$A,0),2)","v":"Business Jet"},"Hawker",1,"Hawker 750/850/900","Hawker 750/850/900","750/850/900","750/850/900",{"$f":"MATCH(\"*\"&F243&\"*\",Sheet1!C:C,0)","v":{"$error":"#N/A"}},{"$f":"MATCH(\"*\"&H243&\"*\",Sheet1!C:C,0)","v":{"$error":"#N/A"}},{"$f":"MATCH(\"*\"&I243&\"*\",Sheet1!B:B,0)","v":{"$error":"#N/A"}},null,null,null,{"$f":"INDEX('[1]Pt1-AvionicsComponentCosts'!$A:$NE,MATCH(B243,'[1]Pt1-AvionicsComponentCosts'!$A:$A,0),MATCH(\"END MARKER\",'[1]Pt1-AvionicsComponentCosts'!$11:$11,0))","v":732140},0.75,0.75,""]
[null,590,{"$f":"INDEX('[1]Pt1-AvionicsComponentCosts'!$A:$B,MATCH(B244,'[1]Pt1-AvionicsComponentCosts'!$A:$A,0),2)","v":"Business Jet"},"Honda",1,"HondaJet","Honda HA-2600 HondaJet","HA-2600 Jet","HA-2600 Jet",{"$f":"MATCH(\"*\"&F244&\"*\",Sheet1!C:C,0)","v":{"$error":"#N/A"}},{"$f":"MATCH(\"*\"&H244&\"*\",Sheet1!C:C,0)","v":{"$error":"#N/A"}},{"$f":"MATCH(\"*\"&I244&\"*\",Sheet1!B:B,0)","v":{"$error":"#N/A"}},null,null,null,{"$f":"INDEX('[1]Pt1-AvionicsComponentCosts'!$A:$NE,MATCH(B244,'[1]Pt1-AvionicsComponentCosts'!$A:$A,0),MATCH(\"END MARKER\",'[1]Pt1-AvionicsComponentCosts'!$11:$11,0))","v":211399},0.75,0.75,""]
[null,66,{"$f":"INDEX('[1]Pt1-AvionicsComponentCosts'!$A:$B,MATCH(B245,'[1]Pt1-AvionicsComponentCosts'!$A:$A,0),2)","v":"Business Jet"},"Honda",1,"HondaJet","Honda HA-420 HondaJet","HA-420 Jet","HA-420 Jet",{"$f":"MATCH(\"*\"&F245&\"*\",Sheet1!C:C,0)","v":{"$error":"#N/A"}},{"$f":"MATCH(\"*\"&H245&\"*\",Sheet1!C:C,0)","v":{"$error":"#N/A"}},{"$f":"MATCH(\"*\"&I245&\"*\",Sheet1!B:B,0)","v":{"$error":"#N/A"}},null,null,null,{"$f":"INDEX('[1]Pt1-AvionicsComponentCosts'!$A:$NE,MATCH(B245,'[1]Pt1-AvionicsComponentCosts'!$A:$A,0),MATCH(\"END MARKER\",'[1]Pt1-AvionicsComponentCosts'!$11:$11,0))","v":206293},0.75,0.75,""]
[null,173,{"$f":"INDEX('[1]Pt1-AvionicsComponentCosts'!$A:$B,MATCH(B246,'[1]Pt1-AvionicsComponentCosts'!$A:$A,0),2)","v":"Fighters and Jet Trainers"},"Hongdu",1,"Hongdu K-8","Hongdu K-8","K-8","K-8",{"$f":"MATCH(\"*\"&F246&\"*\",Sheet1!C:C,0)","v":{"$error":"#N/A"}},{"$f":"MATCH(\"*\"&H246&\"*\",Sheet1!C:C,0)","v":{"$error":"#N/A"}},{"$f":"MATCH(\"*\"&I246&\"*\",Sheet1!B:B,0)","v":{"$error":"#N/A"}},null,null,null,{"$f":"INDEX('[1]Pt1-AvionicsComponentCosts'!$A:$NE,MATCH(B246,'[1]Pt1-AvionicsComponentCosts'!$A:$A,0),MATCH(\"END MARKER\",'[1]Pt1-AvionicsComponentCosts'!$11:$11,0))","v":1158497},1,1,""]
[null,679,{"$f":"INDEX('[1]Pt1-AvionicsComponentCosts'!$A:$B,MATCH(B247,'[1]Pt1-AvionicsComponentCosts'!$A:$A,0),2)","v":"Turbine GA"},"Indonesian Aerospace",1,"N-219","Indonesian Aerospace N-219 Nurtanio","N-219 Nurtanio","N-219 Nurtanio",{"$f":"MATCH(\"*\"&F247&\"*\",Sheet1!C:C,0)","v":{"$error":"#N/A"}},{"$f":"MATCH(\"*\"&H247&\"*\",Sheet1!C:C,0)","v":{"$error":"#N/A"}},{"$f":"MATCH(\"*\"&I247&\"*\",Sheet1!B:B,0)","v":{"$error":"#N/A"}},6,"in 2017","https://www.indonesian-aerospace.com/news/detail/878_aceh+government+purchases+n219+airplane%2C+this+is+the+price",{"$f":"INDEX('[1]Pt1-AvionicsComponentCosts'!$A:$NE,MATCH(B247,'[1]Pt1-AvionicsComponentCosts'!$A:$A,0),MATCH(\"END MARKER\",'[1]Pt1-AvionicsComponentCosts'!$11:$11,0))","v":217209},1,1,0.36201499999999998]
[null,541,{"$f":"INDEX('[1]Pt1-AvionicsComponentCosts'!$A:$B,MATCH(B248,'[1]Pt1-AvionicsComponentCosts'!$A:$A,0),2)","v":"Large Commercial Aircraft"},"Irkut",1,"Irkut MC-21","Irkut MC-21","MC-21","MC-21",{"$f":"MATCH(\"*\"&F248&\"*\",Sheet1!C:C,0)","v":{"$error":"#N/A"}},{"$f":"MATCH(\"*\"&H248&\"*\",Sheet1!C:C,0)","v":{"$error":"#N/A"}},{"$f":"MATCH(\"*\"&I248&\"*\",Sheet1!B:B,0)","v":{"$error":"#N/A"}},null,null,null,{"$f":"INDEX('[1]Pt1-AvionicsComponentCosts'!$A:$NE,MATCH(B248,'[1]Pt1-AvionicsComponentCosts'!$A:$A,0),MATCH(\"END MARKER\",'[1]Pt1-AvionicsComponentCosts'!$11:$11,0))","v":1153685},{"$f":"50%","v":0.5},{"$f":"50%","v":0.5},""]
[null,584,{"$f":"INDEX('[1]Pt1-AvionicsComponentCosts'!$A:$B,MATCH(B249,'[1]Pt1-AvionicsComponentCosts'!$A:$A,0),2)","v":"Fighters and Jet Trainers"},"KAI",1,"KAI KF-X","KAI KF-21","KF-21","KF-21",{"$f":"MATCH(\"*\"&F249&\"*\",Sheet1!C:C,0)","v":{"$error":"#N/A"}},{"$f":"MATCH(\"*\"&H249&\"*\",Sheet1!C:C,0)","v":{"$error":"#N/A"}},{"$f":"MATCH(\"*\"&I249&\"*\",Sheet1!B:B,0)","v":{"$error":"#N/A"}},null,null,null,{"$f":"INDEX('[1]Pt1-AvionicsComponentCosts'!$A:$NE,MATCH(B249,'[1]Pt1-AvionicsComponentCosts'!$A:$A,0),MATCH(\"END MARKER\",'[1]Pt1-AvionicsComponentCosts'!$11:$11,0))","v":2697027},1,1,""]
[null,176,{"$f":"INDEX('[1]Pt1-AvionicsComponentCosts'!$A:$B,MATCH(B250,'[1]Pt1-AvionicsComponentCosts'!$A:$A,0),2)","v":"Fighters and Jet Trainers"},"KAI",1,"KAI T-50 Golden Eagle","KAI T-50 Golden Eagle","T-50 Golden Eagle","T-50 Golden Eagle",{"$f":"MATCH(\"*\"&F250&\"*\",Sheet1!C:C,0)","v":{"$error":"#N/A"}},{"$f":"MATCH(\"*\"&H250&\"*\",Sheet1!C:C,0)","v":{"$error":"#N/A"}},{"$f":"MATCH(\"*\"&I250&\"*\",Sheet1!B:B,0)","v":{"$error":"#N/A"}},null,null,null,{"$f":"INDEX('[1]Pt1-AvionicsComponentCosts'!$A:$NE,MATCH(B250,'[1]Pt1-AvionicsComponentCosts'!$A:$A,0),MATCH(\"END MARKER\",'[1]Pt1-AvionicsComponentCosts'!$11:$11,0))","v":2697027},1,1,""]
[null,114,{"$f":"INDEX('[1]Pt1-AvionicsComponentCosts'!$A:$B,MATCH(B251,'[1]Pt1-AvionicsComponentCosts'!$A:$A,0),2)","v":"Helicopter"},"KAI",1,"KAI KUH-1 Surion","KAI KUH-1 Surion","KUH-1 Surion","KUH-1 Surion",{"$f":"MATCH(\"*\"&F251&\"*\",Sheet1!C:C,0)","v":{"$error":"#N/A"}},{"$f":"MATCH(\"*\"&H251&\"*\",Sheet1!C:C,0)","v":{"$error":"#N/A"}},{"$f":"MATCH(\"*\"&I251&\"*\",Sheet1!B:B,0)","v":{"$error":"#N/A"}},null,null,null,{"$f":"INDEX('[1]Pt1-AvionicsComponentCosts'!$A:$NE,MATCH(B251,'[1]Pt1-AvionicsComponentCosts'!$A:$A,0),MATCH(\"END MARKER\",'[1]Pt1-AvionicsComponentCosts'!$11:$11,0))","v":1316345},0.99,0.99,""]
[null,115,{"$f":"INDEX('[1]Pt1-AvionicsComponentCosts'!$A:$B,MATCH(B252,'[1]Pt1-AvionicsComponentCosts'!$A:$A,0),2)","v":"Helicopter"},"KAI",1,"KAI KUH-1 Surion","KAI LAH/LCH","LAH/LCH","LAH/LCH",{"$f":"MATCH(\"*\"&F252&\"*\",Sheet1!C:C,0)","v":{"$error":"#N/A"}},{"$f":"MATCH(\"*\"&H252&\"*\",Sheet1!C:C,0)","v":{"$error":"#N/A"}},{"$f":"MATCH(\"*\"&I252&\"*\",Sheet1!B:B,0)","v":{"$error":"#N/A"}},null,null,null,{"$f":"INDEX('[1]Pt1-AvionicsComponentCosts'!$A:$NE,MATCH(B252,'[1]Pt1-AvionicsComponentCosts'!$A:$A,0),MATCH(\"END MARKER\",'[1]Pt1-AvionicsComponentCosts'!$11:$11,0))","v":1314153},0.99,0.99,""]
[null,175,{"$f":"INDEX('[1]Pt1-AvionicsComponentCosts'!$A:$B,MATCH(B253,'[1]Pt1-AvionicsComponentCosts'!$A:$A,0),2)","v":"Turboprop Trainers / Light Attack"},"KAI",1,"KAI KT-1 Woongbi","KAI KT-1 Woongbi","KT-1 Woongbi","KT-1 Woongbi",{"$f":"MATCH(\"*\"&F253&\"*\",Sheet1!C:C,0)","v":{"$error":"#N/A"}},{"$f":"MATCH(\"*\"&H253&\"*\",Sheet1!C:C,0)","v":{"$error":"#N/A"}},{"$f":"MATCH(\"*\"&I253&\"*\",Sheet1!B:B,0)","v":{"$error":"#N/A"}},null,null,null,{"$f":"INDEX('[1]Pt1-AvionicsComponentCosts'!$A:$NE,MATCH(B253,'[1]Pt1-AvionicsComponentCosts'!$A:$A,0),MATCH(\"END MARKER\",'[1]Pt1-AvionicsComponentCosts'!$11:$11,0))","v":621760},1,1,""]
[null,223,{"$f":"INDEX('[1]Pt1-AvionicsComponentCosts'!$A:$B,MATCH(B254,'[1]Pt1-AvionicsComponentCosts'!$A:$A,0),2)","v":"Helicopter"},"Kawasaki",1,"Kawasaki BK 117","Kawasaki BK 117","BK 117","BK 117",{"$f":"MATCH(\"*\"&F254&\"*\",Sheet1!C:C,0)","v":{"$error":"#N/A"}},{"$f":"MATCH(\"*\"&H254&\"*\",Sheet1!C:C,0)","v":{"$error":"#N/A"}},{"$f":"MATCH(\"*\"&I254&\"*\",Sheet1!B:B,0)","v":{"$error":"#N/A"}},null,null,null,{"$f":"INDEX('[1]Pt1-AvionicsComponentCosts'!$A:$NE,MATCH(B254,'[1]Pt1-AvionicsComponentCosts'!$A:$A,0),MATCH(\"END MARKER\",'[1]Pt1-AvionicsComponentCosts'!$11:$11,0))","v":301116},0.99,0.99,""]
[null,118,{"$f":"INDEX('[1]Pt1-AvionicsComponentCosts'!$A:$B,MATCH(B255,'[1]Pt1-AvionicsComponentCosts'!$A:$A,0),2)","v":"Helicopter"},"Kawasaki",1,"Kawasaki OH-1","Kawasaki OH-1","OH-1","OH-1",{"$f":"MATCH(\"*\"&F255&\"*\",Sheet1!C:C,0)","v":{"$error":"#N/A"}},{"$f":"MATCH(\"*\"&H255&\"*\",Sheet1!C:C,0)","v":{"$error":"#N/A"}},{"$f":"MATCH(\"*\"&I255&\"*\",Sheet1!B:B,0)","v":{"$error":"#N/A"}},null,null,null,{"$f":"INDEX('[1]Pt1-AvionicsComponentCosts'!$A:$NE,MATCH(B255,'[1]Pt1-AvionicsComponentCosts'!$A:$A,0),MATCH(\"END MARKER\",'[1]Pt1-AvionicsComponentCosts'!$11:$11,0))","v":1253107},0.99,0.99,""]
[null,160,{"$f":"INDEX('[1]Pt1-AvionicsComponentCosts'!$A:$B,MATCH(B256,'[1]Pt1-AvionicsComponentCosts'!$A:$A,0),2)","v":"Military Transport / Special Mission"},"Kawasaki",1,"Kawasaki C-2","Kawasaki C-2","C-2","C-2",{"$f":"MATCH(\"*\"&F256&\"*\",Sheet1!C:C,0)","v":{"$error":"#N/A"}},{"$f":"MATCH(\"*\"&H256&\"*\",Sheet1!C:C,0)","v":{"$error":"#N/A"}},{"$f":"MATCH(\"*\"&I256&\"*\",Sheet1!B:B,0)","v":{"$error":"#N/A"}},null,null,null,{"$f":"INDEX('[1]Pt1-AvionicsComponentCosts'!$A:$NE,MATCH(B256,'[1]Pt1-AvionicsComponentCosts'!$A:$A,0),MATCH(\"END MARKER\",'[1]Pt1-AvionicsComponentCosts'!$11:$11,0))","v":3025457},1,1,""]
[null,161,{"$f":"INDEX('[1]Pt1-AvionicsComponentCosts'!$A:$B,MATCH(B257,'[1]Pt1-AvionicsComponentCosts'!$A:$A,0),2)","v":"Military Transport / Special Mission"},"Kawasaki",1,"Kawasaki P-1","Kawasaki P-1","P-1","P-1",{"$f":"MATCH(\"*\"&F257&\"*\",Sheet1!C:C,0)","v":{"$error":"#N/A"}},{"$f":"MATCH(\"*\"&H257&\"*\",Sheet1!C:C,0)","v":{"$error":"#N/A"}},{"$f":"MATCH(\"*\"&I257&\"*\",Sheet1!B:B,0)","v":{"$error":"#N/A"}},null,null,null,{"$f":"INDEX('[1]Pt1-AvionicsComponentCosts'!$A:$NE,MATCH(B257,'[1]Pt1-AvionicsComponentCosts'!$A:$A,0),MATCH(\"END MARKER\",'[1]Pt1-AvionicsComponentCosts'!$11:$11,0))","v":3023308},1,1,""]
[null,68,{"$f":"INDEX('[1]Pt1-AvionicsComponentCosts'!$A:$B,MATCH(B258,'[1]Pt1-AvionicsComponentCosts'!$A:$A,0),2)","v":"Business Jet"},"Learjet",1,"Learjet 60","Learjet 60","60","60",{"$f":"MATCH(\"*\"&F258&\"*\",Sheet1!C:C,0)","v":{"$error":"#N/A"}},{"$f":"MATCH(\"*\"&H258&\"*\",Sheet1!C:C,0)","v":{"$error":"#N/A"}},{"$f":"MATCH(\"*\"&I258&\"*\",Sheet1!B:B,0)","v":{"$error":"#N/A"}},null,null,null,{"$f":"INDEX('[1]Pt1-AvionicsComponentCosts'!$A:$NE,MATCH(B258,'[1]Pt1-AvionicsComponentCosts'!$A:$A,0),MATCH(\"END MARKER\",'[1]Pt1-AvionicsComponentCosts'!$11:$11,0))","v":670266},0.75,0.75,""]
[null,67,{"$f":"INDEX('[1]Pt1-AvionicsComponentCosts'!$A:$B,MATCH(B259,'[1]Pt1-AvionicsComponentCosts'!$A:$A,0),2)","v":"Business Jet"},"Learjet",1,"Learjet 70/75","Learjet 70/75",{"$f":"TRIM(SUBSTITUTE(G259,D259,\"\"))","v":"70/75"},{"$f":"TRIM(SUBSTITUTE(SUBSTITUTE(SUBSTITUTE(SUBSTITUTE(SUBSTITUTE(H259,\"Family\",\"\"),\"737 Classic:\",\"\"),\"737 MAX:\",\"\"),\"787 Dreamliner:\",\"\"),\"777:\",\"\"))","v":"70/75"},{"$f":"MATCH(\"*\"&F259&\"*\",Sheet1!C:C,0)","v":{"$error":"#N/A"}},{"$f":"MATCH(\"*\"&H259&\"*\",Sheet1!C:C,0)","v":{"$error":"#N/A"}},{"$f":"MATCH(\"*\"&I259&\"*\",Sheet1!B:B,0)","v":{"$error":"#N/A"}},null,null,null,{"$f":"INDEX('[1]Pt1-AvionicsComponentCosts'!$A:$NE,MATCH(B259,'[1]Pt1-AvionicsComponentCosts'!$A:$A,0),MATCH(\"END MARKER\",'[1]Pt1-AvionicsComponentCosts'!$11:$11,0))","v":725690},0.75,0.75,{"$f":"IFERROR(P259/(M259*100000)*R259,\"\")","v":""}]
[null,648,{"$f":"INDEX('[1]Pt1-AvionicsComponentCosts'!$A:$B,MATCH(B260,'[1]Pt1-AvionicsComponentCosts'!$A:$A,0),2)","v":"Helicopter"},"Leonardo",1,"AW 249","Leonardo AW 249","AW 249","AW 249",{"$f":"MATCH(\"*\"&F260&\"*\",Sheet1!C:C,0)","v":{"$error":"#N/A"}},{"$f":"MATCH(\"*\"&H260&\"*\",Sheet1!C:C,0)","v":{"$error":"#N/A"}},{"$f":"MATCH(\"*\"&I260&\"*\",Sheet1!B:B,0)","v":{"$error":"#N/A"}},null,null,null,{"$f":"INDEX('[1]Pt1-AvionicsComponentCosts'!$A:$NE,MATCH(B260,'[1]Pt1-AvionicsComponentCosts'!$A:$A,0),MATCH(\"END MARKER\",'[1]Pt1-AvionicsComponentCosts'!$11:$11,0))","v":1614184},0.99,0.99,""]
[null,615,{"$f":"INDEX('[1]Pt1-AvionicsComponentCosts'!$A:$B,MATCH(B261,'[1]Pt1-AvionicsComponentCosts'!$A:$A,0),2)","v":"Helicopter"},"Leonardo",1,"Kopter","Leonardo Kopter","Kopter","Kopter",{"$f":"MATCH(\"*\"&F261&\"*\",Sheet1!C:C,0)","v":{"$error":"#N/A"}},{"$f":"MATCH(\"*\"&H261&\"*\",Sheet1!C:C,0)","v":{"$error":"#N/A"}},{"$f":"MATCH(\"*\"&I261&\"*\",Sheet1!B:B,0)","v":{"$error":"#N/A"}},null,null,null,{"$f":"INDEX('[1]Pt1-AvionicsComponentCosts'!$A:$NE,MATCH(B261,'[1]Pt1-AvionicsComponentCosts'!$A:$A,0),MATCH(\"END MARKER\",'[1]Pt1-AvionicsComponentCosts'!$11:$11,0))","v":272198},0.99,0.99,""]
[null,103,{"$f":"INDEX('[1]Pt1-AvionicsComponentCosts'!$A:$B,MATCH(B262,'[1]Pt1-AvionicsComponentCosts'!$A:$A,0),2)","v":"Helicopter"},"Leonardo",1,"Leonardo AW101","Leonardo AW101","AW101","AW101",{"$f":"MATCH(\"*\"&F262&\"*\",Sheet1!C:C,0)","v":{"$error":"#N/A"}},{"$f":"MATCH(\"*\"&H262&\"*\",Sheet1!C:C,0)","v":{"$error":"#N/A"}},{"$f":"MATCH(\"*\"&I262&\"*\",Sheet1!B:B,0)","v":{"$error":"#N/A"}},28,null,"https://www.bjtonline.com/aircraft/leonardo-helicopters-aw101",{"$f":"INDEX('[1]Pt1-AvionicsComponentCosts'!$A:$NE,MATCH(B262,'[1]Pt1-AvionicsComponentCosts'!$A:$A,0),MATCH(\"END MARKER\",'[1]Pt1-AvionicsComponentCosts'!$11:$11,0))","v":1260588},0.99,0.99,0.44570789999999999]
[null,455,{"$f":"INDEX('[1]Pt1-AvionicsComponentCosts'!$A:$B,MATCH(B263,'[1]Pt1-AvionicsComponentCosts'!$A:$A,0),2)","v":"Helicopter"},"Leonardo",1,"Leonardo AW109","Leonardo AW109","AW109","AW109",{"$f":"MATCH(\"*\"&F263&\"*\",Sheet1!C:C,0)","v":{"$error":"#N/A"}},{"$f":"MATCH(\"*\"&H263&\"*\",Sheet1!C:C,0)","v":{"$error":"#N/A"}},{"$f":"MATCH(\"*\"&I263&\"*\",Sheet1!B:B,0)","v":{"$error":"#N/A"}},7,null,"https://www.fairlifts.com/helicopters/guide-to-2023-helicopter-prices/",{"$f":"INDEX('[1]Pt1-AvionicsComponentCosts'!$A:$NE,MATCH(B263,'[1]Pt1-AvionicsComponentCosts'!$A:$A,0),MATCH(\"END MARKER\",'[1]Pt1-AvionicsComponentCosts'!$11:$11,0))","v":268199},0.99,0.99,0.37931001428571431]
[null,84,{"$f":"INDEX('[1]Pt1-AvionicsComponentCosts'!$A:$B,MATCH(B264,'[1]Pt1-AvionicsComponentCosts'!$A:$A,0),2)","v":"Helicopter"},"Leonardo",1,"Leonardo AW119 Koala","Leonardo AW119 Koala","AW119 Koala","AW119 Koala",{"$f":"MATCH(\"*\"&F264&\"*\",Sheet1!C:C,0)","v":{"$error":"#N/A"}},{"$f":"MATCH(\"*\"&H264&\"*\",Sheet1!C:C,0)","v":{"$error":"#N/A"}},{"$f":"MATCH(\"*\"&I264&\"*\",Sheet1!B:B,0)","v":{"$error":"#N/A"}},4.5,null,"https://www.fairlifts.com/helicopters/guide-to-2023-helicopter-prices/",{"$f":"INDEX('[1]Pt1-AvionicsComponentCosts'!$A:$NE,MATCH(B264,'[1]Pt1-AvionicsComponentCosts'!$A:$A,0),MATCH(\"END MARKER\",'[1]Pt1-AvionicsComponentCosts'!$11:$11,0))","v":268584},0.99,0.99,0.59088479999999999]
[null,86,{"$f":"INDEX('[1]Pt1-AvionicsComponentCosts'!$A:$B,MATCH(B265,'[1]Pt1-AvionicsComponentCosts'!$A:$A,0),2)","v":"Helicopter"},"Leonardo",1,"Leonardo AW139","Leonardo AW139","AW139","AW139",{"$f":"MATCH(\"*\"&F265&\"*\",Sheet1!C:C,0)","v":{"$error":"#N/A"}},{"$f":"MATCH(\"*\"&H265&\"*\",Sheet1!C:C,0)","v":{"$error":"#N/A"}},{"$f":"MATCH(\"*\"&I265&\"*\",Sheet1!B:B,0)","v":{"$error":"#N/A"}},11,null,"https://www.bjtonline.com/aircraft/leonardo-helicopters-aw139",{"$f":"INDEX('[1]Pt1-AvionicsComponentCosts'!$A:$NE,MATCH(B265,'[1]Pt1-AvionicsComponentCosts'!$A:$A,0),MATCH(\"END MARKER\",'[1]Pt1-AvionicsComponentCosts'!$11:$11,0))","v":275422},0.99,0.99,0.24787980000000001]
[null,134,{"$f":"INDEX('[1]Pt1-AvionicsComponentCosts'!$A:$B,MATCH(B266,'[1]Pt1-AvionicsComponentCosts'!$A:$A,0),2)","v":"Helicopter"},"Leonardo",1,"Leonardo AW159 Lynx","Leonardo AW159 Lynx","AW159 Lynx","AW159 Lynx",{"$f":"MATCH(\"*\"&F266&\"*\",Sheet1!C:C,0)","v":{"$error":"#N/A"}},{"$f":"MATCH(\"*\"&H266&\"*\",Sheet1!C:C,0)","v":{"$error":"#N/A"}},{"$f":"MATCH(\"*\"&I266&\"*\",Sheet1!B:B,0)","v":{"$error":"#N/A"}},27.14,null,"https://aerocorner.com/aircraft/agusta-westland-future-lynx/",{"$f":"INDEX('[1]Pt1-AvionicsComponentCosts'!$A:$NE,MATCH(B266,'[1]Pt1-AvionicsComponentCosts'!$A:$A,0),MATCH(\"END MARKER\",'[1]Pt1-AvionicsComponentCosts'!$11:$11,0))","v":1315184},0.99,0.99,0.47974655858511422]
[null,88,{"$f":"INDEX('[1]Pt1-AvionicsComponentCosts'!$A:$B,MATCH(B267,'[1]Pt1-AvionicsComponentCosts'!$A:$A,0),2)","v":"Helicopter"},"Leonardo",1,"Leonardo AW169","Leonardo AW169","AW169","AW169",{"$f":"MATCH(\"*\"&F267&\"*\",Sheet1!C:C,0)","v":{"$error":"#N/A"}},{"$f":"MATCH(\"*\"&H267&\"*\",Sheet1!C:C,0)","v":{"$error":"#N/A"}},{"$f":"MATCH(\"*\"&I267&\"*\",Sheet1!B:B,0)","v":{"$error":"#N/A"}},8,null,"https://www.bjtonline.com/aircraft/leonardo-helicopters-aw169",{"$f":"INDEX('[1]Pt1-AvionicsComponentCosts'!$A:$NE,MATCH(B267,'[1]Pt1-AvionicsComponentCosts'!$A:$A,0),MATCH(\"END MARKER\",'[1]Pt1-AvionicsComponentCosts'!$11:$11,0))","v":599500},0.99,0.99,0.74188125000000005]
[null,87,{"$f":"INDEX('[1]Pt1-AvionicsComponentCosts'!$A:$B,MATCH(B268,'[1]Pt1-AvionicsComponentCosts'!$A:$A,0),2)","v":"Helicopter"},"Leonardo",1,"Leonardo AW189","Leonardo AW189","AW189","AW189",{"$f":"MATCH(\"*\"&F268&\"*\",Sheet1!C:C,0)","v":{"$error":"#N/A"}},{"$f":"MATCH(\"*\"&H268&\"*\",Sheet1!C:C,0)","v":{"$error":"#N/A"}},{"$f":"MATCH(\"*\"&I268&\"*\",Sheet1!B:B,0)","v":{"$error":"#N/A"}},16,null,"https://www.businessairnews.com/hb_aircraftpage.html?recnum=AW189",{"$f":"INDEX('[1]Pt1-AvionicsComponentCosts'!$A:$NE,MATCH(B268,'[1]Pt1-AvionicsComponentCosts'!$A:$A,0),MATCH(\"END MARKER\",'[1]Pt1-AvionicsComponentCosts'!$11:$11,0))","v":603884},0.99,0.99,0.37365322500000003]
[null,96,{"$f":"INDEX('[1]Pt1-AvionicsComponentCosts'!$A:$B,MATCH(B269,'[1]Pt1-AvionicsComponentCosts'!$A:$A,0),2)","v":"Helicopter"},"Leonardo",1,"Leonardo AW609","Leonardo AW609","AW609","AW609",{"$f":"MATCH(\"*\"&F269&\"*\",Sheet1!C:C,0)","v":{"$error":"#N/A"}},{"$f":"MATCH(\"*\"&H269&\"*\",Sheet1!C:C,0)","v":{"$error":"#N/A"}},{"$f":"MATCH(\"*\"&I269&\"*\",Sheet1!B:B,0)","v":{"$error":"#N/A"}},24,null,"https://www.bjtonline.com/business-jet-news/finmeccanicas-aw-609",{"$f":"INDEX('[1]Pt1-AvionicsComponentCosts'!$A:$NE,MATCH(B269,'[1]Pt1-AvionicsComponentCosts'!$A:$A,0),MATCH(\"END MARKER\",'[1]Pt1-AvionicsComponentCosts'!$11:$11,0))","v":642967},0.99,0.99,0.26522388749999998]
[null,225,{"$f":"INDEX('[1]Pt1-AvionicsComponentCosts'!$A:$B,MATCH(B270,'[1]Pt1-AvionicsComponentCosts'!$A:$A,0),2)","v":"Turbine GA"},"Let",1,"Let L-410 Turbolet","Let L-410 Turbolet","L-410 Turbolet","L-410 Turbolet",{"$f":"MATCH(\"*\"&F270&\"*\",Sheet1!C:C,0)","v":{"$error":"#N/A"}},{"$f":"MATCH(\"*\"&H270&\"*\",Sheet1!C:C,0)","v":{"$error":"#N/A"}},{"$f":"MATCH(\"*\"&I270&\"*\",Sheet1!B:B,0)","v":{"$error":"#N/A"}},3.5,null,"https://www.paramountbusinessjets.com/private-jet-charter/aircraft/let-l-410",{"$f":"INDEX('[1]Pt1-AvionicsComponentCosts'!$A:$NE,MATCH(B270,'[1]Pt1-AvionicsComponentCosts'!$A:$A,0),MATCH(\"END MARKER\",'[1]Pt1-AvionicsComponentCosts'!$11:$11,0))","v":217209},1,1,0.62059714285714285]
[null,658,{"$f":"INDEX('[1]Pt1-AvionicsComponentCosts'!$A:$B,MATCH(B271,'[1]Pt1-AvionicsComponentCosts'!$A:$A,0),2)","v":"Military Transport / Special Mission"},"Lockheed martin/Airbus",1,"A330 LMXT","Lockheed martin/Airbus A330 LMXT","A330 LMXT","A330 LMXT",{"$f":"MATCH(\"*\"&F271&\"*\",Sheet1!C:C,0)","v":{"$error":"#N/A"}},{"$f":"MATCH(\"*\"&H271&\"*\",Sheet1!C:C,0)","v":{"$error":"#N/A"}},{"$f":"MATCH(\"*\"&I271&\"*\",Sheet1!B:B,0)","v":{"$error":"#N/A"}},null,null,null,{"$f":"INDEX('[1]Pt1-AvionicsComponentCosts'!$A:$NE,MATCH(B271,'[1]Pt1-AvionicsComponentCosts'!$A:$A,0),MATCH(\"END MARKER\",'[1]Pt1-AvionicsComponentCosts'!$11:$11,0))","v":3104657},1,1,""]
[null,163,{"$f":"INDEX('[1]Pt1-AvionicsComponentCosts'!$A:$B,MATCH(B272,'[1]Pt1-AvionicsComponentCosts'!$A:$A,0),2)","v":"Military Transport / Special Mission"},"Lockheed",1,"C-5","Lockheed C-5 Galaxy","C-5 Galaxy","C-5 Galaxy",{"$f":"MATCH(\"*\"&F272&\"*\",Sheet1!C:C,0)","v":{"$error":"#N/A"}},{"$f":"MATCH(\"*\"&H272&\"*\",Sheet1!C:C,0)","v":{"$error":"#N/A"}},{"$f":"MATCH(\"*\"&I272&\"*\",Sheet1!B:B,0)","v":{"$error":"#N/A"}},null,null,null,{"$f":"INDEX('[1]Pt1-AvionicsComponentCosts'!$A:$NE,MATCH(B272,'[1]Pt1-AvionicsComponentCosts'!$A:$A,0),MATCH(\"END MARKER\",'[1]Pt1-AvionicsComponentCosts'!$11:$11,0))","v":3098550},1,1,""]
[null,145,{"$f":"INDEX('[1]Pt1-AvionicsComponentCosts'!$A:$B,MATCH(B273,'[1]Pt1-AvionicsComponentCosts'!$A:$A,0),2)","v":"Fighters and Jet Trainers"},"Lockheed Martin",1,"F-22","Lockheed Martin F-22 Raptor","F-22 Raptor","F-22 Raptor",{"$f":"MATCH(\"*\"&F273&\"*\",Sheet1!C:C,0)","v":{"$error":"#N/A"}},{"$f":"MATCH(\"*\"&H273&\"*\",Sheet1!C:C,0)","v":{"$error":"#N/A"}},{"$f":"MATCH(\"*\"&I273&\"*\",Sheet1!B:B,0)","v":{"$error":"#N/A"}},null,null,null,{"$f":"INDEX('[1]Pt1-AvionicsComponentCosts'!$A:$NE,MATCH(B273,'[1]Pt1-AvionicsComponentCosts'!$A:$A,0),MATCH(\"END MARKER\",'[1]Pt1-AvionicsComponentCosts'!$11:$11,0))","v":2779270},1,1,""]
[null,146,{"$f":"INDEX('[1]Pt1-AvionicsComponentCosts'!$A:$B,MATCH(B274,'[1]Pt1-AvionicsComponentCosts'!$A:$A,0),2)","v":"Fighters and Jet Trainers"},"Lockheed Martin",1,"F-35","Lockheed Martin F-35 Lightning II","F-35 Lightning II","F-35 Lightning II",{"$f":"MATCH(\"*\"&F274&\"*\",Sheet1!C:C,0)","v":{"$error":"#N/A"}},{"$f":"MATCH(\"*\"&H274&\"*\",Sheet1!C:C,0)","v":{"$error":"#N/A"}},{"$f":"MATCH(\"*\"&I274&\"*\",Sheet1!B:B,0)","v":{"$error":"#N/A"}},null,null,null,{"$f":"INDEX('[1]Pt1-AvionicsComponentCosts'!$A:$NE,MATCH(B274,'[1]Pt1-AvionicsComponentCosts'!$A:$A,0),MATCH(\"END MARKER\",'[1]Pt1-AvionicsComponentCosts'!$11:$11,0))","v":3377569},1,1,""]
[null,162,{"$f":"INDEX('[1]Pt1-AvionicsComponentCosts'!$A:$B,MATCH(B275,'[1]Pt1-AvionicsComponentCosts'!$A:$A,0),2)","v":"Military Transport / Special Mission"},"Lockheed Martin",1,"C-130J","Lockheed Martin C-130J Super Hercules","C-130J Super Hercules","C-130J Super Hercules",{"$f":"MATCH(\"*\"&F275&\"*\",Sheet1!C:C,0)","v":{"$error":"#N/A"}},{"$f":"MATCH(\"*\"&H275&\"*\",Sheet1!C:C,0)","v":{"$error":"#N/A"}},{"$f":"MATCH(\"*\"&I275&\"*\",Sheet1!B:B,0)","v":{"$error":"#N/A"}},null,null,null,{"$f":"INDEX('[1]Pt1-AvionicsComponentCosts'!$A:$NE,MATCH(B275,'[1]Pt1-AvionicsComponentCosts'!$A:$A,0),MATCH(\"END MARKER\",'[1]Pt1-AvionicsComponentCosts'!$11:$11,0))","v":2620676},1,1,""]
[null,627,{"$f":"INDEX('[1]Pt1-AvionicsComponentCosts'!$A:$B,MATCH(B276,'[1]Pt1-AvionicsComponentCosts'!$A:$A,0),2)","v":"Freighter"},"McDonnell",1,"McDonnell Douglas MD-11","McDonnell Douglas MD-11F/CF","Douglas MD-11F/CF","Douglas MD-11F/CF",{"$f":"MATCH(\"*\"&F276&\"*\",Sheet1!C:C,0)","v":{"$error":"#N/A"}},{"$f":"MATCH(\"*\"&H276&\"*\",Sheet1!C:C,0)","v":{"$error":"#N/A"}},{"$f":"MATCH(\"*\"&I276&\"*\",Sheet1!B:B,0)","v":{"$error":"#N/A"}},null,null,null,{"$f":"INDEX('[1]Pt1-AvionicsComponentCosts'!$A:$NE,MATCH(B276,'[1]Pt1-AvionicsComponentCosts'!$A:$A,0),MATCH(\"END MARKER\",'[1]Pt1-AvionicsComponentCosts'!$11:$11,0))","v":1740030},0.5,0.5,""]
[null,619,{"$f":"INDEX('[1]Pt1-AvionicsComponentCosts'!$A:$B,MATCH(B277,'[1]Pt1-AvionicsComponentCosts'!$A:$A,0),2)","v":"Military Transport / Special Mission"},"McDonnell",1,"McDonnell Douglas KC-10","McDonnell Douglas KC-10","Douglas KC-10","Douglas KC-10",{"$f":"MATCH(\"*\"&F277&\"*\",Sheet1!C:C,0)","v":{"$error":"#N/A"}},{"$f":"MATCH(\"*\"&H277&\"*\",Sheet1!C:C,0)","v":{"$error":"#N/A"}},{"$f":"MATCH(\"*\"&I277&\"*\",Sheet1!B:B,0)","v":{"$error":"#N/A"}},null,null,null,{"$f":"INDEX('[1]Pt1-AvionicsComponentCosts'!$A:$NE,MATCH(B277,'[1]Pt1-AvionicsComponentCosts'!$A:$A,0),MATCH(\"END MARKER\",'[1]Pt1-AvionicsComponentCosts'!$11:$11,0))","v":3098550},1,1,""]
[null,139,{"$f":"INDEX('[1]Pt1-AvionicsComponentCosts'!$A:$B,MATCH(B278,'[1]Pt1-AvionicsComponentCosts'!$A:$A,0),2)","v":"Fighters and Jet Trainers"},"McDonnell Douglas",1,"F-15","McDonnell Douglas F-15 Eagle","F-15 Eagle","F-15 Eagle",{"$f":"MATCH(\"*\"&F278&\"*\",Sheet1!C:C,0)","v":{"$error":"#N/A"}},{"$f":"MATCH(\"*\"&H278&\"*\",Sheet1!C:C,0)","v":{"$error":"#N/A"}},{"$f":"MATCH(\"*\"&I278&\"*\",Sheet1!B:B,0)","v":{"$error":"#N/A"}},null,null,null,{"$f":"INDEX('[1]Pt1-AvionicsComponentCosts'!$A:$NE,MATCH(B278,'[1]Pt1-AvionicsComponentCosts'!$A:$A,0),MATCH(\"END MARKER\",'[1]Pt1-AvionicsComponentCosts'!$11:$11,0))","v":3012133},1,1,""]
[null,168,{"$f":"INDEX('[1]Pt1-AvionicsComponentCosts'!$A:$B,MATCH(B279,'[1]Pt1-AvionicsComponentCosts'!$A:$A,0),2)","v":"Fighters and Jet Trainers"},"McDonnell Douglas",1,"T-45","McDonnell Douglas T-45 Goshawk","T-45 Goshawk","T-45 Goshawk",{"$f":"MATCH(\"*\"&F279&\"*\",Sheet1!C:C,0)","v":{"$error":"#N/A"}},{"$f":"MATCH(\"*\"&H279&\"*\",Sheet1!C:C,0)","v":{"$error":"#N/A"}},{"$f":"MATCH(\"*\"&I279&\"*\",Sheet1!B:B,0)","v":{"$error":"#N/A"}},null,null,null,{"$f":"INDEX('[1]Pt1-AvionicsComponentCosts'!$A:$NE,MATCH(B279,'[1]Pt1-AvionicsComponentCosts'!$A:$A,0),MATCH(\"END MARKER\",'[1]Pt1-AvionicsComponentCosts'!$11:$11,0))","v":1158497},1,1,""]
[null,120,{"$f":"INDEX('[1]Pt1-AvionicsComponentCosts'!$A:$B,MATCH(B280,'[1]Pt1-AvionicsComponentCosts'!$A:$A,0),2)","v":"Helicopter"},"MD",1,"MD 500/600","MD Helicopters MD 500/600","Helicopters 500/600","Helicopters 500/600",{"$f":"MATCH(\"*\"&F280&\"*\",Sheet1!C:C,0)","v":{"$error":"#N/A"}},{"$f":"MATCH(\"*\"&H280&\"*\",Sheet1!C:C,0)","v":{"$error":"#N/A"}},{"$f":"MATCH(\"*\"&I280&\"*\",Sheet1!B:B,0)","v":{"$error":"#N/A"}},1.8,null,"https://www.fairlifts.com/helicopters/guide-to-2023-helicopter-prices/",{"$f":"INDEX('[1]Pt1-AvionicsComponentCosts'!$A:$NE,MATCH(B280,'[1]Pt1-AvionicsComponentCosts'!$A:$A,0),MATCH(\"END MARKER\",'[1]Pt1-AvionicsComponentCosts'!$11:$11,0))","v":267424},0.99,0.99,1.4708319999999999]
[null,119,{"$f":"INDEX('[1]Pt1-AvionicsComponentCosts'!$A:$B,MATCH(B281,'[1]Pt1-AvionicsComponentCosts'!$A:$A,0),2)","v":"Helicopter"},"MD",1,"MD Explorer","MD Helicopters MD Explorer","Helicopters Explorer","Helicopters Explorer",{"$f":"MATCH(\"*\"&F281&\"*\",Sheet1!C:C,0)","v":{"$error":"#N/A"}},{"$f":"MATCH(\"*\"&H281&\"*\",Sheet1!C:C,0)","v":{"$error":"#N/A"}},{"$f":"MATCH(\"*\"&I281&\"*\",Sheet1!B:B,0)","v":{"$error":"#N/A"}},7.5,null,"https://www.paramountbusinessjets.com/private-jet-charter/aircraft/mcdonnell-douglas-md-902-explorer",{"$f":"INDEX('[1]Pt1-AvionicsComponentCosts'!$A:$NE,MATCH(B281,'[1]Pt1-AvionicsComponentCosts'!$A:$A,0),MATCH(\"END MARKER\",'[1]Pt1-AvionicsComponentCosts'!$11:$11,0))","v":269230},0.99,0.99,0.35538359999999997]
[null,147,{"$f":"INDEX('[1]Pt1-AvionicsComponentCosts'!$A:$B,MATCH(B282,'[1]Pt1-AvionicsComponentCosts'!$A:$A,0),2)","v":"Fighters and Jet Trainers"},"Mitsubishi",1,"Mitsubishi F-2","Mitsubishi F-2","F-2","F-2",{"$f":"MATCH(\"*\"&F282&\"*\",Sheet1!C:C,0)","v":{"$error":"#N/A"}},{"$f":"MATCH(\"*\"&H282&\"*\",Sheet1!C:C,0)","v":{"$error":"#N/A"}},{"$f":"MATCH(\"*\"&I282&\"*\",Sheet1!B:B,0)","v":{"$error":"#N/A"}},null,null,null,{"$f":"INDEX('[1]Pt1-AvionicsComponentCosts'!$A:$NE,MATCH(B282,'[1]Pt1-AvionicsComponentCosts'!$A:$A,0),MATCH(\"END MARKER\",'[1]Pt1-AvionicsComponentCosts'!$11:$11,0))","v":2705517},1,1,""]
[null,449,{"$f":"INDEX('[1]Pt1-AvionicsComponentCosts'!$A:$B,MATCH(B283,'[1]Pt1-AvionicsComponentCosts'!$A:$A,0),2)","v":"UAV"},"MQ-4C",1,"MQ-4C Triton","MQ-4C Triton","Triton","Triton",{"$f":"MATCH(\"*\"&F283&\"*\",Sheet1!C:C,0)","v":{"$error":"#N/A"}},{"$f":"MATCH(\"*\"&H283&\"*\",Sheet1!C:C,0)","v":{"$error":"#N/A"}},{"$f":"MATCH(\"*\"&I283&\"*\",Sheet1!B:B,0)","v":{"$error":"#N/A"}},null,null,null,{"$f":"INDEX('[1]Pt1-AvionicsComponentCosts'!$A:$NE,MATCH(B283,'[1]Pt1-AvionicsComponentCosts'!$A:$A,0),MATCH(\"END MARKER\",'[1]Pt1-AvionicsComponentCosts'!$11:$11,0))","v":914017},1,1,""]
[null,903,{"$f":"INDEX('[1]Pt1-AvionicsComponentCosts'!$A:$B,MATCH(B284,'[1]Pt1-AvionicsComponentCosts'!$A:$A,0),2)","v":"UAV"},"MQ-8",1,"MQ-8","MQ-8","","",{"$f":"MATCH(\"*\"&F284&\"*\",Sheet1!C:C,0)","v":{"$error":"#N/A"}},{"$f":"MATCH(\"*\"&H284&\"*\",Sheet1!C:C,0)","v":1},{"$f":"MATCH(\"*\"&I284&\"*\",Sheet1!B:B,0)","v":1},null,null,null,{"$f":"INDEX('[1]Pt1-AvionicsComponentCosts'!$A:$NE,MATCH(B284,'[1]Pt1-AvionicsComponentCosts'!$A:$A,0),MATCH(\"END MARKER\",'[1]Pt1-AvionicsComponentCosts'!$11:$11,0))","v":914017},1,1,""]
[null,450,{"$f":"INDEX('[1]Pt1-AvionicsComponentCosts'!$A:$B,MATCH(B285,'[1]Pt1-AvionicsComponentCosts'!$A:$A,0),2)","v":"UAV"},"MQ-9",1,"MQ-9 Reaper","MQ-9 Reaper","Reaper","Reaper",{"$f":"MATCH(\"*\"&F285&\"*\",Sheet1!C:C,0)","v":{"$error":"#N/A"}},{"$f":"MATCH(\"*\"&H285&\"*\",Sheet1!C:C,0)","v":{"$error":"#N/A"}},{"$f":"MATCH(\"*\"&I285&\"*\",Sheet1!B:B,0)","v":{"$error":"#N/A"}},null,null,null,{"$f":"INDEX('[1]Pt1-AvionicsComponentCosts'!$A:$NE,MATCH(B285,'[1]Pt1-AvionicsComponentCosts'!$A:$A,0),MATCH(\"END MARKER\",'[1]Pt1-AvionicsComponentCosts'!$11:$11,0))","v":914017},1,1,""]
[null,180,{"$f":"INDEX('[1]Pt1-AvionicsComponentCosts'!$A:$B,MATCH(B286,'[1]Pt1-AvionicsComponentCosts'!$A:$A,0),2)","v":"Business Jet"},"Nextant Aerospace - Nextant",1,"Nextant 400XT","Nextant Aerospace - Nextant 400XT Aircraft","400XT Aircraft","400XT Aircraft",{"$f":"MATCH(\"*\"&F286&\"*\",Sheet1!C:C,0)","v":{"$error":"#N/A"}},{"$f":"MATCH(\"*\"&H286&\"*\",Sheet1!C:C,0)","v":{"$error":"#N/A"}},{"$f":"MATCH(\"*\"&I286&\"*\",Sheet1!B:B,0)","v":{"$error":"#N/A"}},null,null,null,{"$f":"INDEX('[1]Pt1-AvionicsComponentCosts'!$A:$NE,MATCH(B286,'[1]Pt1-AvionicsComponentCosts'!$A:$A,0),MATCH(\"END MARKER\",'[1]Pt1-AvionicsComponentCosts'!$11:$11,0))","v":206293},0.75,0.75,""]
[null,122,{"$f":"INDEX('[1]Pt1-AvionicsComponentCosts'!$A:$B,MATCH(B287,'[1]Pt1-AvionicsComponentCosts'!$A:$A,0),2)","v":"Helicopter"},"NHIndustries",1,"NH90","NHIndustries NATO Frigate Helicopter","NATO Frigate Helicopter","NATO Frigate Helicopter",{"$f":"MATCH(\"*\"&F287&\"*\",Sheet1!C:C,0)","v":{"$error":"#N/A"}},{"$f":"MATCH(\"*\"&H287&\"*\",Sheet1!C:C,0)","v":{"$error":"#N/A"}},{"$f":"MATCH(\"*\"&I287&\"*\",Sheet1!B:B,0)","v":{"$error":"#N/A"}},56,null,"https://aerocorner.com/aircraft/nhi-nh90-nfh/",{"$f":"INDEX('[1]Pt1-AvionicsComponentCosts'!$A:$NE,MATCH(B287,'[1]Pt1-AvionicsComponentCosts'!$A:$A,0),MATCH(\"END MARKER\",'[1]Pt1-AvionicsComponentCosts'!$11:$11,0))","v":1448668},0.99,0.99,0.25610380714285713]
[null,638,{"$f":"INDEX('[1]Pt1-AvionicsComponentCosts'!$A:$B,MATCH(B288,'[1]Pt1-AvionicsComponentCosts'!$A:$A,0),2)","v":"Helicopter"},"NHIndustries",1,"NH90","NHIndustries Tactical Transport Helicopter","Tactical Transport Helicopter","Tactical Transport Helicopter",{"$f":"MATCH(\"*\"&F288&\"*\",Sheet1!C:C,0)","v":{"$error":"#N/A"}},{"$f":"MATCH(\"*\"&H288&\"*\",Sheet1!C:C,0)","v":{"$error":"#N/A"}},{"$f":"MATCH(\"*\"&I288&\"*\",Sheet1!B:B,0)","v":{"$error":"#N/A"}},null,null,null,{"$f":"INDEX('[1]Pt1-AvionicsComponentCosts'!$A:$NE,MATCH(B288,'[1]Pt1-AvionicsComponentCosts'!$A:$A,0),MATCH(\"END MARKER\",'[1]Pt1-AvionicsComponentCosts'!$11:$11,0))","v":1444540},0.99,0.99,""]
[null,149,{"$f":"INDEX('[1]Pt1-AvionicsComponentCosts'!$A:$B,MATCH(B289,'[1]Pt1-AvionicsComponentCosts'!$A:$A,0),2)","v":"Fighters and Jet Trainers"},"Northrop Grumman",1,"B-21","Northrop Grumman B-21 Raider","B-21 Raider","B-21 Raider",{"$f":"MATCH(\"*\"&F289&\"*\",Sheet1!C:C,0)","v":{"$error":"#N/A"}},{"$f":"MATCH(\"*\"&H289&\"*\",Sheet1!C:C,0)","v":{"$error":"#N/A"}},{"$f":"MATCH(\"*\"&I289&\"*\",Sheet1!B:B,0)","v":{"$error":"#N/A"}},null,null,null,{"$f":"INDEX('[1]Pt1-AvionicsComponentCosts'!$A:$NE,MATCH(B289,'[1]Pt1-AvionicsComponentCosts'!$A:$A,0),MATCH(\"END MARKER\",'[1]Pt1-AvionicsComponentCosts'!$11:$11,0))","v":2779270},1,1,""]
[null,164,{"$f":"INDEX('[1]Pt1-AvionicsComponentCosts'!$A:$B,MATCH(B290,'[1]Pt1-AvionicsComponentCosts'!$A:$A,0),2)","v":"Military Transport / Special Mission"},"Northrop Grumman",1,"E-2","Northrop Grumman E-2 Hawkeye","E-2 Hawkeye","E-2 Hawkeye",{"$f":"MATCH(\"*\"&F290&\"*\",Sheet1!C:C,0)","v":{"$error":"#N/A"}},{"$f":"MATCH(\"*\"&H290&\"*\",Sheet1!C:C,0)","v":{"$error":"#N/A"}},{"$f":"MATCH(\"*\"&I290&\"*\",Sheet1!B:B,0)","v":{"$error":"#N/A"}},null,null,null,{"$f":"INDEX('[1]Pt1-AvionicsComponentCosts'!$A:$NE,MATCH(B290,'[1]Pt1-AvionicsComponentCosts'!$A:$A,0),MATCH(\"END MARKER\",'[1]Pt1-AvionicsComponentCosts'!$11:$11,0))","v":3030833},1,1,""]
[null,905,{"$f":"INDEX('[1]Pt1-AvionicsComponentCosts'!$A:$B,MATCH(B291,'[1]Pt1-AvionicsComponentCosts'!$A:$A,0),2)","v":"UAV"},"Other",1,"Other CUAV","Other CUAV","CUAV","CUAV",{"$f":"MATCH(\"*\"&F291&\"*\",Sheet1!C:C,0)","v":{"$error":"#N/A"}},{"$f":"MATCH(\"*\"&H291&\"*\",Sheet1!C:C,0)","v":{"$error":"#N/A"}},{"$f":"MATCH(\"*\"&I291&\"*\",Sheet1!B:B,0)","v":{"$error":"#N/A"}},null,null,null,{"$f":"INDEX('[1]Pt1-AvionicsComponentCosts'!$A:$NE,MATCH(B291,'[1]Pt1-AvionicsComponentCosts'!$A:$A,0),MATCH(\"END MARKER\",'[1]Pt1-AvionicsComponentCosts'!$11:$11,0))","v":914017},1,1,""]
[null,904,{"$f":"INDEX('[1]Pt1-AvionicsComponentCosts'!$A:$B,MATCH(B292,'[1]Pt1-AvionicsComponentCosts'!$A:$A,0),2)","v":"UAV"},"Other",1,"Other VTUAV","Other VTUAV","VTUAV","VTUAV",{"$f":"MATCH(\"*\"&F292&\"*\",Sheet1!C:C,0)","v":{"$error":"#N/A"}},{"$f":"MATCH(\"*\"&H292&\"*\",Sheet1!C:C,0)","v":{"$error":"#N/A"}},{"$f":"MATCH(\"*\"&I292&\"*\",Sheet1!B:B,0)","v":{"$error":"#N/A"}},null,null,null,{"$f":"INDEX('[1]Pt1-AvionicsComponentCosts'!$A:$NE,MATCH(B292,'[1]Pt1-AvionicsComponentCosts'!$A:$A,0),MATCH(\"END MARKER\",'[1]Pt1-AvionicsComponentCosts'!$11:$11,0))","v":914017},1,1,""]
[null,902,{"$f":"INDEX('[1]Pt1-AvionicsComponentCosts'!$A:$B,MATCH(B293,'[1]Pt1-AvionicsComponentCosts'!$A:$A,0),2)","v":"UAV"},"Other MALE/HALE",1,"Other MALE/HALE","Other MALE/HALE","","",{"$f":"MATCH(\"*\"&F293&\"*\",Sheet1!C:C,0)","v":{"$error":"#N/A"}},{"$f":"MATCH(\"*\"&H293&\"*\",Sheet1!C:C,0)","v":1},{"$f":"MATCH(\"*\"&I293&\"*\",Sheet1!B:B,0)","v":1},null,null,null,{"$f":"INDEX('[1]Pt1-AvionicsComponentCosts'!$A:$NE,MATCH(B293,'[1]Pt1-AvionicsComponentCosts'!$A:$A,0),MATCH(\"END MARKER\",'[1]Pt1-AvionicsComponentCosts'!$11:$11,0))","v":914017},1,1,""]
[null,907,{"$f":"INDEX('[1]Pt1-AvionicsComponentCosts'!$A:$B,MATCH(B294,'[1]Pt1-AvionicsComponentCosts'!$A:$A,0),2)","v":"UAV"},"Other TUAV",1,"Other TUAV","Other TUAV","","",{"$f":"MATCH(\"*\"&F294&\"*\",Sheet1!C:C,0)","v":{"$error":"#N/A"}},{"$f":"MATCH(\"*\"&H294&\"*\",Sheet1!C:C,0)","v":1},{"$f":"MATCH(\"*\"&I294&\"*\",Sheet1!B:B,0)","v":1},null,null,null,{"$f":"INDEX('[1]Pt1-AvionicsComponentCosts'!$A:$NE,MATCH(B294,'[1]Pt1-AvionicsComponentCosts'!$A:$A,0),MATCH(\"END MARKER\",'[1]Pt1-AvionicsComponentCosts'!$11:$11,0))","v":914017},1,1,""]
[null,227,{"$f":"INDEX('[1]Pt1-AvionicsComponentCosts'!$A:$B,MATCH(B295,'[1]Pt1-AvionicsComponentCosts'!$A:$A,0),2)","v":"Turboprop Trainers / Light Attack"},"Other Turboprop trainers",1,"Other Turboprop trainers/light attack","Other Turboprop trainers/light attack","/light attack","/light attack",{"$f":"MATCH(\"*\"&F295&\"*\",Sheet1!C:C,0)","v":{"$error":"#N/A"}},{"$f":"MATCH(\"*\"&H295&\"*\",Sheet1!C:C,0)","v":{"$error":"#N/A"}},{"$f":"MATCH(\"*\"&I295&\"*\",Sheet1!B:B,0)","v":{"$error":"#N/A"}},null,null,null,{"$f":"INDEX('[1]Pt1-AvionicsComponentCosts'!$A:$NE,MATCH(B295,'[1]Pt1-AvionicsComponentCosts'!$A:$A,0),MATCH(\"END MARKER\",'[1]Pt1-AvionicsComponentCosts'!$11:$11,0))","v":466911},1,1,""]
[null,546,{"$f":"INDEX('[1]Pt1-AvionicsComponentCosts'!$A:$B,MATCH(B296,'[1]Pt1-AvionicsComponentCosts'!$A:$A,0),2)","v":"Turbine GA"},"PAC",1,"PAC P-750 XSTOL","PAC P-750 XSTOL","P-750 XSTOL","P-750 XSTOL",{"$f":"MATCH(\"*\"&F296&\"*\",Sheet1!C:C,0)","v":{"$error":"#N/A"}},{"$f":"MATCH(\"*\"&H296&\"*\",Sheet1!C:C,0)","v":{"$error":"#N/A"}},{"$f":"MATCH(\"*\"&I296&\"*\",Sheet1!B:B,0)","v":{"$error":"#N/A"}},null,null,null,{"$f":"INDEX('[1]Pt1-AvionicsComponentCosts'!$A:$NE,MATCH(B296,'[1]Pt1-AvionicsComponentCosts'!$A:$A,0),MATCH(\"END MARKER\",'[1]Pt1-AvionicsComponentCosts'!$11:$11,0))","v":212481},1,1,""]
[null,75,{"$f":"INDEX('[1]Pt1-AvionicsComponentCosts'!$A:$B,MATCH(B297,'[1]Pt1-AvionicsComponentCosts'!$A:$A,0),2)","v":"Turbine GA"},"Piaggio",1,"Piaggio P.180 Avanti","Piaggio P.180 Avanti","P.180 Avanti","P.180 Avanti",{"$f":"MATCH(\"*\"&F297&\"*\",Sheet1!C:C,0)","v":{"$error":"#N/A"}},{"$f":"MATCH(\"*\"&H297&\"*\",Sheet1!C:C,0)","v":{"$error":"#N/A"}},{"$f":"MATCH(\"*\"&I297&\"*\",Sheet1!B:B,0)","v":{"$error":"#N/A"}},null,null,null,{"$f":"INDEX('[1]Pt1-AvionicsComponentCosts'!$A:$NE,MATCH(B297,'[1]Pt1-AvionicsComponentCosts'!$A:$A,0),MATCH(\"END MARKER\",'[1]Pt1-AvionicsComponentCosts'!$11:$11,0))","v":212481},1,1,""]
[null,71,{"$f":"INDEX('[1]Pt1-AvionicsComponentCosts'!$A:$B,MATCH(B298,'[1]Pt1-AvionicsComponentCosts'!$A:$A,0),2)","v":"Business Jet"},"Pilatus",1,"PC-24","Pilatus PC-24","PC-24","PC-24",{"$f":"MATCH(\"*\"&F298&\"*\",Sheet1!C:C,0)","v":{"$error":"#N/A"}},{"$f":"MATCH(\"*\"&H298&\"*\",Sheet1!C:C,0)","v":{"$error":"#N/A"}},{"$f":"MATCH(\"*\"&I298&\"*\",Sheet1!B:B,0)","v":{"$error":"#N/A"}},null,null,null,{"$f":"INDEX('[1]Pt1-AvionicsComponentCosts'!$A:$NE,MATCH(B298,'[1]Pt1-AvionicsComponentCosts'!$A:$A,0),MATCH(\"END MARKER\",'[1]Pt1-AvionicsComponentCosts'!$11:$11,0))","v":663816},0.75,0.75,""]
[null,77,{"$f":"INDEX('[1]Pt1-AvionicsComponentCosts'!$A:$B,MATCH(B299,'[1]Pt1-AvionicsComponentCosts'!$A:$A,0),2)","v":"Turbine GA"},"Pilatus",1,"Pilatus PC-12","Pilatus PC-12","PC-12","PC-12",{"$f":"MATCH(\"*\"&F299&\"*\",Sheet1!C:C,0)","v":{"$error":"#N/A"}},{"$f":"MATCH(\"*\"&H299&\"*\",Sheet1!C:C,0)","v":{"$error":"#N/A"}},{"$f":"MATCH(\"*\"&I299&\"*\",Sheet1!B:B,0)","v":{"$error":"#N/A"}},null,null,null,{"$f":"INDEX('[1]Pt1-AvionicsComponentCosts'!$A:$NE,MATCH(B299,'[1]Pt1-AvionicsComponentCosts'!$A:$A,0),MATCH(\"END MARKER\",'[1]Pt1-AvionicsComponentCosts'!$11:$11,0))","v":217209},1,1,""]
[null,177,{"$f":"INDEX('[1]Pt1-AvionicsComponentCosts'!$A:$B,MATCH(B300,'[1]Pt1-AvionicsComponentCosts'!$A:$A,0),2)","v":"Turboprop Trainers / Light Attack"},"Pilatus",1,"PC-7","Pilatus PC-7 Mk II","PC-7 Mk II","PC-7 Mk II",{"$f":"MATCH(\"*\"&F300&\"*\",Sheet1!C:C,0)","v":{"$error":"#N/A"}},{"$f":"MATCH(\"*\"&H300&\"*\",Sheet1!C:C,0)","v":{"$error":"#N/A"}},{"$f":"MATCH(\"*\"&I300&\"*\",Sheet1!B:B,0)","v":{"$error":"#N/A"}},null,null,null,{"$f":"INDEX('[1]Pt1-AvionicsComponentCosts'!$A:$NE,MATCH(B300,'[1]Pt1-AvionicsComponentCosts'!$A:$A,0),MATCH(\"END MARKER\",'[1]Pt1-AvionicsComponentCosts'!$11:$11,0))","v":466374},1,1,""]
[null,178,{"$f":"INDEX('[1]Pt1-AvionicsComponentCosts'!$A:$B,MATCH(B301,'[1]Pt1-AvionicsComponentCosts'!$A:$A,0),2)","v":"Turboprop Trainers / Light Attack"},"Pilatus",1,"PC-9","Pilatus PC-9/PC-21","PC-9/PC-21","PC-9/PC-21",{"$f":"MATCH(\"*\"&F301&\"*\",Sheet1!C:C,0)","v":{"$error":"#N/A"}},{"$f":"MATCH(\"*\"&H301&\"*\",Sheet1!C:C,0)","v":{"$error":"#N/A"}},{"$f":"MATCH(\"*\"&I301&\"*\",Sheet1!B:B,0)","v":{"$error":"#N/A"}},null,null,null,{"$f":"INDEX('[1]Pt1-AvionicsComponentCosts'!$A:$NE,MATCH(B301,'[1]Pt1-AvionicsComponentCosts'!$A:$A,0),MATCH(\"END MARKER\",'[1]Pt1-AvionicsComponentCosts'!$11:$11,0))","v":469062},1,1,""]
[null,76,{"$f":"INDEX('[1]Pt1-AvionicsComponentCosts'!$A:$B,MATCH(B302,'[1]Pt1-AvionicsComponentCosts'!$A:$A,0),2)","v":"Turbine GA"},"Piper",1,"Piper PA-46","Piper PA-46","PA-46","PA-46",{"$f":"MATCH(\"*\"&F302&\"*\",Sheet1!C:C,0)","v":{"$error":"#N/A"}},{"$f":"MATCH(\"*\"&H302&\"*\",Sheet1!C:C,0)","v":{"$error":"#N/A"}},{"$f":"MATCH(\"*\"&I302&\"*\",Sheet1!B:B,0)","v":{"$error":"#N/A"}},null,null,null,{"$f":"INDEX('[1]Pt1-AvionicsComponentCosts'!$A:$NE,MATCH(B302,'[1]Pt1-AvionicsComponentCosts'!$A:$A,0),MATCH(\"END MARKER\",'[1]Pt1-AvionicsComponentCosts'!$11:$11,0))","v":214523},1,1,""]
[null,186,{"$f":"INDEX('[1]Pt1-AvionicsComponentCosts'!$A:$B,MATCH(B303,'[1]Pt1-AvionicsComponentCosts'!$A:$A,0),2)","v":"Turbine GA"},"PT6A powered",1,"PT6A powered light aircraft","many and various using the Pratt & Whitney Canada PT6A","many and various using the Pratt & Whitney Canada PT6A","many and various using the Pratt & Whitney Canada PT6A",{"$f":"MATCH(\"*\"&F303&\"*\",Sheet1!C:C,0)","v":{"$error":"#N/A"}},{"$f":"MATCH(\"*\"&H303&\"*\",Sheet1!C:C,0)","v":{"$error":"#N/A"}},{"$f":"MATCH(\"*\"&I303&\"*\",Sheet1!B:B,0)","v":{"$error":"#N/A"}},null,null,null,{"$f":"INDEX('[1]Pt1-AvionicsComponentCosts'!$A:$NE,MATCH(B303,'[1]Pt1-AvionicsComponentCosts'!$A:$A,0),MATCH(\"END MARKER\",'[1]Pt1-AvionicsComponentCosts'!$11:$11,0))","v":212481},1,1,""]
[null,547,{"$f":"INDEX('[1]Pt1-AvionicsComponentCosts'!$A:$B,MATCH(B304,'[1]Pt1-AvionicsComponentCosts'!$A:$A,0),2)","v":"Turbine GA"},"Quest",1,"Quest Kodiak","Quest Kodiak","Kodiak","Kodiak",{"$f":"MATCH(\"*\"&F304&\"*\",Sheet1!C:C,0)","v":{"$error":"#N/A"}},{"$f":"MATCH(\"*\"&H304&\"*\",Sheet1!C:C,0)","v":{"$error":"#N/A"}},{"$f":"MATCH(\"*\"&I304&\"*\",Sheet1!B:B,0)","v":{"$error":"#N/A"}},3.5,null,"https://www.aopa.org/news-and-media/all-news/2022/july/25/larger-faster-kodiak-unveiled",{"$f":"INDEX('[1]Pt1-AvionicsComponentCosts'!$A:$NE,MATCH(B304,'[1]Pt1-AvionicsComponentCosts'!$A:$A,0),MATCH(\"END MARKER\",'[1]Pt1-AvionicsComponentCosts'!$11:$11,0))","v":212481},1,1,0.60708857142857142]
[null,79,{"$f":"INDEX('[1]Pt1-AvionicsComponentCosts'!$A:$B,MATCH(B305,'[1]Pt1-AvionicsComponentCosts'!$A:$A,0),2)","v":"Turbine GA"},"Reims-Cessna",1,"Reims-Cessna F406 Caravan II","Reims-Cessna F406 Caravan II","F406 Caravan II","F406 Caravan II",{"$f":"MATCH(\"*\"&F305&\"*\",Sheet1!C:C,0)","v":{"$error":"#N/A"}},{"$f":"MATCH(\"*\"&H305&\"*\",Sheet1!C:C,0)","v":{"$error":"#N/A"}},{"$f":"MATCH(\"*\"&I305&\"*\",Sheet1!B:B,0)","v":{"$error":"#N/A"}},null,null,null,{"$f":"INDEX('[1]Pt1-AvionicsComponentCosts'!$A:$NE,MATCH(B305,'[1]Pt1-AvionicsComponentCosts'!$A:$A,0),MATCH(\"END MARKER\",'[1]Pt1-AvionicsComponentCosts'!$11:$11,0))","v":212481},1,1,""]
[null,124,{"$f":"INDEX('[1]Pt1-AvionicsComponentCosts'!$A:$B,MATCH(B306,'[1]Pt1-AvionicsComponentCosts'!$A:$A,0),2)","v":"Helicopter"},"Robinson",1,"R66","Robinson R66","R66","R66",{"$f":"MATCH(\"*\"&F306&\"*\",Sheet1!C:C,0)","v":{"$error":"#N/A"}},{"$f":"MATCH(\"*\"&H306&\"*\",Sheet1!C:C,0)","v":{"$error":"#N/A"}},{"$f":"MATCH(\"*\"&I306&\"*\",Sheet1!B:B,0)","v":{"$error":"#N/A"}},0.95,null,"https://www.fairlifts.com/helicopters/guide-to-2023-helicopter-prices/",{"$f":"INDEX('[1]Pt1-AvionicsComponentCosts'!$A:$NE,MATCH(B306,'[1]Pt1-AvionicsComponentCosts'!$A:$A,0),MATCH(\"END MARKER\",'[1]Pt1-AvionicsComponentCosts'!$11:$11,0))","v":142333},0.99,0.99,1.4832596842105261]
[null,452,{"$f":"INDEX('[1]Pt1-AvionicsComponentCosts'!$A:$B,MATCH(B307,'[1]Pt1-AvionicsComponentCosts'!$A:$A,0),2)","v":"UAV"},"RQ-4A",1,"RQ-4A Global Hawk","RQ-4A Global Hawk","Global Hawk","Global Hawk",{"$f":"MATCH(\"*\"&F307&\"*\",Sheet1!C:C,0)","v":{"$error":"#N/A"}},{"$f":"MATCH(\"*\"&H307&\"*\",Sheet1!C:C,0)","v":{"$error":"#N/A"}},{"$f":"MATCH(\"*\"&I307&\"*\",Sheet1!B:B,0)","v":{"$error":"#N/A"}},null,null,null,{"$f":"INDEX('[1]Pt1-AvionicsComponentCosts'!$A:$NE,MATCH(B307,'[1]Pt1-AvionicsComponentCosts'!$A:$A,0),MATCH(\"END MARKER\",'[1]Pt1-AvionicsComponentCosts'!$11:$11,0))","v":914017},1,1,""]
[null,906,{"$f":"INDEX('[1]Pt1-AvionicsComponentCosts'!$A:$B,MATCH(B308,'[1]Pt1-AvionicsComponentCosts'!$A:$A,0),2)","v":"UAV"},"RQ-7",1,"RQ-7 Shadow","RQ-7 Shadow","Shadow","Shadow",{"$f":"MATCH(\"*\"&F308&\"*\",Sheet1!C:C,0)","v":{"$error":"#N/A"}},{"$f":"MATCH(\"*\"&H308&\"*\",Sheet1!C:C,0)","v":{"$error":"#N/A"}},{"$f":"MATCH(\"*\"&I308&\"*\",Sheet1!B:B,0)","v":{"$error":"#N/A"}},null,null,null,{"$f":"INDEX('[1]Pt1-AvionicsComponentCosts'!$A:$NE,MATCH(B308,'[1]Pt1-AvionicsComponentCosts'!$A:$A,0),MATCH(\"END MARKER\",'[1]Pt1-AvionicsComponentCosts'!$11:$11,0))","v":914017},1,1,""]
[null,148,{"$f":"INDEX('[1]Pt1-AvionicsComponentCosts'!$A:$B,MATCH(B309,'[1]Pt1-AvionicsComponentCosts'!$A:$A,0),2)","v":"Fighters and Jet Trainers"},"Saab",1,"Gripen","Saab JAS 39 Gripen","JAS 39 Gripen","JAS 39 Gripen",{"$f":"MATCH(\"*\"&F309&\"*\",Sheet1!C:C,0)","v":{"$error":"#N/A"}},{"$f":"MATCH(\"*\"&H309&\"*\",Sheet1!C:C,0)","v":{"$error":"#N/A"}},{"$f":"MATCH(\"*\"&I309&\"*\",Sheet1!B:B,0)","v":{"$error":"#N/A"}},null,null,null,{"$f":"INDEX('[1]Pt1-AvionicsComponentCosts'!$A:$NE,MATCH(B309,'[1]Pt1-AvionicsComponentCosts'!$A:$A,0),MATCH(\"END MARKER\",'[1]Pt1-AvionicsComponentCosts'!$11:$11,0))","v":2698530},1,1,""]
[null,181,{"$f":"INDEX('[1]Pt1-AvionicsComponentCosts'!$A:$B,MATCH(B310,'[1]Pt1-AvionicsComponentCosts'!$A:$A,0),2)","v":"Military Transport / Special Mission"},"ShinMaywa",1,"ShinMaywa US-2","ShinMaywa US-2","US-2","US-2",{"$f":"MATCH(\"*\"&F310&\"*\",Sheet1!C:C,0)","v":{"$error":"#N/A"}},{"$f":"MATCH(\"*\"&H310&\"*\",Sheet1!C:C,0)","v":{"$error":"#N/A"}},{"$f":"MATCH(\"*\"&I310&\"*\",Sheet1!B:B,0)","v":{"$error":"#N/A"}},null,null,null,{"$f":"INDEX('[1]Pt1-AvionicsComponentCosts'!$A:$NE,MATCH(B310,'[1]Pt1-AvionicsComponentCosts'!$A:$A,0),MATCH(\"END MARKER\",'[1]Pt1-AvionicsComponentCosts'!$11:$11,0))","v":2984826},1,1,""]
[null,125,{"$f":"INDEX('[1]Pt1-AvionicsComponentCosts'!$A:$B,MATCH(B311,'[1]Pt1-AvionicsComponentCosts'!$A:$A,0),2)","v":"Helicopter"},"Sikorsky",1,"S-76","Sikorsky S-76","S-76","S-76",{"$f":"MATCH(\"*\"&F311&\"*\",Sheet1!C:C,0)","v":{"$error":"#N/A"}},{"$f":"MATCH(\"*\"&H311&\"*\",Sheet1!C:C,0)","v":{"$error":"#N/A"}},{"$f":"MATCH(\"*\"&I311&\"*\",Sheet1!B:B,0)","v":{"$error":"#N/A"}},12.5,null,"https://www.fairlifts.com/helicopters/guide-to-2023-helicopter-prices/",{"$f":"INDEX('[1]Pt1-AvionicsComponentCosts'!$A:$NE,MATCH(B311,'[1]Pt1-AvionicsComponentCosts'!$A:$A,0),MATCH(\"END MARKER\",'[1]Pt1-AvionicsComponentCosts'!$11:$11,0))","v":599885},0.99,0.99,0.47510891999999999]
[null,126,{"$f":"INDEX('[1]Pt1-AvionicsComponentCosts'!$A:$B,MATCH(B312,'[1]Pt1-AvionicsComponentCosts'!$A:$A,0),2)","v":"Helicopter"},"Sikorsky",1,"S-92","Sikorsky S-92","S-92","S-92",{"$f":"MATCH(\"*\"&F312&\"*\",Sheet1!C:C,0)","v":{"$error":"#N/A"}},{"$f":"MATCH(\"*\"&H312&\"*\",Sheet1!C:C,0)","v":{"$error":"#N/A"}},{"$f":"MATCH(\"*\"&I312&\"*\",Sheet1!B:B,0)","v":{"$error":"#N/A"}},27,null,"https://www.paramountbusinessjets.com/private-jet-charter/aircraft/sikorsky-s-92",{"$f":"INDEX('[1]Pt1-AvionicsComponentCosts'!$A:$NE,MATCH(B312,'[1]Pt1-AvionicsComponentCosts'!$A:$A,0),MATCH(\"END MARKER\",'[1]Pt1-AvionicsComponentCosts'!$11:$11,0))","v":606077},0.99,0.99,0.22222823333333333]
[null,129,{"$f":"INDEX('[1]Pt1-AvionicsComponentCosts'!$A:$B,MATCH(B313,'[1]Pt1-AvionicsComponentCosts'!$A:$A,0),2)","v":"Helicopter"},"Sikorsky",1,"SH-60","Sikorsky SH-60 Seahawk - MH-60R","SH-60 Seahawk - MH-60R","SH-60 Seahawk - MH-60R",{"$f":"MATCH(\"*\"&F313&\"*\",Sheet1!C:C,0)","v":{"$error":"#N/A"}},{"$f":"MATCH(\"*\"&H313&\"*\",Sheet1!C:C,0)","v":{"$error":"#N/A"}},{"$f":"MATCH(\"*\"&I313&\"*\",Sheet1!B:B,0)","v":{"$error":"#N/A"}},37.299999999999997,null,"https://www.shephardmedia.com/news/defence-helicopter/us-navy-purchases-three-additional-mh-60r-helicopt/",{"$f":"INDEX('[1]Pt1-AvionicsComponentCosts'!$A:$NE,MATCH(B313,'[1]Pt1-AvionicsComponentCosts'!$A:$A,0),MATCH(\"END MARKER\",'[1]Pt1-AvionicsComponentCosts'!$11:$11,0))","v":1461180},0.99,0.99,0.38781989276139417]
[null,130,{"$f":"INDEX('[1]Pt1-AvionicsComponentCosts'!$A:$B,MATCH(B314,'[1]Pt1-AvionicsComponentCosts'!$A:$A,0),2)","v":"Helicopter"},"Sikorsky",1,"SH-60","Sikorsky SH-60 Seahawk - MH-60S","SH-60 Seahawk - MH-60S","SH-60 Seahawk - MH-60S",{"$f":"MATCH(\"*\"&F314&\"*\",Sheet1!C:C,0)","v":{"$error":"#N/A"}},{"$f":"MATCH(\"*\"&H314&\"*\",Sheet1!C:C,0)","v":{"$error":"#N/A"}},{"$f":"MATCH(\"*\"&I314&\"*\",Sheet1!B:B,0)","v":{"$error":"#N/A"}},null,null,null,{"$f":"INDEX('[1]Pt1-AvionicsComponentCosts'!$A:$NE,MATCH(B314,'[1]Pt1-AvionicsComponentCosts'!$A:$A,0),MATCH(\"END MARKER\",'[1]Pt1-AvionicsComponentCosts'!$11:$11,0))","v":1461180},0.99,0.99,""]
[null,128,{"$f":"INDEX('[1]Pt1-AvionicsComponentCosts'!$A:$B,MATCH(B315,'[1]Pt1-AvionicsComponentCosts'!$A:$A,0),2)","v":"Helicopter"},"Sikorsky",1,"SH-60","Sikorsky SH-60 Seahawk - SH-60B Seahawk","SH-60 Seahawk - SH-60B Seahawk","SH-60 Seahawk - SH-60B Seahawk",{"$f":"MATCH(\"*\"&F315&\"*\",Sheet1!C:C,0)","v":{"$error":"#N/A"}},{"$f":"MATCH(\"*\"&H315&\"*\",Sheet1!C:C,0)","v":{"$error":"#N/A"}},{"$f":"MATCH(\"*\"&I315&\"*\",Sheet1!B:B,0)","v":{"$error":"#N/A"}},null,null,"replaced",{"$f":"INDEX('[1]Pt1-AvionicsComponentCosts'!$A:$NE,MATCH(B315,'[1]Pt1-AvionicsComponentCosts'!$A:$A,0),MATCH(\"END MARKER\",'[1]Pt1-AvionicsComponentCosts'!$11:$11,0))","v":1461180},0.99,0.99,""]
[null,127,{"$f":"INDEX('[1]Pt1-AvionicsComponentCosts'!$A:$B,MATCH(B316,'[1]Pt1-AvionicsComponentCosts'!$A:$A,0),2)","v":"Helicopter"},"Sikorsky",1,"Sikorsky CH-53K King Stallion","Sikorsky CH-53K King Stallion","CH-53K King Stallion","CH-53K King Stallion",{"$f":"MATCH(\"*\"&F316&\"*\",Sheet1!C:C,0)","v":{"$error":"#N/A"}},{"$f":"MATCH(\"*\"&H316&\"*\",Sheet1!C:C,0)","v":{"$error":"#N/A"}},{"$f":"MATCH(\"*\"&I316&\"*\",Sheet1!B:B,0)","v":{"$error":"#N/A"}},125,null,null,{"$f":"INDEX('[1]Pt1-AvionicsComponentCosts'!$A:$NE,MATCH(B316,'[1]Pt1-AvionicsComponentCosts'!$A:$A,0),MATCH(\"END MARKER\",'[1]Pt1-AvionicsComponentCosts'!$11:$11,0))","v":1466769},0.99,0.99,0.1161681048]
[null,131,{"$f":"INDEX('[1]Pt1-AvionicsComponentCosts'!$A:$B,MATCH(B317,'[1]Pt1-AvionicsComponentCosts'!$A:$A,0),2)","v":"Helicopter"},"Sikorsky",1,"UH-60","Sikorsky UH-60 Black Hawk","UH-60 Black Hawk","UH-60 Black Hawk",{"$f":"MATCH(\"*\"&F317&\"*\",Sheet1!C:C,0)","v":{"$error":"#N/A"}},{"$f":"MATCH(\"*\"&H317&\"*\",Sheet1!C:C,0)","v":{"$error":"#N/A"}},{"$f":"MATCH(\"*\"&I317&\"*\",Sheet1!B:B,0)","v":{"$error":"#N/A"}},50,"ish","https://www.eurasiantimes.com/us-army-orders-656-million-worth-of-uh-60m-black-hawk-combat/",{"$f":"INDEX('[1]Pt1-AvionicsComponentCosts'!$A:$NE,MATCH(B317,'[1]Pt1-AvionicsComponentCosts'!$A:$A,0),MATCH(\"END MARKER\",'[1]Pt1-AvionicsComponentCosts'!$11:$11,0))","v":1442905},0.99,0.99,0.28569518999999999]
[null,78,{"$f":"INDEX('[1]Pt1-AvionicsComponentCosts'!$A:$B,MATCH(B318,'[1]Pt1-AvionicsComponentCosts'!$A:$A,0),2)","v":"Turbine GA"},"SOCATA",1,"SOCATA TBM","SOCATA TBM","TBM","TBM",{"$f":"MATCH(\"*\"&F318&\"*\",Sheet1!C:C,0)","v":{"$error":"#N/A"}},{"$f":"MATCH(\"*\"&H318&\"*\",Sheet1!C:C,0)","v":{"$error":"#N/A"}},{"$f":"MATCH(\"*\"&I318&\"*\",Sheet1!B:B,0)","v":{"$error":"#N/A"}},4.78,null,"https://www.flyingmag.com/we-fly-daher-tbm-960/",{"$f":"INDEX('[1]Pt1-AvionicsComponentCosts'!$A:$NE,MATCH(B318,'[1]Pt1-AvionicsComponentCosts'!$A:$A,0),MATCH(\"END MARKER\",'[1]Pt1-AvionicsComponentCosts'!$11:$11,0))","v":217964},1,1,0.45599163179916319]
[null,583,{"$f":"INDEX('[1]Pt1-AvionicsComponentCosts'!$A:$B,MATCH(B319,'[1]Pt1-AvionicsComponentCosts'!$A:$A,0),2)","v":"Helicopter"},"Subaru/Bell",1,"Bell 412","Subaru/Bell 412","412","412",{"$f":"MATCH(\"*\"&F319&\"*\",Sheet1!C:C,0)","v":{"$error":"#N/A"}},{"$f":"MATCH(\"*\"&H319&\"*\",Sheet1!C:C,0)","v":{"$error":"#N/A"}},{"$f":"MATCH(\"*\"&I319&\"*\",Sheet1!B:B,0)","v":{"$error":"#N/A"}},null,null,null,{"$f":"INDEX('[1]Pt1-AvionicsComponentCosts'!$A:$NE,MATCH(B319,'[1]Pt1-AvionicsComponentCosts'!$A:$A,0),MATCH(\"END MARKER\",'[1]Pt1-AvionicsComponentCosts'!$11:$11,0))","v":267940},0.99,0.99,""]
[null,29,{"$f":"INDEX('[1]Pt1-AvionicsComponentCosts'!$A:$B,MATCH(B320,'[1]Pt1-AvionicsComponentCosts'!$A:$A,0),2)","v":"Regional"},"Sukhoi",1,"Sukhoi Superjet","Sukhoi Superjet 100","Superjet 100","Superjet 100",{"$f":"MATCH(\"*\"&F320&\"*\",Sheet1!C:C,0)","v":{"$error":"#N/A"}},{"$f":"MATCH(\"*\"&H320&\"*\",Sheet1!C:C,0)","v":{"$error":"#N/A"}},{"$f":"MATCH(\"*\"&I320&\"*\",Sheet1!B:B,0)","v":{"$error":"#N/A"}},null,null,null,{"$f":"INDEX('[1]Pt1-AvionicsComponentCosts'!$A:$NE,MATCH(B320,'[1]Pt1-AvionicsComponentCosts'!$A:$A,0),MATCH(\"END MARKER\",'[1]Pt1-AvionicsComponentCosts'!$11:$11,0))","v":977179},0.65,0.65,""]
[null,585,{"$f":"INDEX('[1]Pt1-AvionicsComponentCosts'!$A:$B,MATCH(B321,'[1]Pt1-AvionicsComponentCosts'!$A:$A,0),2)","v":"Fighters and Jet Trainers"},"TAI",1,"TAI TF-X","TAI TF-X","TF-X","TF-X",{"$f":"MATCH(\"*\"&F321&\"*\",Sheet1!C:C,0)","v":{"$error":"#N/A"}},{"$f":"MATCH(\"*\"&H321&\"*\",Sheet1!C:C,0)","v":{"$error":"#N/A"}},{"$f":"MATCH(\"*\"&I321&\"*\",Sheet1!B:B,0)","v":{"$error":"#N/A"}},null,null,null,{"$f":"INDEX('[1]Pt1-AvionicsComponentCosts'!$A:$NE,MATCH(B321,'[1]Pt1-AvionicsComponentCosts'!$A:$A,0),MATCH(\"END MARKER\",'[1]Pt1-AvionicsComponentCosts'!$11:$11,0))","v":2704765},1,1,""]
[null,138,{"$f":"INDEX('[1]Pt1-AvionicsComponentCosts'!$A:$B,MATCH(B322,'[1]Pt1-AvionicsComponentCosts'!$A:$A,0),2)","v":"Helicopter"},"TAI",1,"TAI T625","TAI T625","T625","T625",{"$f":"MATCH(\"*\"&F322&\"*\",Sheet1!C:C,0)","v":{"$error":"#N/A"}},{"$f":"MATCH(\"*\"&H322&\"*\",Sheet1!C:C,0)","v":{"$error":"#N/A"}},{"$f":"MATCH(\"*\"&I322&\"*\",Sheet1!B:B,0)","v":{"$error":"#N/A"}},null,null,null,{"$f":"INDEX('[1]Pt1-AvionicsComponentCosts'!$A:$NE,MATCH(B322,'[1]Pt1-AvionicsComponentCosts'!$A:$A,0),MATCH(\"END MARKER\",'[1]Pt1-AvionicsComponentCosts'!$11:$11,0))","v":1440326},0.99,0.99,""]
[null,306,{"$f":"INDEX('[1]Pt1-AvionicsComponentCosts'!$A:$B,MATCH(B323,'[1]Pt1-AvionicsComponentCosts'!$A:$A,0),2)","v":"Turboprop Trainers / Light Attack"},"TAI",1,"TAI Hürkus","TAI Hürkus",{"$f":"TRIM(SUBSTITUTE(G323,D323,\"\"))","v":"Hürkus"},{"$f":"TRIM(SUBSTITUTE(SUBSTITUTE(SUBSTITUTE(SUBSTITUTE(SUBSTITUTE(H323,\"Family\",\"\"),\"737 Classic:\",\"\"),\"737 MAX:\",\"\"),\"787 Dreamliner:\",\"\"),\"777:\",\"\"))","v":"Hürkus"},{"$f":"MATCH(\"*\"&F323&\"*\",Sheet1!C:C,0)","v":{"$error":"#N/A"}},{"$f":"MATCH(\"*\"&H323&\"*\",Sheet1!C:C,0)","v":{"$error":"#N/A"}},{"$f":"MATCH(\"*\"&I323&\"*\",Sheet1!B:B,0)","v":{"$error":"#N/A"}},null,null,null,{"$f":"INDEX('[1]Pt1-AvionicsComponentCosts'!$A:$NE,MATCH(B323,'[1]Pt1-AvionicsComponentCosts'!$A:$A,0),MATCH(\"END MARKER\",'[1]Pt1-AvionicsComponentCosts'!$11:$11,0))","v":623695},1,1,{"$f":"IFERROR(P323/(M323*100000)*R323,\"\")","v":""}]
[null,85,{"$f":"INDEX('[1]Pt1-AvionicsComponentCosts'!$A:$B,MATCH(B324,'[1]Pt1-AvionicsComponentCosts'!$A:$A,0),2)","v":"Helicopter"},"TAI/Leonardo",1,"TAI/Leonardo T129","TAI/Leonardo T129",{"$f":"TRIM(SUBSTITUTE(G324,D324,\"\"))","v":"T129"},"T129",{"$f":"MATCH(\"*\"&F324&\"*\",Sheet1!C:C,0)","v":{"$error":"#N/A"}},{"$f":"MATCH(\"*\"&H324&\"*\",Sheet1!C:C,0)","v":{"$error":"#N/A"}},{"$f":"MATCH(\"*\"&I324&\"*\",Sheet1!B:B,0)","v":{"$error":"#N/A"}},50,null,"https://en.wikipedia.org/wiki/TAI/AgustaWestland_T129_ATAK",{"$f":"INDEX('[1]Pt1-AvionicsComponentCosts'!$A:$NE,MATCH(B324,'[1]Pt1-AvionicsComponentCosts'!$A:$A,0),MATCH(\"END MARKER\",'[1]Pt1-AvionicsComponentCosts'!$11:$11,0))","v":1442905},0.99,0.99,0.28569518999999999]
[null,614,{"$f":"INDEX('[1]Pt1-AvionicsComponentCosts'!$A:$B,MATCH(B325,'[1]Pt1-AvionicsComponentCosts'!$A:$A,0),2)","v":"Turbine GA"},"Viking",1,"Viking Twin Otter","Viking Twin Otter",{"$f":"TRIM(SUBSTITUTE(G325,D325,\"\"))","v":"Twin Otter"},"Twin Otter",{"$f":"MATCH(\"*\"&F325&\"*\",Sheet1!C:C,0)","v":{"$error":"#N/A"}},{"$f":"MATCH(\"*\"&H325&\"*\",Sheet1!C:C,0)","v":{"$error":"#N/A"}},{"$f":"MATCH(\"*\"&I325&\"*\",Sheet1!B:B,0)","v":{"$error":"#N/A"}},null,null,null,{"$f":"INDEX('[1]Pt1-AvionicsComponentCosts'!$A:$NE,MATCH(B325,'[1]Pt1-AvionicsComponentCosts'!$A:$A,0),MATCH(\"END MARKER\",'[1]Pt1-AvionicsComponentCosts'!$11:$11,0))","v":217209},1,1,""]
[null,639,{"$f":"INDEX('[1]Pt1-AvionicsComponentCosts'!$A:$B,MATCH(B326,'[1]Pt1-AvionicsComponentCosts'!$A:$A,0),2)","v":"Helicopter"},"Westland",1,"WAH-64","Westland WAH-64",{"$f":"TRIM(SUBSTITUTE(G326,D326,\"\"))","v":"WAH-64"},"WAH-64",{"$f":"MATCH(\"*\"&F326&\"*\",Sheet1!C:C,0)","v":{"$error":"#N/A"}},{"$f":"MATCH(\"*\"&H326&\"*\",Sheet1!C:C,0)","v":{"$error":"#N/A"}},{"$f":"MATCH(\"*\"&I326&\"*\",Sheet1!B:B,0)","v":{"$error":"#N/A"}},null,null,null,{"$f":"INDEX('[1]Pt1-AvionicsComponentCosts'!$A:$NE,MATCH(B326,'[1]Pt1-AvionicsComponentCosts'!$A:$A,0),MATCH(\"END MARKER\",'[1]Pt1-AvionicsComponentCosts'!$11:$11,0))","v":1614184},0.99,0.99,""]
[null,625,{"$f":"INDEX('[1]Pt1-AvionicsComponentCosts'!$A:$B,MATCH(B327,'[1]Pt1-AvionicsComponentCosts'!$A:$A,0),2)","v":"Regional"},"Xian",1,"Xian MA60","Xian MA60",{"$f":"TRIM(SUBSTITUTE(G327,D327,\"\"))","v":"MA60"},"MA60",{"$f":"MATCH(\"*\"&F327&\"*\",Sheet1!C:C,0)","v":{"$error":"#N/A"}},{"$f":"MATCH(\"*\"&H327&\"*\",Sheet1!C:C,0)","v":{"$error":"#N/A"}},{"$f":"MATCH(\"*\"&I327&\"*\",Sheet1!B:B,0)","v":{"$error":"#N/A"}},null,null,null,{"$f":"INDEX('[1]Pt1-AvionicsComponentCosts'!$A:$NE,MATCH(B327,'[1]Pt1-AvionicsComponentCosts'!$A:$A,0),MATCH(\"END MARKER\",'[1]Pt1-AvionicsComponentCosts'!$11:$11,0))","v":919730},0.65,0.65,""]
[null,null,null,null,null,null,null,null,null,null,null,null,null,null,null,null,null,null,""]
[null,null,"Narrow Body",null,null,null,null,null,null,null,null,null,null,null,null,null,null,null,""]
[null,null,"Wide (Non-IMA)",null,null,null,null,null,null,null,null,null,null,null,null,null,null,null,""]
[null,null,null,null,null,null,null,null,null,null,null,null,null,null,null,null,null,null,""]
[null,null,null,null,null,null,null,null,null,null,null,null,null,null,null,null,null,null,""]
[null,null,null,null,null,null,null,null,null,null,null,null,null,null,null,null,null,null,""]
[null,null,null,null,null,null,null,null,null,null,null,null,null,null,null,null,null,null,""]
[null,null,null,null,null,null,null,null,null,null,null,null,null,null,null,null,null,null,""]
[null,null,null,null,null,null,null,null,null,null,null,null,null,null,null,null,null,null,""]
[null,null,null,null,null,null,null,null,null,null,null,null,null,null,null,null,null,null,""]
[null,null,null,null,null,null,null,null,null,null,null,null,null,null,null,null,null,null,""]
[null,null,null,null,null,null,null,null,null,null,null,null,null,null,null,null,null,null,""]
[null,null,null,null,null,null,null,null,null,null,null,null,null,null,null,null,null,null,""]
[null,null,null,null,null,null,null,null,null,null,null,null,null,null,null,null,null,null,""]
[null,null,null,null,null,null,null,null,null,null,null,null,null,null,null,null,null,null,""]
[null,null,null,null,null,null,null,null,null,null,null,null,null,null,null,null,null,null,""]
[null,null,null,null,null,null,null,null,null,null,null,null,null,null,null,null,null,null,""]
[null,null,null,null,null,null,null,null,null,null,null,null,null,null,null,null,null,null,""]
[null,null,null,null,null,null,null,null,null,null,null,null,null,null,null,null,null,null,""]
[null,null,null,null,null,null,null,null,null,null,null,null,null,null,null,null,null,null,""]
[null,null,null,null,null,null,null,null,null,null,null,null,null,null,null,null,null,null,""]
[null,null,null,null,null,null,null,null,null,null,null,null,null,null,null,null,null,null,""]
[null,null,null,null,null,null,null,null,null,null,null,null,null,null,null,null,null,null,""]
[null,null,null,null,null,null,null,null,null,null,null,null,null,null,null,null,null,null,""]
[null,null,null,null,null,null,null,null,null,null,null,null,null,null,null,null,null,null,""]
[null,null,null,null,null,null,null,null,null,null,null,null,null,null,null,null,null,null,""]
[null,null,null,null,null,null,null,null,null,null,null,null,null,null,null,null,null,null,""]
[null,null,null,null,null,null,null,null,null,null,null,null,null,null,null,null,null,null,""]
[null,null,null,null,null,null,null,null,null,null,null,null,null,null,null,null,null,null,""]
[null,null,null,null,null,null,null,null,null,null,null,null,null,null,null,null,null,null,""]
[null,null,null,null,null,null,null,null,null,null,null,null,null,null,null,null,null,null,""]
[null,null,null,null,null,null,null,null,null,null,null,null,null,null,null,null,null,null,""]
[null,null,null,null,null,null,null,null,null,null,null,null,null,null,null,null,null,null,""]
[null,null,null,null,null,null,null,null,null,null,null,null,null,null,null,null,null,null,""]
[null,null,null,null,null,null,null,null,null,null,null,null,null,null,null,null,null,null,""]
[null,null,null,null,null,null,null,null,null,null,null,null,null,null,null,null,null,null,""]
[null,null,null,null,null,null,null,null,null,null,null,null,null,null,null,null,null,null,""]
[null,null,null,null,null,null,null,null,null,null,null,null,null,null,null,null,null,null,""]
[null,null,null,null,null,null,null,null,null,null,null,null,null,null,null,null,null,null,""]
[null,null,null,null,null,null,null,null,null,null,null,null,null,null,null,null,null,null,""]
[null,null,null,null,null,null,null,null,null,null,null,null,null,null,null,null,null,null,""]
[null,null,null,null,null,null,null,null,null,null,null,null,null,null,null,null,null,null,""]
[null,null,null,null,null,null,null,null,null,null,null,null,null,null,null,null,null,null,""]
[null,null,null,null,null,null,null,null,null,null,null,null,null,null,null,null,null,null,""]
[null,null,null,null,null,null,null,null,null,null,null,null,null,null,null,null,null,null,""]
[null,null,null,null,null,null,null,null,null,null,null,null,null,null,null,null,null,null,""]
[null,null,null,null,null,null,null,null,null,null,null,null,null,null,null,null,null,null,""]
[null,null,null,null,null,null,null,null,null,null,null,null,null,null,null,null,null,null,""]
[null,null,null,null,null,null,null,null,null,null,null,null,null,null,null,null,null,null,""]
[null,null,null,null,null,null,null,null,null,null,null,null,null,null,null,null,null,null,""]
[null,null,null,null,null,null,null,null,null,null,null,null,null,null,null,null,null,null,""]
[null,null,null,null,null,null,null,null,null,null,null,null,null,null,null,null,null,null,""]
[null,null,null,null,null,null,null,null,null,null,null,null,null,null,null,null,null,null,""]
[null,null,null,null,null,null,null,null,null,null,null,null,null,null,null,null,null,null,""]
[null,null,null,null,null,null,null,null,null,null,null,null,null,null,null,null,null,null,""]
[null,null,null,null,null,null,null,null,null,null,null,null,null,null,null,null,null,null,""]
[null,null,null,null,null,null,null,null,null,null,null,null,null,null,null,null,null,null,""]
[null,null,null,null,null,null,null,null,null,null,null,null,null,null,null,null,null,null,""]
[null,null,null,null,null,null,null,null,null,null,null,null,null,null,null,null,null,null,""]
[null,null,null,null,null,null,null,null,null,null,null,null,null,null,null,null,null,null,{"$f":"IFERROR(P387/(M387*100000)*R387,\"\")","v":""}]
[null,null,null,null,null,null,null,null,null,null,null,null,null,null,null,null,null,null,""]
[null,null,null,null,null,null,null,null,null,null,null,null,null,null,null,null,null,null,""]
[null,null,null,null,null,null,null,null,null,null,null,null,null,null,null,null,null,null,""]
[null,null,null,null,null,null,null,null,null,null,null,null,null,null,null,null,null,null,""]
[null,null,null,null,null,null,null,null,null,null,null,null,null,null,null,null,null,null,""]
[null,null,null,null,null,null,null,null,null,null,null,null,null,null,null,null,null,null,""]
[null,null,null,null,null,null,null,null,null,null,null,null,null,null,null,null,null,null,""]
[null,null,null,null,null,null,null,null,null,null,null,null,null,null,null,null,null,null,""]
[null,null,null,null,null,null,null,null,null,null,null,null,null,null,null,null,null,null,""]
[null,null,null,null,null,null,null,null,null,null,null,null,null,null,null,null,null,null,""]
[null,null,null,null,null,null,null,null,null,null,null,null,null,null,null,null,null,null,""]
[null,null,null,null,null,null,null,null,null,null,null,null,null,null,null,null,null,null,""]
[null,null,null,null,null,null,null,null,null,null,null,null,null,null,null,null,null,null,""]
[null,null,null,null,null,null,null,null,null,null,null,null,null,null,null,null,null,null,""]
[null,null,null,null,null,null,null,null,null,null,null,null,null,null,null,null,null,null,""]
[null,null,null,null,null,null,null,null,null,null,null,null,null,null,null,null,null,null,""]
[null,null,null,null,null,null,null,null,null,null,null,null,null,null,null,null,null,null,""]
[null,null,null,null,null,null,null,null,null,null,null,null,null,null,null,null,null,null,""]
[null,null,null,null,null,null,null,null,null,null,null,null,null,null,null,null,null,null,""]
[null,null,null,null,null,null,null,null,null,null,null,null,null,null,null,null,null,null,""]
[null,null,null,null,null,null,null,null,null,null,null,null,null,null,null,null,null,null,""]
[null,null,null,null,null,null,null,null,null,null,null,null,null,null,null,null,null,null,""]
[null,null,null,null,null,null,null,null,null,null,null,null,null,null,null,null,null,null,""]
[null,null,null,null,null,null,null,null,null,null,null,null,null,null,null,null,null,null,""]
[null,null,null,null,null,null,null,null,null,null,null,null,null,null,null,null,null,null,""]
[null,null,null,null,null,null,null,null,null,null,null,null,null,null,null,null,null,null,""]
[null,null,null,null,null,null,null,null,null,null,null,null,null,null,null,null,null,null,""]
[null,null,null,null,null,null,null,null,null,null,null,null,null,null,null,null,null,null,""]
[null,null,null,null,null,null,null,null,null,null,null,null,null,null,null,null,null,null,""]
[null,null,null,null,null,null,null,null,null,null,null,null,null,null,null,null,null,null,""]
[null,null,null,null,null,null,null,null,null,null,null,null,null,null,null,null,null,null,""]
[null,null,null,null,null,null,null,null,null,null,null,null,null,null,null,null,null,null,""]
[null,null,null,null,null,null,null,null,null,null,null,null,null,null,null,null,null,null,""]
[null,null,null,null,null,null,null,null,null,null,null,null,null,null,null,null,null,null,""]
[null,null,null,null,null,null,null,null,null,null,null,null,null,null,null,null,null,null,""]
[null,null,null,null,null,null,null,null,null,null,null,null,null,null,null,null,null,null,""]
[null,null,null,null,null,null,null,null,null,null,null,null,null,null,null,null,null,null,""]
[null,null,null,null,null,null,null,null,null,null,null,null,null,null,null,null,null,null,""]
[null,null,null,null,null,null,null,null,null,null,null,null,null,null,null,null,null,null,""]
[null,null,null,null,null,null,null,null,null,null,null,null,null,null,null,null,null,null,""]
[null,null,null,null,null,null,null,null,null,null,null,null,null,null,null,null,null,null,""]
[null,null,null,null,null,null,null,null,null,null,null,null,null,null,null,null,null,null,""]
[null,null,null,null,null,null,null,null,null,null,null,null,null,null,null,null,null,null,""]
[null,null,null,null,null,null,null,null,null,null,null,null,null,null,null,null,null,null,""]
[null,null,null,null,null,null,null,null,null,null,null,null,null,null,null,null,null,null,""]
[null,null,null,null,null,null,null,null,null,null,null,null,null,null,null,null,null,null,""]
[null,null,null,null,null,null,null,null,null,null,null,null,null,null,null,null,null,null,""]
[null,null,null,null,null,null,null,null,null,null,null,null,null,null,null,null,null,null,""]
[null,null,null,null,null,null,null,null,null,null,null,null,null,null,null,null,null,null,""]
[null,null,null,null,null,null,null,null,null,null,null,null,null,null,null,null,null,null,""]
[null,null,null,null,null,null,null,null,null,null,null,null,null,null,null,null,null,null,""]
[null,null,null,null,null,null,null,null,null,null,null,null,null,null,null,null,null,null,""]
[null,null,null,null,null,null,null,null,null,null,null,null,null,null,null,null,null,null,""]
[null,null,null,null,null,null,null,null,null,null,null,null,null,null,null,null,null,null,""]
[null,null,null,null,null,null,null,null,null,null,null,null,null,null,null,null,null,null,""]
[null,null,null,null,null,null,null,null,null,null,null,null,null,null,null,null,null,null,""]
[null,null,null,null,null,null,null,null,null,null,null,null,null,null,null,null,null,null,""]
[null,null,null,null,null,null,null,null,null,null,null,null,null,null,null,null,null,null,""]
[null,null,null,null,null,null,null,null,null,null,null,null,null,null,null,null,null,null,""]
[null,null,null,null,null,null,null,null,null,null,null,null,null,null,null,null,null,null,""]
[null,null,null,null,null,null,null,null,null,null,null,null,null,null,null,null,null,null,""]
[null,null,null,null,null,null,null,null,null,null,null,null,null,null,null,null,null,null,""]
[null,null,null,null,null,null,null,null,null,null,null,null,null,null,null,null,null,null,""]
[null,null,null,null,null,null,null,null,null,null,null,null,null,null,null,null,null,null,{"$f":"IFERROR(P451/(M451*100000)*R451,\"\")","v":""}]
[null,null,null,null,null,null,null,null,null,null,null,null,null,null,null,null,null,null,""]
[null,null,null,null,null,null,null,null,null,null,null,null,null,null,null,null,null,null,""]
[null,null,null,null,null,null,null,null,null,null,null,null,null,null,null,null,null,null,""]
[null,null,null,null,null,null,null,null,null,null,null,null,null,null,null,null,null,null,""]
[null,null,null,null,null,null,null,null,null,null,null,null,null,null,null,null,null,null,""]
[null,null,null,null,null,null,null,null,null,null,null,null,null,null,null,null,null,null,""]
[null,null,null,null,null,null,null,null,null,null,null,null,null,null,null,null,null,null,""]
[null,null,null,null,null,null,null,null,null,null,null,null,null,null,null,null,null,null,""]
[null,null,null,null,null,null,null,null,null,null,null,null,null,null,null,null,null,null,""]
[null,null,null,null,null,null,null,null,null,null,null,null,null,null,null,null,null,null,""]
[null,null,null,null,null,null,null,null,null,null,null,null,null,null,null,null,null,null,""]
[null,null,null,null,null,null,null,null,null,null,null,null,null,null,null,null,null,null,""]
[null,null,null,null,null,null,null,null,null,null,null,null,null,null,null,null,null,null,""]
[null,null,null,null,null,null,null,null,null,null,null,null,null,null,null,null,null,null,""]
[null,null,null,null,null,null,null,null,null,null,null,null,null,null,null,null,null,null,""]
[null,null,null,null,null,null,null,null,null,null,null,null,null,null,null,null,null,null,""]
[null,null,null,null,null,null,null,null,null,null,null,null,null,null,null,null,null,null,""]
[null,null,null,null,null,null,null,null,null,null,null,null,null,null,null,null,null,null,""]
[null,null,null,null,null,null,null,null,null,null,null,null,null,null,null,null,null,null,""]
[null,null,null,null,null,null,null,null,null,null,null,null,null,null,null,null,null,null,""]
[null,null,null,null,null,null,null,null,null,null,null,null,null,null,null,null,null,null,""]
[]
[]
[null,null,null,null,null,null,null,null,null,null,null,null,null,"socata tbm price"]
[]
[]
[]
[]
[]
[]
[]
[]
[]
[null,null,null,null,null,null,"AE Numbers A320",null,null,null,null,null,103000000,null,null,2354900,0.65,0.65,{"$f":"IFERROR(P485/((M485)*R485),\"\")","v":3.5174010455563856E-2}]

{"sheet":"2024 Data Sheet","index":4,"n_rows":485,"n_cols":19,"rows_kept":485,"cut":false,"hidden":false,"merged":[]}
[null,null,null,"MFGR",null,"aircraft_level_3","aircraft_level_4",null,null,null,null,null,"Price ($M)",null,"Source","Avionics Price","AC value factor","AV value factor","Avionics Percentage"]
[null,165,{"$f":"INDEX('[1]Pt1-AvionicsComponentCosts'!$A:$B,MATCH(B2,'[1]Pt1-AvionicsComponentCosts'!$A:$A,0),2)","v":"Fighters and Jet Trainers"},"Aermacchi",1,"M-345","Aermacchi M-345",{"$f":"TRIM(SUBSTITUTE(G2,D2,\"\"))","v":"M-345"},{"$f":"TRIM(SUBSTITUTE(SUBSTITUTE(SUBSTITUTE(SUBSTITUTE(SUBSTITUTE(H2,\"Family\",\"\"),\"737 Classic:\",\"\"),\"737 MAX:\",\"\"),\"787 Dreamliner:\",\"\"),\"777:\",\"\"))","v":"M-345"},{"$f":"MATCH(\"*\"&F2&\"*\",Sheet1!C:C,0)","v":{"$error":"#N/A"}},{"$f":"MATCH(\"*\"&H2&\"*\",Sheet1!C:C,0)","v":{"$error":"#N/A"}},{"$f":"MATCH(\"*\"&I2&\"*\",Sheet1!B:B,0)","v":{"$error":"#N/A"}},{"$f":"338/13","v":26},null,"https://www.defensenews.com/digital-show-dailies/paris-air-show/2019/06/13/italy-buys-13-jet-trainers-inks-naval-industry-deal/",{"$f":"INDEX('[2]Pt1-AvionicsComponentCosts'!$A:$NE,MATCH(B2,'[2]Pt1-AvionicsComponentCosts'!$A:$A,0),MATCH(\"END MARKER\",'[2]Pt1-AvionicsComponentCosts'!$11:$11,0))","v":1295662.9234796404},1,1,{"$f":"IFERROR(P2/(M2*100000)*R2,\"\")","v":0.49833189364601554}]
[null,166,{"$f":"INDEX('[1]Pt1-AvionicsComponentCosts'!$A:$B,MATCH(B3,'[1]Pt1-AvionicsComponentCosts'!$A:$A,0),2)","v":"Fighters and Jet Trainers"},"Aermacchi",1,"M-346","Aermacchi M-346",{"$f":"TRIM(SUBSTITUTE(G3,D3,\"\"))","v":"M-346"},{"$f":"TRIM(SUBSTITUTE(SUBSTITUTE(SUBSTITUTE(SUBSTITUTE(SUBSTITUTE(H3,\"Family\",\"\"),\"737 Classic:\",\"\"),\"737 MAX:\",\"\"),\"787 Dreamliner:\",\"\"),\"777:\",\"\"))","v":"M-346"},{"$f":"MATCH(\"*\"&F3&\"*\",Sheet1!C:C,0)","v":{"$error":"#N/A"}},{"$f":"MATCH(\"*\"&H3&\"*\",Sheet1!C:C,0)","v":{"$error":"#N/A"}},{"$f":"MATCH(\"*\"&I3&\"*\",Sheet1!B:B,0)","v":{"$error":"#N/A"}},25,null,"https://www.defensenews.com/breaking-news/2017/01/26/trainer-price-wars-raytheon-wanted-millions-less-per-plane-than-leonardo/",{"$f":"INDEX('[2]Pt1-AvionicsComponentCosts'!$A:$NE,MATCH(B3,'[2]Pt1-AvionicsComponentCosts'!$A:$A,0),MATCH(\"END MARKER\",'[2]Pt1-AvionicsComponentCosts'!$11:$11,0))","v":1297945.5463615018},1,1,{"$f":"IFERROR(P3/(M3*100000)*R3,\"\")","v":0.51917821854460067}]
[null,578,{"$f":"INDEX('[1]Pt1-AvionicsComponentCosts'!$A:$B,MATCH(B4,'[1]Pt1-AvionicsComponentCosts'!$A:$A,0),2)","v":"Fighters and Jet Trainers"},"Aero Vodochody",1,"Aero L-39NG","Aero Vodochody L-39NG","L-39NG","L-39NG",{"$f":"MATCH(\"*\"&F4&\"*\",Sheet1!C:C,0)","v":{"$error":"#N/A"}},{"$f":"MATCH(\"*\"&H4&\"*\",Sheet1!C:C,0)","v":{"$error":"#N/A"}},{"$f":"MATCH(\"*\"&I4&\"*\",Sheet1!B:B,0)","v":{"$error":"#N/A"}},18.5,null,"https://trends.aeroexpo.online/project-79261.html",{"$f":"INDEX('[2]Pt1-AvionicsComponentCosts'!$A:$NE,MATCH(B4,'[2]Pt1-AvionicsComponentCosts'!$A:$A,0),MATCH(\"END MARKER\",'[2]Pt1-AvionicsComponentCosts'!$11:$11,0))","v":1295662.9234796404},1,1,0.70035833701602179]
[null,675,{"$f":"INDEX('[1]Pt1-AvionicsComponentCosts'!$A:$B,MATCH(B5,'[1]Pt1-AvionicsComponentCosts'!$A:$A,0),2)","v":"Fighters and Jet Trainers"},"AIDC",1,"AIDC T-5","AIDC T-5","T-5","T-5",{"$f":"MATCH(\"*\"&F5&\"*\",Sheet1!C:C,0)","v":{"$error":"#N/A"}},{"$f":"MATCH(\"*\"&H5&\"*\",Sheet1!C:C,0)","v":{"$error":"#N/A"}},{"$f":"MATCH(\"*\"&I5&\"*\",Sheet1!B:B,0)","v":{"$error":"#N/A"}},{"$f":"(2200000000/66)/1000000","v":33.333333333333329},null,"https://www.janes.com/osint-insights/defence-news/defence/aidc-completes-27-t-5a-deliveries-to-rocaf",{"$f":"INDEX('[2]Pt1-AvionicsComponentCosts'!$A:$NE,MATCH(B5,'[2]Pt1-AvionicsComponentCosts'!$A:$A,0),MATCH(\"END MARKER\",'[2]Pt1-AvionicsComponentCosts'!$11:$11,0))","v":1297945.5463615018},1,1,0.38938366390845058]
[null,544,{"$f":"INDEX('[1]Pt1-AvionicsComponentCosts'!$A:$B,MATCH(B6,'[1]Pt1-AvionicsComponentCosts'!$A:$A,0),2)","v":"Turbine GA"},"Air",1,"Air Tractor","Air Tractor","Tractor","Tractor",{"$f":"MATCH(\"*\"&F6&\"*\",Sheet1!C:C,0)","v":{"$error":"#N/A"}},{"$f":"MATCH(\"*\"&H6&\"*\",Sheet1!C:C,0)","v":{"$error":"#N/A"}},{"$f":"MATCH(\"*\"&I6&\"*\",Sheet1!B:B,0)","v":{"$error":"#N/A"}},"x",null,null,{"$f":"INDEX('[2]Pt1-AvionicsComponentCosts'!$A:$NE,MATCH(B6,'[2]Pt1-AvionicsComponentCosts'!$A:$A,0),MATCH(\"END MARKER\",'[2]Pt1-AvionicsComponentCosts'!$11:$11,0))","v":220626.48800000001},1,1,""]
[null,674,{"$f":"INDEX('[1]Pt1-AvionicsComponentCosts'!$A:$B,MATCH(B7,'[1]Pt1-AvionicsComponentCosts'!$A:$A,0),2)","v":"Business Jet"},"Airbus",1,"ACJ","Airbus ACJ TwoTwenty","ACJ TwoTwenty","ACJ TwoTwenty",{"$f":"MATCH(\"*\"&F7&\"*\",Sheet1!C:C,0)","v":{"$error":"#N/A"}},{"$f":"MATCH(\"*\"&H7&\"*\",Sheet1!C:C,0)","v":{"$error":"#N/A"}},{"$f":"MATCH(\"*\"&I7&\"*\",Sheet1!B:B,0)","v":{"$error":"#N/A"}},100,null,"https://bjtonline.com/business-jet-news/airbus-acj-twotwenty",{"$f":"INDEX('[2]Pt1-AvionicsComponentCosts'!$A:$NE,MATCH(B7,'[2]Pt1-AvionicsComponentCosts'!$A:$A,0),MATCH(\"END MARKER\",'[2]Pt1-AvionicsComponentCosts'!$11:$11,0))","v":1568058},0.75,0.75,0.11760435]
[null,296,{"$f":"INDEX('[1]Pt1-AvionicsComponentCosts'!$A:$B,MATCH(B8,'[1]Pt1-AvionicsComponentCosts'!$A:$A,0),2)","v":"Business Jet"},"Airbus",1,"ACJ","Airbus ACJ320 Family","ACJ320 Family","ACJ320",{"$f":"MATCH(\"*\"&F8&\"*\",Sheet1!C:C,0)","v":{"$error":"#N/A"}},{"$f":"MATCH(\"*\"&H8&\"*\",Sheet1!C:C,0)","v":{"$error":"#N/A"}},{"$f":"MATCH(\"*\"&I8&\"*\",Sheet1!B:B,0)","v":{"$error":"#N/A"}},85,null,"https://www.bjtonline.com/aircraft/airbus-acj320",{"$f":"INDEX('[2]Pt1-AvionicsComponentCosts'!$A:$NE,MATCH(B8,'[2]Pt1-AvionicsComponentCosts'!$A:$A,0),MATCH(\"END MARKER\",'[2]Pt1-AvionicsComponentCosts'!$11:$11,0))","v":1395799},0.75,0.75,0.12315873529411764]
[null,528,{"$f":"INDEX('[1]Pt1-AvionicsComponentCosts'!$A:$B,MATCH(B9,'[1]Pt1-AvionicsComponentCosts'!$A:$A,0),2)","v":"Business Jet"},"Airbus",1,"ACJ","Airbus ACJ320neo Family","ACJ320neo Family","ACJ320neo",{"$f":"MATCH(\"*\"&F9&\"*\",Sheet1!C:C,0)","v":{"$error":"#N/A"}},{"$f":"MATCH(\"*\"&H9&\"*\",Sheet1!C:C,0)","v":{"$error":"#N/A"}},{"$f":"MATCH(\"*\"&I9&\"*\",Sheet1!B:B,0)","v":{"$error":"#N/A"}},110,null,"https://finance.yahoo.com/news/5-priciest-private-jets-2023-185110930.html",{"$f":"INDEX('[2]Pt1-AvionicsComponentCosts'!$A:$NE,MATCH(B9,'[2]Pt1-AvionicsComponentCosts'!$A:$A,0),MATCH(\"END MARKER\",'[2]Pt1-AvionicsComponentCosts'!$11:$11,0))","v":1395799},0.75,0.75,9.5168113636363641E-2]
[null,678,{"$f":"INDEX('[1]Pt1-AvionicsComponentCosts'!$A:$B,MATCH(B10,'[1]Pt1-AvionicsComponentCosts'!$A:$A,0),2)","v":"Business Jet"},"Airbus",1,"Wide body VIP","Airbus ACJ330-200","ACJ330-200","ACJ330-200",{"$f":"MATCH(\"*\"&F10&\"*\",Sheet1!C:C,0)","v":{"$error":"#N/A"}},{"$f":"MATCH(\"*\"&H10&\"*\",Sheet1!C:C,0)","v":{"$error":"#N/A"}},{"$f":"MATCH(\"*\"&I10&\"*\",Sheet1!B:B,0)","v":{"$error":"#N/A"}},390,null,"https://www.businessairnews.com/hb_aircraftpage.html?recnum=ACJ330",{"$f":"INDEX('[2]Pt1-AvionicsComponentCosts'!$A:$NE,MATCH(B10,'[2]Pt1-AvionicsComponentCosts'!$A:$A,0),MATCH(\"END MARKER\",'[2]Pt1-AvionicsComponentCosts'!$11:$11,0))","v":1757582},0.75,0.75,3.379965384615384E-2]
[null,565,{"$f":"INDEX('[1]Pt1-AvionicsComponentCosts'!$A:$B,MATCH(B11,'[1]Pt1-AvionicsComponentCosts'!$A:$A,0),2)","v":"Freighter"},"Airbus",1,"A330","Airbus A330-743L Beluga XL","A330-743L Beluga XL","A330-743L Beluga XL",{"$f":"MATCH(\"*\"&F11&\"*\",Sheet1!C:C,0)","v":11},{"$f":"MATCH(\"*\"&H11&\"*\",Sheet1!C:C,0)","v":{"$error":"#N/A"}},{"$f":"MATCH(\"*\"&I11&\"*\",Sheet1!B:B,0)","v":{"$error":"#N/A"}},"x",null,null,{"$f":"INDEX('[2]Pt1-AvionicsComponentCosts'!$A:$NE,MATCH(B11,'[2]Pt1-AvionicsComponentCosts'!$A:$A,0),MATCH(\"END MARKER\",'[2]Pt1-AvionicsComponentCosts'!$11:$11,0))","v":1973043.4208},0.5,0.5,""]
[null,644,{"$f":"INDEX('[1]Pt1-AvionicsComponentCosts'!$A:$B,MATCH(B12,'[1]Pt1-AvionicsComponentCosts'!$A:$A,0),2)","v":"Freighter"},"Airbus",1,"A350","Airbus A350F","A350F","A350F",{"$f":"MATCH(\"*\"&F12&\"*\",Sheet1!C:C,0)","v":17},{"$f":"MATCH(\"*\"&H12&\"*\",Sheet1!C:C,0)","v":{"$error":"#N/A"}},{"$f":"MATCH(\"*\"&I12&\"*\",Sheet1!B:B,0)","v":{"$error":"#N/A"}},172,null,"https://aircargoeye.com/airline/aircraft/airbus/a350f/",{"$f":"INDEX('[2]Pt1-AvionicsComponentCosts'!$A:$NE,MATCH(B12,'[2]Pt1-AvionicsComponentCosts'!$A:$A,0),MATCH(\"END MARKER\",'[2]Pt1-AvionicsComponentCosts'!$11:$11,0))","v":1976043.4208},0.5,0.5,5.7443122697674417E-2]
[null,632,{"$f":"INDEX('[1]Pt1-AvionicsComponentCosts'!$A:$B,MATCH(B13,'[1]Pt1-AvionicsComponentCosts'!$A:$A,0),2)","v":"Freighter"},"Airbus",1,"A300","A300-600F/RF","A300-600F/RF","A300-600F/RF",{"$f":"MATCH(\"*\"&F13&\"*\",Sheet1!C:C,0)","v":{"$error":"#N/A"}},{"$f":"MATCH(\"*\"&H13&\"*\",Sheet1!C:C,0)","v":{"$error":"#N/A"}},{"$f":"MATCH(\"*\"&I13&\"*\",Sheet1!B:B,0)","v":{"$error":"#N/A"}},null,"OOP",null,{"$f":"INDEX('[2]Pt1-AvionicsComponentCosts'!$A:$NE,MATCH(B13,'[2]Pt1-AvionicsComponentCosts'!$A:$A,0),MATCH(\"END MARKER\",'[2]Pt1-AvionicsComponentCosts'!$11:$11,0))","v":1933675.0752000005},0.5,0.5,{"$f":"IFERROR(P13/(M13*100000)*R13,\"\")","v":""}]
[null,566,{"$f":"INDEX('[1]Pt1-AvionicsComponentCosts'!$A:$B,MATCH(B14,'[1]Pt1-AvionicsComponentCosts'!$A:$A,0),2)","v":"Freighter"},"Airbus",1,"A300","Airbus A300-600ST Beluga","A300-600ST Beluga","A300-600ST Beluga",{"$f":"MATCH(\"*\"&F14&\"*\",Sheet1!C:C,0)","v":{"$error":"#N/A"}},{"$f":"MATCH(\"*\"&H14&\"*\",Sheet1!C:C,0)","v":{"$error":"#N/A"}},{"$f":"MATCH(\"*\"&I14&\"*\",Sheet1!B:B,0)","v":{"$error":"#N/A"}},"x",null,null,{"$f":"INDEX('[2]Pt1-AvionicsComponentCosts'!$A:$NE,MATCH(B14,'[2]Pt1-AvionicsComponentCosts'!$A:$A,0),MATCH(\"END MARKER\",'[2]Pt1-AvionicsComponentCosts'!$11:$11,0))","v":1763098.4304000004},0.5,0.5,""]
[null,560,{"$f":"INDEX('[1]Pt1-AvionicsComponentCosts'!$A:$B,MATCH(B15,'[1]Pt1-AvionicsComponentCosts'!$A:$A,0),2)","v":"Freighter"},"Airbus",1,"A330","Airbus A330-200F","A330-200F","A330-200F",{"$f":"MATCH(\"*\"&F15&\"*\",Sheet1!C:C,0)","v":11},{"$f":"MATCH(\"*\"&H15&\"*\",Sheet1!C:C,0)","v":{"$error":"#N/A"}},{"$f":"MATCH(\"*\"&I15&\"*\",Sheet1!B:B,0)","v":12},{"$f":"INDEX(Sheet1!$A:$K,MATCH($I15,Sheet1!$B:$B,0),MATCH(M$1,Sheet1!$A$1:$K$1,0))","v":234.7},null,{"$f":"INDEX(Sheet1!$A:$K,MATCH($I15,Sheet1!$B:$B,0),MATCH(O$1,Sheet1!$A$1:$K$1,0))","v":"http://www.axonaviation.com/commercial-aircraft/aircraft-data/aircraft-pricing"},{"$f":"INDEX('[2]Pt1-AvionicsComponentCosts'!$A:$NE,MATCH(B15,'[2]Pt1-AvionicsComponentCosts'!$A:$A,0),MATCH(\"END MARKER\",'[2]Pt1-AvionicsComponentCosts'!$11:$11,0))","v":1973040.4208},0.5,0.5,4.2033242880272687E-2]
[null,562,{"$f":"INDEX('[1]Pt1-AvionicsComponentCosts'!$A:$B,MATCH(B16,'[1]Pt1-AvionicsComponentCosts'!$A:$A,0),2)","v":"Freighter"},"Airbus",1,"A330","Airbus A330-300P2F","A330-300P2F","A330-300P2F",{"$f":"MATCH(\"*\"&F16&\"*\",Sheet1!C:C,0)","v":11},{"$f":"MATCH(\"*\"&H16&\"*\",Sheet1!C:C,0)","v":{"$error":"#N/A"}},{"$f":"MATCH(\"*\"&I16&\"*\",Sheet1!B:B,0)","v":{"$error":"#N/A"}},27,"used","https://www.iba.aero/news/sustained-demand-for-passenger-to-freighter-aircraft-conversions-says-iba/",{"$f":"INDEX('[2]Pt1-AvionicsComponentCosts'!$A:$NE,MATCH(B16,'[2]Pt1-AvionicsComponentCosts'!$A:$A,0),MATCH(\"END MARKER\",'[2]Pt1-AvionicsComponentCosts'!$11:$11,0))","v":1973043.4208},0.5,0.5,0.36537841125925924]
[null,669,{"$f":"INDEX('[1]Pt1-AvionicsComponentCosts'!$A:$B,MATCH(B17,'[1]Pt1-AvionicsComponentCosts'!$A:$A,0),2)","v":"Freighter"},"Airbus",1,"A340","Airbus A340-600NGF","A340-600NGF","A340-600NGF",{"$f":"MATCH(\"*\"&F17&\"*\",Sheet1!C:C,0)","v":{"$error":"#N/A"}},{"$f":"MATCH(\"*\"&H17&\"*\",Sheet1!C:C,0)","v":{"$error":"#N/A"}},{"$f":"MATCH(\"*\"&I17&\"*\",Sheet1!B:B,0)","v":{"$error":"#N/A"}},"x",null,null,{"$f":"INDEX('[2]Pt1-AvionicsComponentCosts'!$A:$NE,MATCH(B17,'[2]Pt1-AvionicsComponentCosts'!$A:$A,0),MATCH(\"END MARKER\",'[2]Pt1-AvionicsComponentCosts'!$11:$11,0))","v":1973043.4208},0.5,0.5,""]
[null,665,{"$f":"INDEX('[1]Pt1-AvionicsComponentCosts'!$A:$B,MATCH(B18,'[1]Pt1-AvionicsComponentCosts'!$A:$A,0),2)","v":"Freighter"},"Airbus",1,"A320ceo","A320-200P2F","A320-200P2F","A320-200P2F",{"$f":"MATCH(\"*\"&F18&\"*\",Sheet1!C:C,0)","v":{"$error":"#N/A"}},{"$f":"MATCH(\"*\"&H18&\"*\",Sheet1!C:C,0)","v":{"$error":"#N/A"}},{"$f":"MATCH(\"*\"&I18&\"*\",Sheet1!B:B,0)","v":{"$error":"#N/A"}},23.3,"used","https://www.airliners.net/forum/viewtopic.php?t=1439571&start=300",{"$f":"INDEX('[2]Pt1-AvionicsComponentCosts'!$A:$NE,MATCH(B18,'[2]Pt1-AvionicsComponentCosts'!$A:$A,0),MATCH(\"END MARKER\",'[2]Pt1-AvionicsComponentCosts'!$11:$11,0))","v":1395800},0.5,0.5,0.29952789699570814]
[null,666,{"$f":"INDEX('[1]Pt1-AvionicsComponentCosts'!$A:$B,MATCH(B19,'[1]Pt1-AvionicsComponentCosts'!$A:$A,0),2)","v":"Freighter"},"Airbus",1,"A320ceo","A321P2F","A321P2F","A321P2F",{"$f":"MATCH(\"*\"&F19&\"*\",Sheet1!C:C,0)","v":{"$error":"#N/A"}},{"$f":"MATCH(\"*\"&H19&\"*\",Sheet1!C:C,0)","v":{"$error":"#N/A"}},{"$f":"MATCH(\"*\"&I19&\"*\",Sheet1!B:B,0)","v":{"$error":"#N/A"}},101,null,"https://www.avdelphi.com/aircraft_type.html?id=12714&recache=1721917906",{"$f":"INDEX('[2]Pt1-AvionicsComponentCosts'!$A:$NE,MATCH(B19,'[2]Pt1-AvionicsComponentCosts'!$A:$A,0),MATCH(\"END MARKER\",'[2]Pt1-AvionicsComponentCosts'!$11:$11,0))","v":1395800},0.5,0.5,6.9099009900990105E-2]
[null,104,{"$f":"INDEX('[1]Pt1-AvionicsComponentCosts'!$A:$B,MATCH(B20,'[1]Pt1-AvionicsComponentCosts'!$A:$A,0),2)","v":"Helicopter"},"Airbus",1,"Tiger","Airbus Tiger","Tiger","Tiger",{"$f":"MATCH(\"*\"&F20&\"*\",Sheet1!C:C,0)","v":{"$error":"#N/A"}},{"$f":"MATCH(\"*\"&H20&\"*\",Sheet1!C:C,0)","v":{"$error":"#N/A"}},{"$f":"MATCH(\"*\"&I20&\"*\",Sheet1!B:B,0)","v":{"$error":"#N/A"}},73,null,"https://simpleflying.com/most-expensive-military-helicopters-guide/",{"$f":"INDEX('[2]Pt1-AvionicsComponentCosts'!$A:$NE,MATCH(B20,'[2]Pt1-AvionicsComponentCosts'!$A:$A,0),MATCH(\"END MARKER\",'[2]Pt1-AvionicsComponentCosts'!$11:$11,0))","v":1494251.8064753041},0.99,0.99,0.20264510800144533]
[null,117,{"$f":"INDEX('[1]Pt1-AvionicsComponentCosts'!$A:$B,MATCH(B21,'[1]Pt1-AvionicsComponentCosts'!$A:$A,0),2)","v":"Helicopter"},"Airbus",1,"Airbus UH-72 Lakota","Airbus UH-72 Lakota","UH-72 Lakota","UH-72 Lakota",{"$f":"MATCH(\"*\"&F21&\"*\",Sheet1!C:C,0)","v":{"$error":"#N/A"}},{"$f":"MATCH(\"*\"&H21&\"*\",Sheet1!C:C,0)","v":{"$error":"#N/A"}},{"$f":"MATCH(\"*\"&I21&\"*\",Sheet1!B:B,0)","v":{"$error":"#N/A"}},{"$f":"122.6/15","v":8.1733333333333338},null,"https://verticalmag.com/news/us-army-airbus-lakota-training-helicopters/",{"$f":"INDEX('[2]Pt1-AvionicsComponentCosts'!$A:$NE,MATCH(B21,'[2]Pt1-AvionicsComponentCosts'!$A:$A,0),MATCH(\"END MARKER\",'[2]Pt1-AvionicsComponentCosts'!$11:$11,0))","v":1468717.6160753041},0.99,0.99,1.7789931972853397]
[null,112,{"$f":"INDEX('[1]Pt1-AvionicsComponentCosts'!$A:$B,MATCH(B22,'[1]Pt1-AvionicsComponentCosts'!$A:$A,0),2)","v":"Helicopter"},"Airbus",1,"H120 Colibri","Airbus H120 Colibri","H120 Colibri","H120 Colibri",{"$f":"MATCH(\"*\"&F22&\"*\",Sheet1!C:C,0)","v":{"$error":"#N/A"}},{"$f":"MATCH(\"*\"&H22&\"*\",Sheet1!C:C,0)","v":{"$error":"#N/A"}},{"$f":"MATCH(\"*\"&I22&\"*\",Sheet1!B:B,0)","v":{"$error":"#N/A"}},2,null,"https://bjtonline.com/aircraft/airbus-helicopters-h120",{"$f":"INDEX('[2]Pt1-AvionicsComponentCosts'!$A:$NE,MATCH(B22,'[2]Pt1-AvionicsComponentCosts'!$A:$A,0),MATCH(\"END MARKER\",'[2]Pt1-AvionicsComponentCosts'!$11:$11,0))","v":283419.89760000003},0.99,0.99,1.4029284931200001]
[null,107,{"$f":"INDEX('[1]Pt1-AvionicsComponentCosts'!$A:$B,MATCH(B23,'[1]Pt1-AvionicsComponentCosts'!$A:$A,0),2)","v":"Helicopter"},"Airbus",1,"H125","Airbus H125","H125","H125",{"$f":"MATCH(\"*\"&F23&\"*\",Sheet1!C:C,0)","v":{"$error":"#N/A"}},{"$f":"MATCH(\"*\"&H23&\"*\",Sheet1!C:C,0)","v":{"$error":"#N/A"}},{"$f":"MATCH(\"*\"&I23&\"*\",Sheet1!B:B,0)","v":{"$error":"#N/A"}},2.9,null,"https://www.bjtonline.com/aircraft/airbus-helicopters-h125",{"$f":"INDEX('[2]Pt1-AvionicsComponentCosts'!$A:$NE,MATCH(B23,'[2]Pt1-AvionicsComponentCosts'!$A:$A,0),MATCH(\"END MARKER\",'[2]Pt1-AvionicsComponentCosts'!$11:$11,0))","v":283565.28960000002},0.99,0.99,0.96803323001379316]
[null,108,{"$f":"INDEX('[1]Pt1-AvionicsComponentCosts'!$A:$B,MATCH(B24,'[1]Pt1-AvionicsComponentCosts'!$A:$A,0),2)","v":"Helicopter"},"Airbus",1,"H130","Airbus H130","H130","H130",{"$f":"MATCH(\"*\"&F24&\"*\",Sheet1!C:C,0)","v":{"$error":"#N/A"}},{"$f":"MATCH(\"*\"&H24&\"*\",Sheet1!C:C,0)","v":{"$error":"#N/A"}},{"$f":"MATCH(\"*\"&I24&\"*\",Sheet1!B:B,0)","v":{"$error":"#N/A"}},3.3,null,"https://www.bjtonline.com/aircraft/airbus-helicopters-h130",{"$f":"INDEX('[2]Pt1-AvionicsComponentCosts'!$A:$NE,MATCH(B24,'[2]Pt1-AvionicsComponentCosts'!$A:$A,0),MATCH(\"END MARKER\",'[2]Pt1-AvionicsComponentCosts'!$11:$11,0))","v":282554.25599999999},0.99,0.99,0.84766276799999996]
[null,483,{"$f":"INDEX('[1]Pt1-AvionicsComponentCosts'!$A:$B,MATCH(B25,'[1]Pt1-AvionicsComponentCosts'!$A:$A,0),2)","v":"Helicopter"},"Airbus",1,"H135","Airbus H135","H135","H135",{"$f":"MATCH(\"*\"&F25&\"*\",Sheet1!C:C,0)","v":{"$error":"#N/A"}},{"$f":"MATCH(\"*\"&H25&\"*\",Sheet1!C:C,0)","v":{"$error":"#N/A"}},{"$f":"MATCH(\"*\"&I25&\"*\",Sheet1!B:B,0)","v":{"$error":"#N/A"}},5.7,null,"https://www.bjtonline.com/aircraft/airbus-helicopters-h135-p3",{"$f":"INDEX('[2]Pt1-AvionicsComponentCosts'!$A:$NE,MATCH(B25,'[2]Pt1-AvionicsComponentCosts'!$A:$A,0),MATCH(\"END MARKER\",'[2]Pt1-AvionicsComponentCosts'!$11:$11,0))","v":283419.89760000003},0.99,0.99,0.49225561162105269]
[null,113,{"$f":"INDEX('[1]Pt1-AvionicsComponentCosts'!$A:$B,MATCH(B26,'[1]Pt1-AvionicsComponentCosts'!$A:$A,0),2)","v":"Helicopter"},"Airbus",1,"H145","Airbus H145/Kawasaki BK117","H145/Kawasaki BK117","H145/Kawasaki BK117",{"$f":"MATCH(\"*\"&F26&\"*\",Sheet1!C:C,0)","v":{"$error":"#N/A"}},{"$f":"MATCH(\"*\"&H26&\"*\",Sheet1!C:C,0)","v":{"$error":"#N/A"}},{"$f":"MATCH(\"*\"&I26&\"*\",Sheet1!B:B,0)","v":{"$error":"#N/A"}},9.6999999999999993,null,"https://www.bjtonline.com/aircraft/airbus-helicopters-h145",{"$f":"INDEX('[2]Pt1-AvionicsComponentCosts'!$A:$NE,MATCH(B26,'[2]Pt1-AvionicsComponentCosts'!$A:$A,0),MATCH(\"END MARKER\",'[2]Pt1-AvionicsComponentCosts'!$11:$11,0))","v":316830.23839999997},0.99,0.99,0.32336282063505151]
[null,109,{"$f":"INDEX('[1]Pt1-AvionicsComponentCosts'!$A:$B,MATCH(B27,'[1]Pt1-AvionicsComponentCosts'!$A:$A,0),2)","v":"Helicopter"},"Airbus",1,"H155","Airbus H155","H155","H155",{"$f":"MATCH(\"*\"&F27&\"*\",Sheet1!C:C,0)","v":{"$error":"#N/A"}},{"$f":"MATCH(\"*\"&H27&\"*\",Sheet1!C:C,0)","v":{"$error":"#N/A"}},{"$f":"MATCH(\"*\"&I27&\"*\",Sheet1!B:B,0)","v":{"$error":"#N/A"}},14,null,"https://www.bjtonline.com/aircraft/airbus-helicopters-h155",{"$f":"INDEX('[2]Pt1-AvionicsComponentCosts'!$A:$NE,MATCH(B27,'[2]Pt1-AvionicsComponentCosts'!$A:$A,0),MATCH(\"END MARKER\",'[2]Pt1-AvionicsComponentCosts'!$11:$11,0))","v":500428.6704},0.99,0.99,0.35387455978285715]
[null,110,{"$f":"INDEX('[1]Pt1-AvionicsComponentCosts'!$A:$B,MATCH(B28,'[1]Pt1-AvionicsComponentCosts'!$A:$A,0),2)","v":"Helicopter"},"Airbus",1,"H160","Airbus H160","H160","H160",{"$f":"MATCH(\"*\"&F28&\"*\",Sheet1!C:C,0)","v":{"$error":"#N/A"}},{"$f":"MATCH(\"*\"&H28&\"*\",Sheet1!C:C,0)","v":{"$error":"#N/A"}},{"$f":"MATCH(\"*\"&I28&\"*\",Sheet1!B:B,0)","v":{"$error":"#N/A"}},14,null,"https://www.businessinsider.com/airbus-luxury-helicopter-seat-10-people-for-around-14-million-2020-9",{"$f":"INDEX('[2]Pt1-AvionicsComponentCosts'!$A:$NE,MATCH(B28,'[2]Pt1-AvionicsComponentCosts'!$A:$A,0),MATCH(\"END MARKER\",'[2]Pt1-AvionicsComponentCosts'!$11:$11,0))","v":498551.9952},0.99,0.99,0.35254748231999999]
[null,102,{"$f":"INDEX('[1]Pt1-AvionicsComponentCosts'!$A:$B,MATCH(B29,'[1]Pt1-AvionicsComponentCosts'!$A:$A,0),2)","v":"Helicopter"},"Airbus",1,"H175","Airbus H175","H175","H175",{"$f":"MATCH(\"*\"&F29&\"*\",Sheet1!C:C,0)","v":{"$error":"#N/A"}},{"$f":"MATCH(\"*\"&H29&\"*\",Sheet1!C:C,0)","v":{"$error":"#N/A"}},{"$f":"MATCH(\"*\"&I29&\"*\",Sheet1!B:B,0)","v":{"$error":"#N/A"}},17,null,"https://www.bjtonline.com/aircraft/airbus-helicopters-h175",{"$f":"INDEX('[2]Pt1-AvionicsComponentCosts'!$A:$NE,MATCH(B29,'[2]Pt1-AvionicsComponentCosts'!$A:$A,0),MATCH(\"END MARKER\",'[2]Pt1-AvionicsComponentCosts'!$11:$11,0))","v":710208.90399999998},0.99,0.99,0.41359224409411766]
[null,105,{"$f":"INDEX('[1]Pt1-AvionicsComponentCosts'!$A:$B,MATCH(B30,'[1]Pt1-AvionicsComponentCosts'!$A:$A,0),2)","v":"Helicopter"},"Airbus",1,"H215 / H225","Airbus H215 / H225","H215 / H225","H215 / H225",{"$f":"MATCH(\"*\"&F30&\"*\",Sheet1!C:C,0)","v":{"$error":"#N/A"}},{"$f":"MATCH(\"*\"&H30&\"*\",Sheet1!C:C,0)","v":{"$error":"#N/A"}},{"$f":"MATCH(\"*\"&I30&\"*\",Sheet1!B:B,0)","v":{"$error":"#N/A"}},18,null,"https://www.bjtonline.com/aircraft/airbus-helicopters-h215-l1",{"$f":"INDEX('[2]Pt1-AvionicsComponentCosts'!$A:$NE,MATCH(B30,'[2]Pt1-AvionicsComponentCosts'!$A:$A,0),MATCH(\"END MARKER\",'[2]Pt1-AvionicsComponentCosts'!$11:$11,0))","v":717124.03359999997},0.99,0.99,0.39441821847999997]
[null,106,{"$f":"INDEX('[1]Pt1-AvionicsComponentCosts'!$A:$B,MATCH(B31,'[1]Pt1-AvionicsComponentCosts'!$A:$A,0),2)","v":"Helicopter"},"Airbus",1,"H355","Airbus H355","H355","H355",{"$f":"MATCH(\"*\"&F31&\"*\",Sheet1!C:C,0)","v":{"$error":"#N/A"}},{"$f":"MATCH(\"*\"&H31&\"*\",Sheet1!C:C,0)","v":{"$error":"#N/A"}},{"$f":"MATCH(\"*\"&I31&\"*\",Sheet1!B:B,0)","v":{"$error":"#N/A"}},1.9,null,"https://www.bjtonline.com/aircraft/airbus-helicopters-as355f2-twinstar",{"$f":"INDEX('[2]Pt1-AvionicsComponentCosts'!$A:$NE,MATCH(B31,'[2]Pt1-AvionicsComponentCosts'!$A:$A,0),MATCH(\"END MARKER\",'[2]Pt1-AvionicsComponentCosts'!$11:$11,0))","v":323609.97919999994},0.99,0.99,1.6861783126736838]
[null,645,{"$f":"INDEX('[1]Pt1-AvionicsComponentCosts'!$A:$B,MATCH(B32,'[1]Pt1-AvionicsComponentCosts'!$A:$A,0),2)","v":"Helicopter"},"Airbus",1,"X6","Airbus X6","X6","X6",{"$f":"MATCH(\"*\"&F32&\"*\",Sheet1!C:C,0)","v":{"$error":"#N/A"}},{"$f":"MATCH(\"*\"&H32&\"*\",Sheet1!C:C,0)","v":{"$error":"#N/A"}},{"$f":"MATCH(\"*\"&I32&\"*\",Sheet1!B:B,0)","v":{"$error":"#N/A"}},"x","concept",null,{"$f":"INDEX('[2]Pt1-AvionicsComponentCosts'!$A:$NE,MATCH(B32,'[2]Pt1-AvionicsComponentCosts'!$A:$A,0),MATCH(\"END MARKER\",'[2]Pt1-AvionicsComponentCosts'!$11:$11,0))","v":1521020.9833878372},0.99,0.99,""]
[null,221,{"$f":"INDEX('[1]Pt1-AvionicsComponentCosts'!$A:$B,MATCH(B33,'[1]Pt1-AvionicsComponentCosts'!$A:$A,0),2)","v":"Large Commercial Aircraft"},"Airbus",1,"A220","Airbus A220-100","A220-100","A220-100",{"$f":"MATCH(\"*\"&F33&\"*\",Sheet1!C:C,0)","v":3},{"$f":"MATCH(\"*\"&H33&\"*\",Sheet1!C:C,0)","v":{"$error":"#N/A"}},{"$f":"MATCH(\"*\"&I33&\"*\",Sheet1!B:B,0)","v":3},{"$f":"INDEX(Sheet1!$A:$K,MATCH($I33,Sheet1!$B:$B,0),MATCH(M$1,Sheet1!$A$1:$K$1,0))","v":81},null,{"$f":"INDEX(Sheet1!$A:$K,MATCH($I33,Sheet1!$B:$B,0),MATCH(O$1,Sheet1!$A$1:$K$1,0))","v":"https://simpleflying.com/how-much-do-airbus-aircraft-cost/"},{"$f":"INDEX('[2]Pt1-AvionicsComponentCosts'!$A:$NE,MATCH(B33,'[2]Pt1-AvionicsComponentCosts'!$A:$A,0),MATCH(\"END MARKER\",'[2]Pt1-AvionicsComponentCosts'!$11:$11,0))","v":1568058},{"$f":"50%","v":0.5},{"$f":"50%","v":0.5},9.6793703703703701E-2]
[null,222,{"$f":"INDEX('[1]Pt1-AvionicsComponentCosts'!$A:$B,MATCH(B34,'[1]Pt1-AvionicsComponentCosts'!$A:$A,0),2)","v":"Large Commercial Aircraft"},"Airbus",1,"A220","Airbus A220-300","A220-300","A220-300",{"$f":"MATCH(\"*\"&F34&\"*\",Sheet1!C:C,0)","v":3},{"$f":"MATCH(\"*\"&H34&\"*\",Sheet1!C:C,0)","v":{"$error":"#N/A"}},{"$f":"MATCH(\"*\"&I34&\"*\",Sheet1!B:B,0)","v":4},{"$f":"INDEX(Sheet1!$A:$K,MATCH($I34,Sheet1!$B:$B,0),MATCH(M$1,Sheet1!$A$1:$K$1,0))","v":91.5},null,{"$f":"INDEX(Sheet1!$A:$K,MATCH($I34,Sheet1!$B:$B,0),MATCH(O$1,Sheet1!$A$1:$K$1,0))","v":"https://simpleflying.com/how-much-do-airbus-aircraft-cost/"},{"$f":"INDEX('[2]Pt1-AvionicsComponentCosts'!$A:$NE,MATCH(B34,'[2]Pt1-AvionicsComponentCosts'!$A:$A,0),MATCH(\"END MARKER\",'[2]Pt1-AvionicsComponentCosts'!$11:$11,0))","v":1568058},{"$f":"50%","v":0.5},{"$f":"50%","v":0.5},8.5686229508196723E-2]
[null,653,{"$f":"INDEX('[1]Pt1-AvionicsComponentCosts'!$A:$B,MATCH(B35,'[1]Pt1-AvionicsComponentCosts'!$A:$A,0),2)","v":"Large Commercial Aircraft"},"Airbus",1,"A220","Airbus A220-500","A220-500","A220-500",{"$f":"MATCH(\"*\"&F35&\"*\",Sheet1!C:C,0)","v":3},{"$f":"MATCH(\"*\"&H35&\"*\",Sheet1!C:C,0)","v":{"$error":"#N/A"}},{"$f":"MATCH(\"*\"&I35&\"*\",Sheet1!B:B,0)","v":{"$error":"#N/A"}},"x","concept",null,{"$f":"INDEX('[2]Pt1-AvionicsComponentCosts'!$A:$NE,MATCH(B35,'[2]Pt1-AvionicsComponentCosts'!$A:$A,0),MATCH(\"END MARKER\",'[2]Pt1-AvionicsComponentCosts'!$11:$11,0))","v":1669320.5488},{"$f":"50%","v":0.5},{"$f":"50%","v":0.5},""]
[null,634,{"$f":"INDEX('[1]Pt1-AvionicsComponentCosts'!$A:$B,MATCH(B36,'[1]Pt1-AvionicsComponentCosts'!$A:$A,0),2)","v":"Large Commercial Aircraft"},"Airbus",1,"A320ceo","A319-100","A319-100","A319-100",{"$f":"MATCH(\"*\"&F36&\"*\",Sheet1!C:C,0)","v":{"$error":"#N/A"}},{"$f":"MATCH(\"*\"&H36&\"*\",Sheet1!C:C,0)","v":{"$error":"#N/A"}},{"$f":"MATCH(\"*\"&I36&\"*\",Sheet1!B:B,0)","v":{"$error":"#N/A"}},89,null,null,{"$f":"INDEX('[2]Pt1-AvionicsComponentCosts'!$A:$NE,MATCH(B36,'[2]Pt1-AvionicsComponentCosts'!$A:$A,0),MATCH(\"END MARKER\",'[2]Pt1-AvionicsComponentCosts'!$11:$11,0))","v":1450795},{"$f":"50%","v":0.5},{"$f":"50%","v":0.5},8.150533707865168E-2]
[null,633,{"$f":"INDEX('[1]Pt1-AvionicsComponentCosts'!$A:$B,MATCH(B37,'[1]Pt1-AvionicsComponentCosts'!$A:$A,0),2)","v":"Large Commercial Aircraft"},"Airbus",1,"A320ceo","A320-200","A320-200","A320-200",{"$f":"MATCH(\"*\"&F37&\"*\",Sheet1!C:C,0)","v":{"$error":"#N/A"}},{"$f":"MATCH(\"*\"&H37&\"*\",Sheet1!C:C,0)","v":{"$error":"#N/A"}},{"$f":"MATCH(\"*\"&I37&\"*\",Sheet1!B:B,0)","v":{"$error":"#N/A"}},98,null,null,{"$f":"INDEX('[2]Pt1-AvionicsComponentCosts'!$A:$NE,MATCH(B37,'[2]Pt1-AvionicsComponentCosts'!$A:$A,0),MATCH(\"END MARKER\",'[2]Pt1-AvionicsComponentCosts'!$11:$11,0))","v":1450796},{"$f":"50%","v":0.5},{"$f":"50%","v":0.5},7.4020204081632651E-2]
[null,206,{"$f":"INDEX('[1]Pt1-AvionicsComponentCosts'!$A:$B,MATCH(B38,'[1]Pt1-AvionicsComponentCosts'!$A:$A,0),2)","v":"Large Commercial Aircraft"},"Airbus",1,"A320ceo","Airbus A319ceo","A319ceo","A319ceo",{"$f":"MATCH(\"*\"&F38&\"*\",Sheet1!C:C,0)","v":{"$error":"#N/A"}},{"$f":"MATCH(\"*\"&H38&\"*\",Sheet1!C:C,0)","v":{"$error":"#N/A"}},{"$f":"MATCH(\"*\"&I38&\"*\",Sheet1!B:B,0)","v":{"$error":"#N/A"}},92.3,null,"https://simpleflying.com/how-much-do-airbus-aircraft-cost/",{"$f":"INDEX('[2]Pt1-AvionicsComponentCosts'!$A:$NE,MATCH(B38,'[2]Pt1-AvionicsComponentCosts'!$A:$A,0),MATCH(\"END MARKER\",'[2]Pt1-AvionicsComponentCosts'!$11:$11,0))","v":1450795},{"$f":"50%","v":0.5},{"$f":"50%","v":0.5},7.8591278439869988E-2]
[null,207,{"$f":"INDEX('[1]Pt1-AvionicsComponentCosts'!$A:$B,MATCH(B39,'[1]Pt1-AvionicsComponentCosts'!$A:$A,0),2)","v":"Large Commercial Aircraft"},"Airbus",1,"A320ceo","Airbus A320ceo","A320ceo","A320ceo",{"$f":"MATCH(\"*\"&F39&\"*\",Sheet1!C:C,0)","v":{"$error":"#N/A"}},{"$f":"MATCH(\"*\"&H39&\"*\",Sheet1!C:C,0)","v":{"$error":"#N/A"}},{"$f":"MATCH(\"*\"&I39&\"*\",Sheet1!B:B,0)","v":{"$error":"#N/A"}},101,null,"https://simpleflying.com/how-much-do-airbus-aircraft-cost/",{"$f":"INDEX('[2]Pt1-AvionicsComponentCosts'!$A:$NE,MATCH(B39,'[2]Pt1-AvionicsComponentCosts'!$A:$A,0),MATCH(\"END MARKER\",'[2]Pt1-AvionicsComponentCosts'!$11:$11,0))","v":1450795},{"$f":"50%","v":0.5},{"$f":"50%","v":0.5},7.1821534653465344E-2]
[null,208,{"$f":"INDEX('[1]Pt1-AvionicsComponentCosts'!$A:$B,MATCH(B40,'[1]Pt1-AvionicsComponentCosts'!$A:$A,0),2)","v":"Large Commercial Aircraft"},"Airbus",1,"A320ceo","Airbus A321ceo","A321ceo","A321ceo",{"$f":"MATCH(\"*\"&F40&\"*\",Sheet1!C:C,0)","v":{"$error":"#N/A"}},{"$f":"MATCH(\"*\"&H40&\"*\",Sheet1!C:C,0)","v":{"$error":"#N/A"}},{"$f":"MATCH(\"*\"&I40&\"*\",Sheet1!B:B,0)","v":{"$error":"#N/A"}},118.3,null,"https://simpleflying.com/how-much-do-airbus-aircraft-cost/",{"$f":"INDEX('[2]Pt1-AvionicsComponentCosts'!$A:$NE,MATCH(B40,'[2]Pt1-AvionicsComponentCosts'!$A:$A,0),MATCH(\"END MARKER\",'[2]Pt1-AvionicsComponentCosts'!$11:$11,0))","v":1450795},{"$f":"50%","v":0.5},{"$f":"50%","v":0.5},6.1318469991546914E-2]
[null,513,{"$f":"INDEX('[1]Pt1-AvionicsComponentCosts'!$A:$B,MATCH(B41,'[1]Pt1-AvionicsComponentCosts'!$A:$A,0),2)","v":"Large Commercial Aircraft"},"Airbus",1,"A320neo","Airbus A319neo","A319neo","A319neo",{"$f":"MATCH(\"*\"&F41&\"*\",Sheet1!C:C,0)","v":{"$error":"#N/A"}},{"$f":"MATCH(\"*\"&H41&\"*\",Sheet1!C:C,0)","v":{"$error":"#N/A"}},{"$f":"MATCH(\"*\"&I41&\"*\",Sheet1!B:B,0)","v":7},{"$f":"INDEX(Sheet1!$A:$K,MATCH($I41,Sheet1!$B:$B,0),MATCH(M$1,Sheet1!$A$1:$K$1,0))","v":101.5},null,{"$f":"INDEX(Sheet1!$A:$K,MATCH($I41,Sheet1!$B:$B,0),MATCH(O$1,Sheet1!$A$1:$K$1,0))","v":"https://simpleflying.com/how-much-do-airbus-aircraft-cost/"},{"$f":"INDEX('[2]Pt1-AvionicsComponentCosts'!$A:$NE,MATCH(B41,'[2]Pt1-AvionicsComponentCosts'!$A:$A,0),MATCH(\"END MARKER\",'[2]Pt1-AvionicsComponentCosts'!$11:$11,0))","v":1450795},{"$f":"50%","v":0.5},{"$f":"50%","v":0.5},7.1467733990147789E-2]
[null,514,{"$f":"INDEX('[1]Pt1-AvionicsComponentCosts'!$A:$B,MATCH(B42,'[1]Pt1-AvionicsComponentCosts'!$A:$A,0),2)","v":"Large Commercial Aircraft"},"Airbus",1,"A320neo","Airbus A320neo","A320neo","A320neo",{"$f":"MATCH(\"*\"&F42&\"*\",Sheet1!C:C,0)","v":{"$error":"#N/A"}},{"$f":"MATCH(\"*\"&H42&\"*\",Sheet1!C:C,0)","v":{"$error":"#N/A"}},{"$f":"MATCH(\"*\"&I42&\"*\",Sheet1!B:B,0)","v":{"$error":"#N/A"}},110.6,null,"https://simpleflying.com/how-much-do-airbus-aircraft-cost/",{"$f":"INDEX('[2]Pt1-AvionicsComponentCosts'!$A:$NE,MATCH(B42,'[2]Pt1-AvionicsComponentCosts'!$A:$A,0),MATCH(\"END MARKER\",'[2]Pt1-AvionicsComponentCosts'!$11:$11,0))","v":1450795},{"$f":"50%","v":0.5},{"$f":"50%","v":0.5},6.5587477396021707E-2]
[null,660,{"$f":"INDEX('[1]Pt1-AvionicsComponentCosts'!$A:$B,MATCH(B43,'[1]Pt1-AvionicsComponentCosts'!$A:$A,0),2)","v":"Large Commercial Aircraft"},"Airbus",1,"A320neo","Airbus A321 LR","A321 LR","A321 LR",{"$f":"MATCH(\"*\"&F43&\"*\",Sheet1!C:C,0)","v":{"$error":"#N/A"}},{"$f":"MATCH(\"*\"&H43&\"*\",Sheet1!C:C,0)","v":{"$error":"#N/A"}},{"$f":"MATCH(\"*\"&I43&\"*\",Sheet1!B:B,0)","v":{"$error":"#N/A"}},129.5,"guess","https://www.forbes.com/sites/michaelgoldstein/2019/12/04/united-airlines-to-buy-50-ultra-long-range-airbus-a321xlr-aircraft-in-estimated-6-billion-deal/",{"$f":"INDEX('[2]Pt1-AvionicsComponentCosts'!$A:$NE,MATCH(B43,'[2]Pt1-AvionicsComponentCosts'!$A:$A,0),MATCH(\"END MARKER\",'[2]Pt1-AvionicsComponentCosts'!$11:$11,0))","v":1505278.5488},{"$f":"50%","v":0.5},{"$f":"50%","v":0.5},5.8118862888030885E-2]
[null,662,{"$f":"INDEX('[1]Pt1-AvionicsComponentCosts'!$A:$B,MATCH(B44,'[1]Pt1-AvionicsComponentCosts'!$A:$A,0),2)","v":"Large Commercial Aircraft"},"Airbus",1,"A320neo","Airbus A321 XLR","A321 XLR","A321 XLR",{"$f":"MATCH(\"*\"&F44&\"*\",Sheet1!C:C,0)","v":{"$error":"#N/A"}},{"$f":"MATCH(\"*\"&H44&\"*\",Sheet1!C:C,0)","v":{"$error":"#N/A"}},{"$f":"MATCH(\"*\"&I44&\"*\",Sheet1!B:B,0)","v":{"$error":"#N/A"}},129.5,"guess","https://www.forbes.com/sites/michaelgoldstein/2019/12/04/united-airlines-to-buy-50-ultra-long-range-airbus-a321xlr-aircraft-in-estimated-6-billion-deal/",{"$f":"INDEX('[2]Pt1-AvionicsComponentCosts'!$A:$NE,MATCH(B44,'[2]Pt1-AvionicsComponentCosts'!$A:$A,0),MATCH(\"END MARKER\",'[2]Pt1-AvionicsComponentCosts'!$11:$11,0))","v":1505278.5488},{"$f":"50%","v":0.5},{"$f":"50%","v":0.5},5.8118862888030885E-2]
[null,515,{"$f":"INDEX('[1]Pt1-AvionicsComponentCosts'!$A:$B,MATCH(B45,'[1]Pt1-AvionicsComponentCosts'!$A:$A,0),2)","v":"Large Commercial Aircraft"},"Airbus",1,"A320neo","Airbus A321neo","A321neo","A321neo",{"$f":"MATCH(\"*\"&F45&\"*\",Sheet1!C:C,0)","v":{"$error":"#N/A"}},{"$f":"MATCH(\"*\"&H45&\"*\",Sheet1!C:C,0)","v":{"$error":"#N/A"}},{"$f":"MATCH(\"*\"&I45&\"*\",Sheet1!B:B,0)","v":10},{"$f":"INDEX(Sheet1!$A:$K,MATCH($I45,Sheet1!$B:$B,0),MATCH(M$1,Sheet1!$A$1:$K$1,0))","v":129.5},null,{"$f":"INDEX(Sheet1!$A:$K,MATCH($I45,Sheet1!$B:$B,0),MATCH(O$1,Sheet1!$A$1:$K$1,0))","v":"https://simpleflying.com/how-much-do-airbus-aircraft-cost/"},{"$f":"INDEX('[2]Pt1-AvionicsComponentCosts'!$A:$NE,MATCH(B45,'[2]Pt1-AvionicsComponentCosts'!$A:$A,0),MATCH(\"END MARKER\",'[2]Pt1-AvionicsComponentCosts'!$11:$11,0))","v":1450795},{"$f":"50%","v":0.5},{"$f":"50%","v":0.5},5.6015250965250965E-2]
[null,654,{"$f":"INDEX('[1]Pt1-AvionicsComponentCosts'!$A:$B,MATCH(B46,'[1]Pt1-AvionicsComponentCosts'!$A:$A,0),2)","v":"Large Commercial Aircraft"},"Airbus",1,"A320neo","Airbus A322X","A322X","A322X",{"$f":"MATCH(\"*\"&F46&\"*\",Sheet1!C:C,0)","v":{"$error":"#N/A"}},{"$f":"MATCH(\"*\"&H46&\"*\",Sheet1!C:C,0)","v":{"$error":"#N/A"}},{"$f":"MATCH(\"*\"&I46&\"*\",Sheet1!B:B,0)","v":{"$error":"#N/A"}},"x","concept",null,{"$f":"INDEX('[2]Pt1-AvionicsComponentCosts'!$A:$NE,MATCH(B46,'[2]Pt1-AvionicsComponentCosts'!$A:$A,0),MATCH(\"END MARKER\",'[2]Pt1-AvionicsComponentCosts'!$11:$11,0))","v":1669320.5488},{"$f":"50%","v":0.5},{"$f":"50%","v":0.5},""]
[null,212,{"$f":"INDEX('[1]Pt1-AvionicsComponentCosts'!$A:$B,MATCH(B47,'[1]Pt1-AvionicsComponentCosts'!$A:$A,0),2)","v":"Large Commercial Aircraft"},"Airbus",1,"A330","Airbus A330-200","A330-200","A330-200",{"$f":"MATCH(\"*\"&F47&\"*\",Sheet1!C:C,0)","v":11},{"$f":"MATCH(\"*\"&H47&\"*\",Sheet1!C:C,0)","v":{"$error":"#N/A"}},{"$f":"MATCH(\"*\"&I47&\"*\",Sheet1!B:B,0)","v":11},{"$f":"INDEX(Sheet1!$A:$K,MATCH($I47,Sheet1!$B:$B,0),MATCH(M$1,Sheet1!$A$1:$K$1,0))","v":231.5},null,{"$f":"INDEX(Sheet1!$A:$K,MATCH($I47,Sheet1!$B:$B,0),MATCH(O$1,Sheet1!$A$1:$K$1,0))","v":"http://www.axonaviation.com/commercial-aircraft/aircraft-data/aircraft-pricing"},{"$f":"INDEX('[2]Pt1-AvionicsComponentCosts'!$A:$NE,MATCH(B47,'[2]Pt1-AvionicsComponentCosts'!$A:$A,0),MATCH(\"END MARKER\",'[2]Pt1-AvionicsComponentCosts'!$11:$11,0))","v":1959843.1599999997},{"$f":"50%","v":0.5},{"$f":"50%","v":0.5},4.2329225917926559E-2]
[null,213,{"$f":"INDEX('[1]Pt1-AvionicsComponentCosts'!$A:$B,MATCH(B48,'[1]Pt1-AvionicsComponentCosts'!$A:$A,0),2)","v":"Large Commercial Aircraft"},"Airbus",1,"A330","Airbus A330-300","A330-300","A330-300",{"$f":"MATCH(\"*\"&F48&\"*\",Sheet1!C:C,0)","v":11},{"$f":"MATCH(\"*\"&H48&\"*\",Sheet1!C:C,0)","v":{"$error":"#N/A"}},{"$f":"MATCH(\"*\"&I48&\"*\",Sheet1!B:B,0)","v":13},{"$f":"INDEX(Sheet1!$A:$K,MATCH($I48,Sheet1!$B:$B,0),MATCH(M$1,Sheet1!$A$1:$K$1,0))","v":256.39999999999998},null,{"$f":"INDEX(Sheet1!$A:$K,MATCH($I48,Sheet1!$B:$B,0),MATCH(O$1,Sheet1!$A$1:$K$1,0))","v":"http://www.axonaviation.com/commercial-aircraft/aircraft-data/aircraft-pricing"},{"$f":"INDEX('[2]Pt1-AvionicsComponentCosts'!$A:$NE,MATCH(B48,'[2]Pt1-AvionicsComponentCosts'!$A:$A,0),MATCH(\"END MARKER\",'[2]Pt1-AvionicsComponentCosts'!$11:$11,0))","v":1959843.1599999997},{"$f":"50%","v":0.5},{"$f":"50%","v":0.5},3.8218470358814351E-2]
[null,214,{"$f":"INDEX('[1]Pt1-AvionicsComponentCosts'!$A:$B,MATCH(B49,'[1]Pt1-AvionicsComponentCosts'!$A:$A,0),2)","v":"Large Commercial Aircraft"},"Airbus",1,"A330","Airbus A330-800neo","A330-800neo","A330-800neo",{"$f":"MATCH(\"*\"&F49&\"*\",Sheet1!C:C,0)","v":11},{"$f":"MATCH(\"*\"&H49&\"*\",Sheet1!C:C,0)","v":{"$error":"#N/A"}},{"$f":"MATCH(\"*\"&I49&\"*\",Sheet1!B:B,0)","v":14},{"$f":"INDEX(Sheet1!$A:$K,MATCH($I49,Sheet1!$B:$B,0),MATCH(M$1,Sheet1!$A$1:$K$1,0))","v":259.89999999999998},null,{"$f":"INDEX(Sheet1!$A:$K,MATCH($I49,Sheet1!$B:$B,0),MATCH(O$1,Sheet1!$A$1:$K$1,0))","v":"https://simpleflying.com/how-much-do-airbus-aircraft-cost/"},{"$f":"INDEX('[2]Pt1-AvionicsComponentCosts'!$A:$NE,MATCH(B49,'[2]Pt1-AvionicsComponentCosts'!$A:$A,0),MATCH(\"END MARKER\",'[2]Pt1-AvionicsComponentCosts'!$11:$11,0))","v":1980343.1599999997},{"$f":"50%","v":0.5},{"$f":"50%","v":0.5},3.8098175452096962E-2]
[null,215,{"$f":"INDEX('[1]Pt1-AvionicsComponentCosts'!$A:$B,MATCH(B50,'[1]Pt1-AvionicsComponentCosts'!$A:$A,0),2)","v":"Large Commercial Aircraft"},"Airbus",1,"A330","Airbus A330-900neo","A330-900neo","A330-900neo",{"$f":"MATCH(\"*\"&F50&\"*\",Sheet1!C:C,0)","v":11},{"$f":"MATCH(\"*\"&H50&\"*\",Sheet1!C:C,0)","v":{"$error":"#N/A"}},{"$f":"MATCH(\"*\"&I50&\"*\",Sheet1!B:B,0)","v":15},{"$f":"INDEX(Sheet1!$A:$K,MATCH($I50,Sheet1!$B:$B,0),MATCH(M$1,Sheet1!$A$1:$K$1,0))","v":296.39999999999998},null,{"$f":"INDEX(Sheet1!$A:$K,MATCH($I50,Sheet1!$B:$B,0),MATCH(O$1,Sheet1!$A$1:$K$1,0))","v":"https://simpleflying.com/how-much-do-airbus-aircraft-cost/"},{"$f":"INDEX('[2]Pt1-AvionicsComponentCosts'!$A:$NE,MATCH(B50,'[2]Pt1-AvionicsComponentCosts'!$A:$A,0),MATCH(\"END MARKER\",'[2]Pt1-AvionicsComponentCosts'!$11:$11,0))","v":1980343.1599999997},{"$f":"50%","v":0.5},{"$f":"50%","v":0.5},3.3406598515519567E-2]
[null,304,{"$f":"INDEX('[1]Pt1-AvionicsComponentCosts'!$A:$B,MATCH(B51,'[1]Pt1-AvionicsComponentCosts'!$A:$A,0),2)","v":"Large Commercial Aircraft"},"Airbus",1,"A340","Airbus A340-200/300","A340-200/300","A340-200/300",{"$f":"MATCH(\"*\"&F51&\"*\",Sheet1!C:C,0)","v":{"$error":"#N/A"}},{"$f":"MATCH(\"*\"&H51&\"*\",Sheet1!C:C,0)","v":{"$error":"#N/A"}},{"$f":"MATCH(\"*\"&I51&\"*\",Sheet1!B:B,0)","v":{"$error":"#N/A"}},"x","OOP",null,{"$f":"INDEX('[2]Pt1-AvionicsComponentCosts'!$A:$NE,MATCH(B51,'[2]Pt1-AvionicsComponentCosts'!$A:$A,0),MATCH(\"END MARKER\",'[2]Pt1-AvionicsComponentCosts'!$11:$11,0))","v":2013760.1599999997},{"$f":"50%","v":0.5},{"$f":"50%","v":0.5},""]
[null,5,{"$f":"INDEX('[1]Pt1-AvionicsComponentCosts'!$A:$B,MATCH(B52,'[1]Pt1-AvionicsComponentCosts'!$A:$A,0),2)","v":"Large Commercial Aircraft"},"Airbus",1,"A340","Airbus A340-500/600","A340-500/600","A340-500/600",{"$f":"MATCH(\"*\"&F52&\"*\",Sheet1!C:C,0)","v":{"$error":"#N/A"}},{"$f":"MATCH(\"*\"&H52&\"*\",Sheet1!C:C,0)","v":{"$error":"#N/A"}},{"$f":"MATCH(\"*\"&I52&\"*\",Sheet1!B:B,0)","v":{"$error":"#N/A"}},"x","OOP",null,{"$f":"INDEX('[2]Pt1-AvionicsComponentCosts'!$A:$NE,MATCH(B52,'[2]Pt1-AvionicsComponentCosts'!$A:$A,0),MATCH(\"END MARKER\",'[2]Pt1-AvionicsComponentCosts'!$11:$11,0))","v":2025780.7231999999},{"$f":"50%","v":0.5},{"$f":"50%","v":0.5},""]
[null,6,{"$f":"INDEX('[1]Pt1-AvionicsComponentCosts'!$A:$B,MATCH(B53,'[1]Pt1-AvionicsComponentCosts'!$A:$A,0),2)","v":"Large Commercial Aircraft"},"Airbus",1,"A350","Airbus A350 XWB - A350-900","A350 XWB - A350-900","A350 XWB - A350-900",{"$f":"MATCH(\"*\"&F53&\"*\",Sheet1!C:C,0)","v":17},{"$f":"MATCH(\"*\"&H53&\"*\",Sheet1!C:C,0)","v":{"$error":"#N/A"}},{"$f":"MATCH(\"*\"&I53&\"*\",Sheet1!B:B,0)","v":{"$error":"#N/A"}},308.10000000000002,null,"http://www.axonaviation.com/commercial-aircraft/aircraft-data/aircraft-pricing",{"$f":"INDEX('[2]Pt1-AvionicsComponentCosts'!$A:$NE,MATCH(B53,'[2]Pt1-AvionicsComponentCosts'!$A:$A,0),MATCH(\"END MARKER\",'[2]Pt1-AvionicsComponentCosts'!$11:$11,0))","v":2635778.5151999998},{"$f":"50%","v":0.5},{"$f":"50%","v":0.5},4.2774724362220053E-2]
[null,7,{"$f":"INDEX('[1]Pt1-AvionicsComponentCosts'!$A:$B,MATCH(B54,'[1]Pt1-AvionicsComponentCosts'!$A:$A,0),2)","v":"Large Commercial Aircraft"},"Airbus",1,"A350","Airbus A350-1000","A350-1000","A350-1000",{"$f":"MATCH(\"*\"&F54&\"*\",Sheet1!C:C,0)","v":17},{"$f":"MATCH(\"*\"&H54&\"*\",Sheet1!C:C,0)","v":{"$error":"#N/A"}},{"$f":"MATCH(\"*\"&I54&\"*\",Sheet1!B:B,0)","v":18},{"$f":"INDEX(Sheet1!$A:$K,MATCH($I54,Sheet1!$B:$B,0),MATCH(M$1,Sheet1!$A$1:$K$1,0))","v":355.7},null,{"$f":"INDEX(Sheet1!$A:$K,MATCH($I54,Sheet1!$B:$B,0),MATCH(O$1,Sheet1!$A$1:$K$1,0))","v":"http://www.axonaviation.com/commercial-aircraft/aircraft-data/aircraft-pricing"},{"$f":"INDEX('[2]Pt1-AvionicsComponentCosts'!$A:$NE,MATCH(B54,'[2]Pt1-AvionicsComponentCosts'!$A:$A,0),MATCH(\"END MARKER\",'[2]Pt1-AvionicsComponentCosts'!$11:$11,0))","v":2635778.5151999998},{"$f":"50%","v":0.5},{"$f":"50%","v":0.5},3.7050583570424511E-2]
[null,657,{"$f":"INDEX('[1]Pt1-AvionicsComponentCosts'!$A:$B,MATCH(B55,'[1]Pt1-AvionicsComponentCosts'!$A:$A,0),2)","v":"Large Commercial Aircraft"},"Airbus",1,"A350","Airbus A350-1000neo","A350-1000neo","A350-1000neo",{"$f":"MATCH(\"*\"&F55&\"*\",Sheet1!C:C,0)","v":17},{"$f":"MATCH(\"*\"&H55&\"*\",Sheet1!C:C,0)","v":{"$error":"#N/A"}},{"$f":"MATCH(\"*\"&I55&\"*\",Sheet1!B:B,0)","v":{"$error":"#N/A"}},355,null,"http://www.axonaviation.com/commercial-aircraft/aircraft-data/aircraft-pricing",{"$f":"INDEX('[2]Pt1-AvionicsComponentCosts'!$A:$NE,MATCH(B55,'[2]Pt1-AvionicsComponentCosts'!$A:$A,0),MATCH(\"END MARKER\",'[2]Pt1-AvionicsComponentCosts'!$11:$11,0))","v":2635778.5151999998},{"$f":"50%","v":0.5},{"$f":"50%","v":0.5},3.712364105915493E-2]
[null,656,{"$f":"INDEX('[1]Pt1-AvionicsComponentCosts'!$A:$B,MATCH(B56,'[1]Pt1-AvionicsComponentCosts'!$A:$A,0),2)","v":"Large Commercial Aircraft"},"Airbus",1,"A350","Airbus A350-900neo","A350-900neo","A350-900neo",{"$f":"MATCH(\"*\"&F56&\"*\",Sheet1!C:C,0)","v":17},{"$f":"MATCH(\"*\"&H56&\"*\",Sheet1!C:C,0)","v":{"$error":"#N/A"}},{"$f":"MATCH(\"*\"&I56&\"*\",Sheet1!B:B,0)","v":{"$error":"#N/A"}},308.10000000000002,null,"http://www.axonaviation.com/commercial-aircraft/aircraft-data/aircraft-pricing",{"$f":"INDEX('[2]Pt1-AvionicsComponentCosts'!$A:$NE,MATCH(B56,'[2]Pt1-AvionicsComponentCosts'!$A:$A,0),MATCH(\"END MARKER\",'[2]Pt1-AvionicsComponentCosts'!$11:$11,0))","v":2635778.5151999998},{"$f":"50%","v":0.5},{"$f":"50%","v":0.5},4.2774724362220053E-2]
[null,305,{"$f":"INDEX('[1]Pt1-AvionicsComponentCosts'!$A:$B,MATCH(B57,'[1]Pt1-AvionicsComponentCosts'!$A:$A,0),2)","v":"Large Commercial Aircraft"},"Airbus",1,"Airbus A300","Airbus A300","A300","A300",{"$f":"MATCH(\"*\"&F57&\"*\",Sheet1!C:C,0)","v":{"$error":"#N/A"}},{"$f":"MATCH(\"*\"&H57&\"*\",Sheet1!C:C,0)","v":{"$error":"#N/A"}},{"$f":"MATCH(\"*\"&I57&\"*\",Sheet1!B:B,0)","v":{"$error":"#N/A"}},"x","OOP",null,{"$f":"INDEX('[2]Pt1-AvionicsComponentCosts'!$A:$NE,MATCH(B57,'[2]Pt1-AvionicsComponentCosts'!$A:$A,0),MATCH(\"END MARKER\",'[2]Pt1-AvionicsComponentCosts'!$11:$11,0))","v":1936102.3312000006},{"$f":"50%","v":0.5},{"$f":"50%","v":0.5},""]
[null,216,{"$f":"INDEX('[1]Pt1-AvionicsComponentCosts'!$A:$B,MATCH(B58,'[1]Pt1-AvionicsComponentCosts'!$A:$A,0),2)","v":"Large Commercial Aircraft"},"Airbus",1,"A380","Airbus A380","A380","A380",{"$f":"MATCH(\"*\"&F58&\"*\",Sheet1!C:C,0)","v":19},{"$f":"MATCH(\"*\"&H58&\"*\",Sheet1!C:C,0)","v":19},{"$f":"MATCH(\"*\"&I58&\"*\",Sheet1!B:B,0)","v":19},{"$f":"INDEX(Sheet1!$A:$K,MATCH($I58,Sheet1!$B:$B,0),MATCH(M$1,Sheet1!$A$1:$K$1,0))","v":350},null,{"$f":"INDEX(Sheet1!$A:$K,MATCH($I58,Sheet1!$B:$B,0),MATCH(O$1,Sheet1!$A$1:$K$1,0))","v":"http://www.axonaviation.com/commercial-aircraft/aircraft-data/aircraft-pricing"},{"$f":"INDEX('[2]Pt1-AvionicsComponentCosts'!$A:$NE,MATCH(B58,'[2]Pt1-AvionicsComponentCosts'!$A:$A,0),MATCH(\"END MARKER\",'[2]Pt1-AvionicsComponentCosts'!$11:$11,0))","v":2888053.2909440505},{"$f":"50%","v":0.5},{"$f":"50%","v":0.5},4.1257904156343582E-2]
[null,551,{"$f":"INDEX('[1]Pt1-AvionicsComponentCosts'!$A:$B,MATCH(B59,'[1]Pt1-AvionicsComponentCosts'!$A:$A,0),2)","v":"Military Transport / Special Mission"},"Airbus",1,"A330 MRTT","Airbus A330 MRTT","A330 MRTT","A330 MRTT",{"$f":"MATCH(\"*\"&F59&\"*\",Sheet1!C:C,0)","v":{"$error":"#N/A"}},{"$f":"MATCH(\"*\"&H59&\"*\",Sheet1!C:C,0)","v":{"$error":"#N/A"}},{"$f":"MATCH(\"*\"&I59&\"*\",Sheet1!B:B,0)","v":{"$error":"#N/A"}},340,null,"https://simpleflying.com/how-much-do-military-transport-aircraft-cost/",{"$f":"INDEX('[2]Pt1-AvionicsComponentCosts'!$A:$NE,MATCH(B59,'[2]Pt1-AvionicsComponentCosts'!$A:$A,0),MATCH(\"END MARKER\",'[2]Pt1-AvionicsComponentCosts'!$11:$11,0))","v":3430118.1727780015},1,1,0.10088582861111769]
[null,150,{"$f":"INDEX('[1]Pt1-AvionicsComponentCosts'!$A:$B,MATCH(B60,'[1]Pt1-AvionicsComponentCosts'!$A:$A,0),2)","v":"Military Transport / Special Mission"},"Airbus",1,"A400M Atlas","Airbus A400M Atlas","A400M Atlas","A400M Atlas",{"$f":"MATCH(\"*\"&F60&\"*\",Sheet1!C:C,0)","v":{"$error":"#N/A"}},{"$f":"MATCH(\"*\"&H60&\"*\",Sheet1!C:C,0)","v":{"$error":"#N/A"}},{"$f":"MATCH(\"*\"&I60&\"*\",Sheet1!B:B,0)","v":{"$error":"#N/A"}},190,null,"https://weaponsystems.net/system/673-Airbus+A400M+Atlas",{"$f":"INDEX('[2]Pt1-AvionicsComponentCosts'!$A:$NE,MATCH(B60,'[2]Pt1-AvionicsComponentCosts'!$A:$A,0),MATCH(\"END MARKER\",'[2]Pt1-AvionicsComponentCosts'!$11:$11,0))","v":3582115.8315951349},1,1,0.18853241218921762]
[null,155,{"$f":"INDEX('[1]Pt1-AvionicsComponentCosts'!$A:$B,MATCH(B61,'[1]Pt1-AvionicsComponentCosts'!$A:$A,0),2)","v":"Military Transport / Special Mission"},"Alenia",1,"Alenia C-27J","Alenia C-27J","C-27J","C-27J",{"$f":"MATCH(\"*\"&F61&\"*\",Sheet1!C:C,0)","v":{"$error":"#N/A"}},{"$f":"MATCH(\"*\"&H61&\"*\",Sheet1!C:C,0)","v":{"$error":"#N/A"}},{"$f":"MATCH(\"*\"&I61&\"*\",Sheet1!B:B,0)","v":{"$error":"#N/A"}},40,null,"https://simpleflying.com/how-much-do-military-transport-aircraft-cost/",{"$f":"INDEX('[2]Pt1-AvionicsComponentCosts'!$A:$NE,MATCH(B61,'[2]Pt1-AvionicsComponentCosts'!$A:$A,0),MATCH(\"END MARKER\",'[2]Pt1-AvionicsComponentCosts'!$11:$11,0))","v":3357528.8091951348},1,1,0.83938220229878369]
[null,668,{"$f":"INDEX('[1]Pt1-AvionicsComponentCosts'!$A:$B,MATCH(B62,'[1]Pt1-AvionicsComponentCosts'!$A:$A,0),2)","v":"Freighter"},"ATR",1,"ATR 42/72","ATR 72-600F","72-600F","72-600F",{"$f":"MATCH(\"*\"&F62&\"*\",Sheet1!C:C,0)","v":{"$error":"#N/A"}},{"$f":"MATCH(\"*\"&H62&\"*\",Sheet1!C:C,0)","v":{"$error":"#N/A"}},{"$f":"MATCH(\"*\"&I62&\"*\",Sheet1!B:B,0)","v":{"$error":"#N/A"}},26,null,"https://www.paramountbusinessjets.com/private-jet-charter/aircraft/atr-72-600",{"$f":"INDEX('[2]Pt1-AvionicsComponentCosts'!$A:$NE,MATCH(B62,'[2]Pt1-AvionicsComponentCosts'!$A:$A,0),MATCH(\"END MARKER\",'[2]Pt1-AvionicsComponentCosts'!$11:$11,0))","v":734855.51359999995},0.5,0.5,0.141318368]
[null,667,{"$f":"INDEX('[1]Pt1-AvionicsComponentCosts'!$A:$B,MATCH(B63,'[1]Pt1-AvionicsComponentCosts'!$A:$A,0),2)","v":"Freighter"},"ATR",1,"ATR 42/72","ATR 72/42 Freighter Conversion","72/42 Freighter Conversion","72/42 Freighter Conversion",{"$f":"MATCH(\"*\"&F63&\"*\",Sheet1!C:C,0)","v":{"$error":"#N/A"}},{"$f":"MATCH(\"*\"&H63&\"*\",Sheet1!C:C,0)","v":{"$error":"#N/A"}},{"$f":"MATCH(\"*\"&I63&\"*\",Sheet1!B:B,0)","v":{"$error":"#N/A"}},"x",null,null,{"$f":"INDEX('[2]Pt1-AvionicsComponentCosts'!$A:$NE,MATCH(B63,'[2]Pt1-AvionicsComponentCosts'!$A:$A,0),MATCH(\"END MARKER\",'[2]Pt1-AvionicsComponentCosts'!$11:$11,0))","v":734855.51359999995},0.5,0.5,""]
[null,191,{"$f":"INDEX('[1]Pt1-AvionicsComponentCosts'!$A:$B,MATCH(B64,'[1]Pt1-AvionicsComponentCosts'!$A:$A,0),2)","v":"Regional"},"ATR",1,"ATR 42/72","ATR 42","42","42",{"$f":"MATCH(\"*\"&F64&\"*\",Sheet1!C:C,0)","v":{"$error":"#N/A"}},{"$f":"MATCH(\"*\"&H64&\"*\",Sheet1!C:C,0)","v":{"$error":"#N/A"}},{"$f":"MATCH(\"*\"&I64&\"*\",Sheet1!B:B,0)","v":{"$error":"#N/A"}},"x",null,null,{"$f":"INDEX('[2]Pt1-AvionicsComponentCosts'!$A:$NE,MATCH(B64,'[2]Pt1-AvionicsComponentCosts'!$A:$A,0),MATCH(\"END MARKER\",'[2]Pt1-AvionicsComponentCosts'!$11:$11,0))","v":1116294.0447999998},0.65,0.65,""]
[null,26,{"$f":"INDEX('[1]Pt1-AvionicsComponentCosts'!$A:$B,MATCH(B65,'[1]Pt1-AvionicsComponentCosts'!$A:$A,0),2)","v":"Regional"},"ATR",1,"ATR 42/72","ATR 72","72","72",{"$f":"MATCH(\"*\"&F65&\"*\",Sheet1!C:C,0)","v":{"$error":"#N/A"}},{"$f":"MATCH(\"*\"&H65&\"*\",Sheet1!C:C,0)","v":{"$error":"#N/A"}},{"$f":"MATCH(\"*\"&I65&\"*\",Sheet1!B:B,0)","v":{"$error":"#N/A"}},"x",null,null,{"$f":"INDEX('[2]Pt1-AvionicsComponentCosts'!$A:$NE,MATCH(B65,'[2]Pt1-AvionicsComponentCosts'!$A:$A,0),MATCH(\"END MARKER\",'[2]Pt1-AvionicsComponentCosts'!$11:$11,0))","v":1116294.0447999998},0.65,0.65,""]
[null,647,{"$f":"INDEX('[1]Pt1-AvionicsComponentCosts'!$A:$B,MATCH(B66,'[1]Pt1-AvionicsComponentCosts'!$A:$A,0),2)","v":"Regional"},"ATR",1,"ATR 42/72X","ATR 42/72X","42/72X","42/72X",{"$f":"MATCH(\"*\"&F66&\"*\",Sheet1!C:C,0)","v":{"$error":"#N/A"}},{"$f":"MATCH(\"*\"&H66&\"*\",Sheet1!C:C,0)","v":{"$error":"#N/A"}},{"$f":"MATCH(\"*\"&I66&\"*\",Sheet1!B:B,0)","v":{"$error":"#N/A"}},"x",null,null,{"$f":"INDEX('[2]Pt1-AvionicsComponentCosts'!$A:$NE,MATCH(B66,'[2]Pt1-AvionicsComponentCosts'!$A:$A,0),MATCH(\"END MARKER\",'[2]Pt1-AvionicsComponentCosts'!$11:$11,0))","v":1116294.0447999998},0.65,0.65,""]
[null,616,{"$f":"INDEX('[1]Pt1-AvionicsComponentCosts'!$A:$B,MATCH(B67,'[1]Pt1-AvionicsComponentCosts'!$A:$A,0),2)","v":"Regional"},"AVIC",1,"AVIC MA700","AVIC MA700",{"$f":"TRIM(SUBSTITUTE(G67,D67,\"\"))","v":"MA700"},{"$f":"TRIM(SUBSTITUTE(SUBSTITUTE(SUBSTITUTE(SUBSTITUTE(SUBSTITUTE(H67,\"Family\",\"\"),\"737 Classic:\",\"\"),\"737 MAX:\",\"\"),\"787 Dreamliner:\",\"\"),\"777:\",\"\"))","v":"MA700"},{"$f":"MATCH(\"*\"&F67&\"*\",Sheet1!C:C,0)","v":{"$error":"#N/A"}},{"$f":"MATCH(\"*\"&H67&\"*\",Sheet1!C:C,0)","v":{"$error":"#N/A"}},{"$f":"MATCH(\"*\"&I67&\"*\",Sheet1!B:B,0)","v":{"$error":"#N/A"}},25,null,"https://aerocorner.com/aircraft/xian-ma700/",{"$f":"INDEX('[2]Pt1-AvionicsComponentCosts'!$A:$NE,MATCH(B67,'[2]Pt1-AvionicsComponentCosts'!$A:$A,0),MATCH(\"END MARKER\",'[2]Pt1-AvionicsComponentCosts'!$11:$11,0))","v":1040302.4448000001},0.65,0.65,{"$f":"IFERROR(P67/(M67*100000)*R67,\"\")","v":0.27047863564800001}]
[null,548,{"$f":"INDEX('[1]Pt1-AvionicsComponentCosts'!$A:$B,MATCH(B68,'[1]Pt1-AvionicsComponentCosts'!$A:$A,0),2)","v":"Turbine GA"},"Ayres",1,"Ayres Thrush 510","Ayres Thrush 510","Thrush 510","Thrush 510",{"$f":"MATCH(\"*\"&F68&\"*\",Sheet1!C:C,0)","v":{"$error":"#N/A"}},{"$f":"MATCH(\"*\"&H68&\"*\",Sheet1!C:C,0)","v":{"$error":"#N/A"}},{"$f":"MATCH(\"*\"&I68&\"*\",Sheet1!B:B,0)","v":{"$error":"#N/A"}},null,0.86899999999999999,"https://www.flyingmag.com/aircraft-turboprops-thrush-510g/",{"$f":"INDEX('[2]Pt1-AvionicsComponentCosts'!$A:$NE,MATCH(B68,'[2]Pt1-AvionicsComponentCosts'!$A:$A,0),MATCH(\"END MARKER\",'[2]Pt1-AvionicsComponentCosts'!$11:$11,0))","v":220626.48800000001},1,1,{"$f":"IFERROR(P68/(M68*100000)*R68,\"\")","v":""}]
[null,549,{"$f":"INDEX('[1]Pt1-AvionicsComponentCosts'!$A:$B,MATCH(B69,'[1]Pt1-AvionicsComponentCosts'!$A:$A,0),2)","v":"Turbine GA"},"Ayres",1,"Ayres Thrush SR2","Ayres Thrush SR2","Thrush SR2","Thrush SR2",{"$f":"MATCH(\"*\"&F69&\"*\",Sheet1!C:C,0)","v":{"$error":"#N/A"}},{"$f":"MATCH(\"*\"&H69&\"*\",Sheet1!C:C,0)","v":{"$error":"#N/A"}},{"$f":"MATCH(\"*\"&I69&\"*\",Sheet1!B:B,0)","v":{"$error":"#N/A"}},null,0.8,"https://janes.migavia.com/usa/thrush/thrush-turbo-thrush-s2r.html",{"$f":"INDEX('[2]Pt1-AvionicsComponentCosts'!$A:$NE,MATCH(B69,'[2]Pt1-AvionicsComponentCosts'!$A:$A,0),MATCH(\"END MARKER\",'[2]Pt1-AvionicsComponentCosts'!$11:$11,0))","v":220626.48800000001},1,1,{"$f":"IFERROR(P69/(M69*100000)*R69,\"\")","v":""}]
[null,167,{"$f":"INDEX('[1]Pt1-AvionicsComponentCosts'!$A:$B,MATCH(B70,'[1]Pt1-AvionicsComponentCosts'!$A:$A,0),2)","v":"Fighters and Jet Trainers"},"BAE",1,"Hawk","BAE Systems Hawk","Systems Hawk","Systems Hawk",{"$f":"MATCH(\"*\"&F70&\"*\",Sheet1!C:C,0)","v":{"$error":"#N/A"}},{"$f":"MATCH(\"*\"&H70&\"*\",Sheet1!C:C,0)","v":{"$error":"#N/A"}},{"$f":"MATCH(\"*\"&I70&\"*\",Sheet1!B:B,0)","v":{"$error":"#N/A"}},"x",null,null,{"$f":"INDEX('[2]Pt1-AvionicsComponentCosts'!$A:$NE,MATCH(B70,'[2]Pt1-AvionicsComponentCosts'!$A:$A,0),MATCH(\"END MARKER\",'[2]Pt1-AvionicsComponentCosts'!$11:$11,0))","v":1295662.9234796404},1,1,""]
[null,643,{"$f":"INDEX('[1]Pt1-AvionicsComponentCosts'!$A:$B,MATCH(B71,'[1]Pt1-AvionicsComponentCosts'!$A:$A,0),2)","v":"Fighters and Jet Trainers"},"BAES/Leonardo",1,"BAES/Leonardo Tempest","BAES/Leonardo Tempest","Tempest","Tempest",{"$f":"MATCH(\"*\"&F71&\"*\",Sheet1!C:C,0)","v":{"$error":"#N/A"}},{"$f":"MATCH(\"*\"&H71&\"*\",Sheet1!C:C,0)","v":{"$error":"#N/A"}},{"$f":"MATCH(\"*\"&I71&\"*\",Sheet1!B:B,0)","v":{"$error":"#N/A"}},"x",null,null,{"$f":"INDEX('[2]Pt1-AvionicsComponentCosts'!$A:$NE,MATCH(B71,'[2]Pt1-AvionicsComponentCosts'!$A:$A,0),MATCH(\"END MARKER\",'[2]Pt1-AvionicsComponentCosts'!$11:$11,0))","v":3075967.3078523539},1,1,""]
[null,901,{"$f":"INDEX('[1]Pt1-AvionicsComponentCosts'!$A:$B,MATCH(B72,'[1]Pt1-AvionicsComponentCosts'!$A:$A,0),2)","v":"UAV"},"Bayraktar",1,"Bayraktar TB-2","Bayraktar TB-2","TB-2","TB-2",{"$f":"MATCH(\"*\"&F72&\"*\",Sheet1!C:C,0)","v":{"$error":"#N/A"}},{"$f":"MATCH(\"*\"&H72&\"*\",Sheet1!C:C,0)","v":{"$error":"#N/A"}},{"$f":"MATCH(\"*\"&I72&\"*\",Sheet1!B:B,0)","v":{"$error":"#N/A"}},2,null,"https://www.defensenews.com/unmanned/2023/06/14/kuwait-to-buy-turkish-made-tb2-drones-in-367-million-deal/",{"$f":"INDEX('[2]Pt1-AvionicsComponentCosts'!$A:$NE,MATCH(B72,'[2]Pt1-AvionicsComponentCosts'!$A:$A,0),MATCH(\"END MARKER\",'[2]Pt1-AvionicsComponentCosts'!$11:$11,0))","v":914017},1,1,4.5700849999999997]
[null,80,{"$f":"INDEX('[1]Pt1-AvionicsComponentCosts'!$A:$B,MATCH(B73,'[1]Pt1-AvionicsComponentCosts'!$A:$A,0),2)","v":"Turbine GA"},"Beechcraft",1,"Beechcraft King Air","Beechcraft King Air","King Air","King Air",{"$f":"MATCH(\"*\"&F73&\"*\",Sheet1!C:C,0)","v":{"$error":"#N/A"}},{"$f":"MATCH(\"*\"&H73&\"*\",Sheet1!C:C,0)","v":{"$error":"#N/A"}},{"$f":"MATCH(\"*\"&I73&\"*\",Sheet1!B:B,0)","v":{"$error":"#N/A"}},8,"350i","https://www.sherpareport.com/aircraft/costs-king-air-350.html",{"$f":"INDEX('[2]Pt1-AvionicsComponentCosts'!$A:$NE,MATCH(B73,'[2]Pt1-AvionicsComponentCosts'!$A:$A,0),MATCH(\"END MARKER\",'[2]Pt1-AvionicsComponentCosts'!$11:$11,0))","v":227116.56319999998},1,1,0.28389570399999997]
[null,31,{"$f":"INDEX('[1]Pt1-AvionicsComponentCosts'!$A:$B,MATCH(B74,'[1]Pt1-AvionicsComponentCosts'!$A:$A,0),2)","v":"Turbine GA"},"Beechcraft",1,"Other light aircraft","Beechcraft Premier I","Premier I","Premier I",{"$f":"MATCH(\"*\"&F74&\"*\",Sheet1!C:C,0)","v":{"$error":"#N/A"}},{"$f":"MATCH(\"*\"&H74&\"*\",Sheet1!C:C,0)","v":{"$error":"#N/A"}},{"$f":"MATCH(\"*\"&I74&\"*\",Sheet1!B:B,0)","v":{"$error":"#N/A"}},null,"used","https://www.libertyjet.com/private_jets_for_sale/Beechcraft%20Corp./Premier%20I",{"$f":"INDEX('[2]Pt1-AvionicsComponentCosts'!$A:$NE,MATCH(B74,'[2]Pt1-AvionicsComponentCosts'!$A:$A,0),MATCH(\"END MARKER\",'[2]Pt1-AvionicsComponentCosts'!$11:$11,0))","v":239259.03200000001},1,1,""]
[null,169,{"$f":"INDEX('[1]Pt1-AvionicsComponentCosts'!$A:$B,MATCH(B75,'[1]Pt1-AvionicsComponentCosts'!$A:$A,0),2)","v":"Turboprop Trainers / Light Attack"},"Beechcraft",1,"Beechcraft T-6 Texan II","Beechcraft T-6 Texan II","T-6 Texan II","T-6 Texan II",{"$f":"MATCH(\"*\"&F75&\"*\",Sheet1!C:C,0)","v":{"$error":"#N/A"}},{"$f":"MATCH(\"*\"&H75&\"*\",Sheet1!C:C,0)","v":{"$error":"#N/A"}},{"$f":"MATCH(\"*\"&I75&\"*\",Sheet1!B:B,0)","v":{"$error":"#N/A"}},4.2720000000000002,null,"https://www.af.mil/About-Us/Fact-Sheets/Display/Article/104548/t-6a-texan-ii/",{"$f":"INDEX('[2]Pt1-AvionicsComponentCosts'!$A:$NE,MATCH(B75,'[2]Pt1-AvionicsComponentCosts'!$A:$A,0),MATCH(\"END MARKER\",'[2]Pt1-AvionicsComponentCosts'!$11:$11,0))","v":503373.16826864093},1,1,1.178307978156931]
[null,92,{"$f":"INDEX('[1]Pt1-AvionicsComponentCosts'!$A:$B,MATCH(B76,'[1]Pt1-AvionicsComponentCosts'!$A:$A,0),2)","v":"Helicopter"},"Bell",1,"AH-1","Bell AH-1Z Viper","AH-1Z Viper","AH-1Z Viper",{"$f":"MATCH(\"*\"&F76&\"*\",Sheet1!C:C,0)","v":{"$error":"#N/A"}},{"$f":"MATCH(\"*\"&H76&\"*\",Sheet1!C:C,0)","v":{"$error":"#N/A"}},{"$f":"MATCH(\"*\"&I76&\"*\",Sheet1!B:B,0)","v":{"$error":"#N/A"}},31,null,"https://warriorlodge.com/pages/bell-ah-1z-viper",{"$f":"INDEX('[2]Pt1-AvionicsComponentCosts'!$A:$NE,MATCH(B76,'[2]Pt1-AvionicsComponentCosts'!$A:$A,0),MATCH(\"END MARKER\",'[2]Pt1-AvionicsComponentCosts'!$11:$11,0))","v":1494251.8064753041},0.99,0.99,0.47719654464856487]
[null,132,{"$f":"INDEX('[1]Pt1-AvionicsComponentCosts'!$A:$B,MATCH(B77,'[1]Pt1-AvionicsComponentCosts'!$A:$A,0),2)","v":"Helicopter"},"Bell",1,"Future Attack Reconnaissance Aircraft","Bell V-280 Valor ","V-280 Valor","V-280 Valor",{"$f":"MATCH(\"*\"&F77&\"*\",Sheet1!C:C,0)","v":{"$error":"#N/A"}},{"$f":"MATCH(\"*\"&H77&\"*\",Sheet1!C:C,0)","v":{"$error":"#N/A"}},{"$f":"MATCH(\"*\"&I77&\"*\",Sheet1!B:B,0)","v":{"$error":"#N/A"}},43,null,"https://simpleflying.com/bell-v280-valor-complete-guide/",{"$f":"INDEX('[2]Pt1-AvionicsComponentCosts'!$A:$NE,MATCH(B77,'[2]Pt1-AvionicsComponentCosts'!$A:$A,0),MATCH(\"END MARKER\",'[2]Pt1-AvionicsComponentCosts'!$11:$11,0))","v":1534523.1536753043},0.99,0.99,0.35329719119501191]
[null,646,{"$f":"INDEX('[1]Pt1-AvionicsComponentCosts'!$A:$B,MATCH(B78,'[1]Pt1-AvionicsComponentCosts'!$A:$A,0),2)","v":"Helicopter"},"Bell",1,"412X","Bell 412X","412X","412X",{"$f":"MATCH(\"*\"&F78&\"*\",Sheet1!C:C,0)","v":{"$error":"#N/A"}},{"$f":"MATCH(\"*\"&H78&\"*\",Sheet1!C:C,0)","v":{"$error":"#N/A"}},{"$f":"MATCH(\"*\"&I78&\"*\",Sheet1!B:B,0)","v":{"$error":"#N/A"}},"x",null,null,{"$f":"INDEX('[2]Pt1-AvionicsComponentCosts'!$A:$NE,MATCH(B78,'[2]Pt1-AvionicsComponentCosts'!$A:$A,0),MATCH(\"END MARKER\",'[2]Pt1-AvionicsComponentCosts'!$11:$11,0))","v":466010.65120000002},0.99,0.99,""]
[null,90,{"$f":"INDEX('[1]Pt1-AvionicsComponentCosts'!$A:$B,MATCH(B79,'[1]Pt1-AvionicsComponentCosts'!$A:$A,0),2)","v":"Helicopter"},"Bell",1,"Bell 407","Bell 407","407","407",{"$f":"MATCH(\"*\"&F79&\"*\",Sheet1!C:C,0)","v":{"$error":"#N/A"}},{"$f":"MATCH(\"*\"&H79&\"*\",Sheet1!C:C,0)","v":{"$error":"#N/A"}},{"$f":"MATCH(\"*\"&I79&\"*\",Sheet1!B:B,0)","v":{"$error":"#N/A"}},3.75,null,"https://www.businessairnews.com/hb_aircraftpage.html?recnum=B407",{"$f":"INDEX('[2]Pt1-AvionicsComponentCosts'!$A:$NE,MATCH(B79,'[2]Pt1-AvionicsComponentCosts'!$A:$A,0),MATCH(\"END MARKER\",'[2]Pt1-AvionicsComponentCosts'!$11:$11,0))","v":281981.49920000002},0.99,0.99,0.74443115788800007]
[null,91,{"$f":"INDEX('[1]Pt1-AvionicsComponentCosts'!$A:$B,MATCH(B80,'[1]Pt1-AvionicsComponentCosts'!$A:$A,0),2)","v":"Helicopter"},"Bell",1,"Bell 429 GlobalRanger","Bell 429 GlobalRanger","429 GlobalRanger","429 GlobalRanger",{"$f":"MATCH(\"*\"&F80&\"*\",Sheet1!C:C,0)","v":{"$error":"#N/A"}},{"$f":"MATCH(\"*\"&H80&\"*\",Sheet1!C:C,0)","v":{"$error":"#N/A"}},{"$f":"MATCH(\"*\"&I80&\"*\",Sheet1!B:B,0)","v":{"$error":"#N/A"}},7.5,null,"https://www.fairlifts.com/helicopters/guide-to-2023-helicopter-prices/",{"$f":"INDEX('[2]Pt1-AvionicsComponentCosts'!$A:$NE,MATCH(B80,'[2]Pt1-AvionicsComponentCosts'!$A:$A,0),MATCH(\"END MARKER\",'[2]Pt1-AvionicsComponentCosts'!$11:$11,0))","v":466010.65120000002},0.99,0.99,0.61513405958400003]
[null,89,{"$f":"INDEX('[1]Pt1-AvionicsComponentCosts'!$A:$B,MATCH(B81,'[1]Pt1-AvionicsComponentCosts'!$A:$A,0),2)","v":"Helicopter"},"Bell",1,"Bell 505 Jet Ranger X","Bell 505 Jet Ranger X","505 Jet Ranger X","505 Jet Ranger X",{"$f":"MATCH(\"*\"&F81&\"*\",Sheet1!C:C,0)","v":{"$error":"#N/A"}},{"$f":"MATCH(\"*\"&H81&\"*\",Sheet1!C:C,0)","v":{"$error":"#N/A"}},{"$f":"MATCH(\"*\"&I81&\"*\",Sheet1!B:B,0)","v":{"$error":"#N/A"}},1.3,null,"https://www.fairlifts.com/helicopters/guide-to-2023-helicopter-prices/",{"$f":"INDEX('[2]Pt1-AvionicsComponentCosts'!$A:$NE,MATCH(B81,'[2]Pt1-AvionicsComponentCosts'!$A:$A,0),MATCH(\"END MARKER\",'[2]Pt1-AvionicsComponentCosts'!$11:$11,0))","v":497690.6912},0.99,0.99,3.7901060329846157]
[null,93,{"$f":"INDEX('[1]Pt1-AvionicsComponentCosts'!$A:$B,MATCH(B82,'[1]Pt1-AvionicsComponentCosts'!$A:$A,0),2)","v":"Helicopter"},"Bell",1,"Bell 525 Relentless","Bell 525 Relentless","525 Relentless","525 Relentless",{"$f":"MATCH(\"*\"&F82&\"*\",Sheet1!C:C,0)","v":{"$error":"#N/A"}},{"$f":"MATCH(\"*\"&H82&\"*\",Sheet1!C:C,0)","v":{"$error":"#N/A"}},{"$f":"MATCH(\"*\"&I82&\"*\",Sheet1!B:B,0)","v":{"$error":"#N/A"}},17,null,"https://www.businessairnews.com/hb_aircraftpage.html?recnum=B525",{"$f":"INDEX('[2]Pt1-AvionicsComponentCosts'!$A:$NE,MATCH(B82,'[2]Pt1-AvionicsComponentCosts'!$A:$A,0),MATCH(\"END MARKER\",'[2]Pt1-AvionicsComponentCosts'!$11:$11,0))","v":497690.6912},0.99,0.99,0.28983163781647059]
[null,182,{"$f":"INDEX('[1]Pt1-AvionicsComponentCosts'!$A:$B,MATCH(B83,'[1]Pt1-AvionicsComponentCosts'!$A:$A,0),2)","v":"Helicopter"},"Bell",1,"OH-58","Bell OH-58D Kiowa","OH-58D Kiowa","OH-58D Kiowa",{"$f":"MATCH(\"*\"&F83&\"*\",Sheet1!C:C,0)","v":{"$error":"#N/A"}},{"$f":"MATCH(\"*\"&H83&\"*\",Sheet1!C:C,0)","v":{"$error":"#N/A"}},{"$f":"MATCH(\"*\"&I83&\"*\",Sheet1!B:B,0)","v":{"$error":"#N/A"}},null,null,null,{"$f":"INDEX('[2]Pt1-AvionicsComponentCosts'!$A:$NE,MATCH(B83,'[2]Pt1-AvionicsComponentCosts'!$A:$A,0),MATCH(\"END MARKER\",'[2]Pt1-AvionicsComponentCosts'!$11:$11,0))","v":1466701.0048753042},0.99,0.99,""]
[null,94,{"$f":"INDEX('[1]Pt1-AvionicsComponentCosts'!$A:$B,MATCH(B84,'[1]Pt1-AvionicsComponentCosts'!$A:$A,0),2)","v":"Helicopter"},"Bell",1,"UH-1","Bell UH-1 Iroquois/412","UH-1 Iroquois/412","UH-1 Iroquois/412",{"$f":"MATCH(\"*\"&F84&\"*\",Sheet1!C:C,0)","v":{"$error":"#N/A"}},{"$f":"MATCH(\"*\"&H84&\"*\",Sheet1!C:C,0)","v":{"$error":"#N/A"}},{"$f":"MATCH(\"*\"&I84&\"*\",Sheet1!B:B,0)","v":{"$error":"#N/A"}},null,null,null,{"$f":"INDEX('[2]Pt1-AvionicsComponentCosts'!$A:$NE,MATCH(B84,'[2]Pt1-AvionicsComponentCosts'!$A:$A,0),MATCH(\"END MARKER\",'[2]Pt1-AvionicsComponentCosts'!$11:$11,0))","v":518990.75520000001},0.99,0.99,""]
[null,95,{"$f":"INDEX('[1]Pt1-AvionicsComponentCosts'!$A:$B,MATCH(B85,'[1]Pt1-AvionicsComponentCosts'!$A:$A,0),2)","v":"Helicopter"},"Bell",1,"UH-1","Bell UH-1Y Venom","UH-1Y Venom","UH-1Y Venom",{"$f":"MATCH(\"*\"&F85&\"*\",Sheet1!C:C,0)","v":{"$error":"#N/A"}},{"$f":"MATCH(\"*\"&H85&\"*\",Sheet1!C:C,0)","v":{"$error":"#N/A"}},{"$f":"MATCH(\"*\"&I85&\"*\",Sheet1!B:B,0)","v":{"$error":"#N/A"}},null,null,null,{"$f":"INDEX('[2]Pt1-AvionicsComponentCosts'!$A:$NE,MATCH(B85,'[2]Pt1-AvionicsComponentCosts'!$A:$A,0),MATCH(\"END MARKER\",'[2]Pt1-AvionicsComponentCosts'!$11:$11,0))","v":1488001.0688753042},0.99,0.99,""]
[null,97,{"$f":"INDEX('[1]Pt1-AvionicsComponentCosts'!$A:$B,MATCH(B86,'[1]Pt1-AvionicsComponentCosts'!$A:$A,0),2)","v":"Helicopter"},"Bell Boeing",1,"V-22","Bell Boeing V-22 Osprey","V-22 Osprey","V-22 Osprey",{"$f":"MATCH(\"*\"&F86&\"*\",Sheet1!C:C,0)","v":{"$error":"#N/A"}},{"$f":"MATCH(\"*\"&H86&\"*\",Sheet1!C:C,0)","v":{"$error":"#N/A"}},{"$f":"MATCH(\"*\"&I86&\"*\",Sheet1!B:B,0)","v":{"$error":"#N/A"}},null,null,null,{"$f":"INDEX('[2]Pt1-AvionicsComponentCosts'!$A:$NE,MATCH(B86,'[2]Pt1-AvionicsComponentCosts'!$A:$A,0),MATCH(\"END MARKER\",'[2]Pt1-AvionicsComponentCosts'!$11:$11,0))","v":1534523.1536753043},0.99,0.99,""]
[null,529,{"$f":"INDEX('[1]Pt1-AvionicsComponentCosts'!$A:$B,MATCH(B87,'[1]Pt1-AvionicsComponentCosts'!$A:$A,0),2)","v":"Business Jet"},"Boeing",1,"BBJ","Boeing BBJ MAX","BBJ MAX","BBJ MAX",{"$f":"MATCH(\"*\"&F87&\"*\",Sheet1!C:C,0)","v":{"$error":"#N/A"}},{"$f":"MATCH(\"*\"&H87&\"*\",Sheet1!C:C,0)","v":{"$error":"#N/A"}},{"$f":"MATCH(\"*\"&I87&\"*\",Sheet1!B:B,0)","v":{"$error":"#N/A"}},{"$f":"AVERAGE(101.5,110.5,118.5)","v":110.16666666666667},null,null,{"$f":"INDEX('[2]Pt1-AvionicsComponentCosts'!$A:$NE,MATCH(B87,'[2]Pt1-AvionicsComponentCosts'!$A:$A,0),MATCH(\"END MARKER\",'[2]Pt1-AvionicsComponentCosts'!$11:$11,0))","v":1384049},0.75,0.75,9.4224213313161859E-2]
[null,297,{"$f":"INDEX('[1]Pt1-AvionicsComponentCosts'!$A:$B,MATCH(B88,'[1]Pt1-AvionicsComponentCosts'!$A:$A,0),2)","v":"Business Jet"},"Boeing",1,"BBJ","Boeing BBJ/BBJ2/BBJ3","BBJ/BBJ2/BBJ3","BBJ/BBJ2/BBJ3",{"$f":"MATCH(\"*\"&F88&\"*\",Sheet1!C:C,0)","v":{"$error":"#N/A"}},{"$f":"MATCH(\"*\"&H88&\"*\",Sheet1!C:C,0)","v":{"$error":"#N/A"}},{"$f":"MATCH(\"*\"&I88&\"*\",Sheet1!B:B,0)","v":{"$error":"#N/A"}},71,null,"https://www.bjtonline.com/business-jet-news/boeings-bbj-3",{"$f":"INDEX('[2]Pt1-AvionicsComponentCosts'!$A:$NE,MATCH(B88,'[2]Pt1-AvionicsComponentCosts'!$A:$A,0),MATCH(\"END MARKER\",'[2]Pt1-AvionicsComponentCosts'!$11:$11,0))","v":1384049},0.75,0.75,0.14620235915492957]
[null,594,{"$f":"INDEX('[1]Pt1-AvionicsComponentCosts'!$A:$B,MATCH(B89,'[1]Pt1-AvionicsComponentCosts'!$A:$A,0),2)","v":"Business Jet"},"Boeing",1,"Boeing 747","Boeing 747-8 VIP","747-8 VIP","747-8 VIP",{"$f":"MATCH(\"*\"&F89&\"*\",Sheet1!C:C,0)","v":{"$error":"#N/A"}},{"$f":"MATCH(\"*\"&H89&\"*\",Sheet1!C:C,0)","v":{"$error":"#N/A"}},{"$f":"MATCH(\"*\"&I89&\"*\",Sheet1!B:B,0)","v":{"$error":"#N/A"}},418.4,null,"https://finance.yahoo.com/news/5-priciest-private-jets-2023-185110930.html",{"$f":"INDEX('[2]Pt1-AvionicsComponentCosts'!$A:$NE,MATCH(B89,'[2]Pt1-AvionicsComponentCosts'!$A:$A,0),MATCH(\"END MARKER\",'[2]Pt1-AvionicsComponentCosts'!$11:$11,0))","v":2680254.2207999998},0.75,0.75,4.8044709980879535E-2]
[null,298,{"$f":"INDEX('[1]Pt1-AvionicsComponentCosts'!$A:$B,MATCH(B90,'[1]Pt1-AvionicsComponentCosts'!$A:$A,0),2)","v":"Business Jet"},"Boeing",1,"Wide body VIP","Boeing BBJ 777","BBJ 777","BBJ 777",{"$f":"MATCH(\"*\"&F90&\"*\",Sheet1!C:C,0)","v":{"$error":"#N/A"}},{"$f":"MATCH(\"*\"&H90&\"*\",Sheet1!C:C,0)","v":{"$error":"#N/A"}},{"$f":"MATCH(\"*\"&I90&\"*\",Sheet1!B:B,0)","v":{"$error":"#N/A"}},400,null,"https://www.lunajets.com/en/news/new-boeing-business-jet-777x-can-fly-across-the-globe-non-stop",{"$f":"INDEX('[2]Pt1-AvionicsComponentCosts'!$A:$NE,MATCH(B90,'[2]Pt1-AvionicsComponentCosts'!$A:$A,0),MATCH(\"END MARKER\",'[2]Pt1-AvionicsComponentCosts'!$11:$11,0))","v":2623560.6543999994},0.75,0.75,4.9191762269999995E-2]
[null,553,{"$f":"INDEX('[1]Pt1-AvionicsComponentCosts'!$A:$B,MATCH(B91,'[1]Pt1-AvionicsComponentCosts'!$A:$A,0),2)","v":"Business Jet"},"Boeing",1,"Wide body VIP","Boeing BBJ 777X","BBJ 777X","BBJ 777X",{"$f":"MATCH(\"*\"&F91&\"*\",Sheet1!C:C,0)","v":{"$error":"#N/A"}},{"$f":"MATCH(\"*\"&H91&\"*\",Sheet1!C:C,0)","v":{"$error":"#N/A"}},{"$f":"MATCH(\"*\"&I91&\"*\",Sheet1!B:B,0)","v":{"$error":"#N/A"}},400,null,"https://www.lunajets.com/en/news/new-boeing-business-jet-777x-can-fly-across-the-globe-non-stop",{"$f":"INDEX('[2]Pt1-AvionicsComponentCosts'!$A:$NE,MATCH(B91,'[2]Pt1-AvionicsComponentCosts'!$A:$A,0),MATCH(\"END MARKER\",'[2]Pt1-AvionicsComponentCosts'!$11:$11,0))","v":1973033.9247999997},0.75,0.75,3.6994386089999998E-2]
[null,554,{"$f":"INDEX('[1]Pt1-AvionicsComponentCosts'!$A:$B,MATCH(B92,'[1]Pt1-AvionicsComponentCosts'!$A:$A,0),2)","v":"Business Jet"},"Boeing",1,"Wide body VIP","Boeing BBJ 787","BBJ 787","BBJ 787",{"$f":"MATCH(\"*\"&F92&\"*\",Sheet1!C:C,0)","v":{"$error":"#N/A"}},{"$f":"MATCH(\"*\"&H92&\"*\",Sheet1!C:C,0)","v":{"$error":"#N/A"}},{"$f":"MATCH(\"*\"&I92&\"*\",Sheet1!B:B,0)","v":{"$error":"#N/A"}},200,null,"https://finance.yahoo.com/news/5-priciest-private-jets-2023-185110930.html",{"$f":"INDEX('[2]Pt1-AvionicsComponentCosts'!$A:$NE,MATCH(B92,'[2]Pt1-AvionicsComponentCosts'!$A:$A,0),MATCH(\"END MARKER\",'[2]Pt1-AvionicsComponentCosts'!$11:$11,0))","v":2656018.8591999998},0.75,0.75,9.9600707220000001E-2]
[null,179,{"$f":"INDEX('[1]Pt1-AvionicsComponentCosts'!$A:$B,MATCH(B93,'[1]Pt1-AvionicsComponentCosts'!$A:$A,0),2)","v":"Fighters and Jet Trainers"},"Boeing",1,"Boeing/Saab T-X program","Boeing T-7","T-7","T-7",{"$f":"MATCH(\"*\"&F93&\"*\",Sheet1!C:C,0)","v":{"$error":"#N/A"}},{"$f":"MATCH(\"*\"&H93&\"*\",Sheet1!C:C,0)","v":{"$error":"#N/A"}},{"$f":"MATCH(\"*\"&I93&\"*\",Sheet1!B:B,0)","v":{"$error":"#N/A"}},null,null,null,{"$f":"INDEX('[2]Pt1-AvionicsComponentCosts'!$A:$NE,MATCH(B93,'[2]Pt1-AvionicsComponentCosts'!$A:$A,0),MATCH(\"END MARKER\",'[2]Pt1-AvionicsComponentCosts'!$11:$11,0))","v":2971242.2047754629},1,1,""]
[null,637,{"$f":"INDEX('[1]Pt1-AvionicsComponentCosts'!$A:$B,MATCH(B94,'[1]Pt1-AvionicsComponentCosts'!$A:$A,0),2)","v":"Fighters and Jet Trainers"},"Boeing",1,"F-18","F-18 A/D","F-18 A/D","F-18 A/D",{"$f":"MATCH(\"*\"&F94&\"*\",Sheet1!C:C,0)","v":{"$error":"#N/A"}},{"$f":"MATCH(\"*\"&H94&\"*\",Sheet1!C:C,0)","v":{"$error":"#N/A"}},{"$f":"MATCH(\"*\"&I94&\"*\",Sheet1!B:B,0)","v":{"$error":"#N/A"}},null,null,null,{"$f":"INDEX('[2]Pt1-AvionicsComponentCosts'!$A:$NE,MATCH(B94,'[2]Pt1-AvionicsComponentCosts'!$A:$A,0),MATCH(\"END MARKER\",'[2]Pt1-AvionicsComponentCosts'!$11:$11,0))","v":3018848.0191754629},1,1,""]
[null,140,{"$f":"INDEX('[1]Pt1-AvionicsComponentCosts'!$A:$B,MATCH(B95,'[1]Pt1-AvionicsComponentCosts'!$A:$A,0),2)","v":"Fighters and Jet Trainers"},"Boeing",1,"F-18","F-18 Super Hornet","F-18 Super Hornet","F-18 Super Hornet",{"$f":"MATCH(\"*\"&F95&\"*\",Sheet1!C:C,0)","v":{"$error":"#N/A"}},{"$f":"MATCH(\"*\"&H95&\"*\",Sheet1!C:C,0)","v":{"$error":"#N/A"}},{"$f":"MATCH(\"*\"&I95&\"*\",Sheet1!B:B,0)","v":{"$error":"#N/A"}},null,null,null,{"$f":"INDEX('[2]Pt1-AvionicsComponentCosts'!$A:$NE,MATCH(B95,'[2]Pt1-AvionicsComponentCosts'!$A:$A,0),MATCH(\"END MARKER\",'[2]Pt1-AvionicsComponentCosts'!$11:$11,0))","v":3018848.0191754629},1,1,""]
[null,592,{"$f":"INDEX('[1]Pt1-AvionicsComponentCosts'!$A:$B,MATCH(B96,'[1]Pt1-AvionicsComponentCosts'!$A:$A,0),2)","v":"Freighter"},"Boeing",1,"Boeing 747","Boeing 747-400CF","747-400CF","747-400CF",{"$f":"MATCH(\"*\"&F96&\"*\",Sheet1!C:C,0)","v":{"$error":"#N/A"}},{"$f":"MATCH(\"*\"&H96&\"*\",Sheet1!C:C,0)","v":{"$error":"#N/A"}},{"$f":"MATCH(\"*\"&I96&\"*\",Sheet1!B:B,0)","v":{"$error":"#N/A"}},null,null,null,{"$f":"INDEX('[2]Pt1-AvionicsComponentCosts'!$A:$NE,MATCH(B96,'[2]Pt1-AvionicsComponentCosts'!$A:$A,0),MATCH(\"END MARKER\",'[2]Pt1-AvionicsComponentCosts'!$11:$11,0))","v":2020230.2880000004},0.5,0.5,""]
[null,629,{"$f":"INDEX('[1]Pt1-AvionicsComponentCosts'!$A:$B,MATCH(B97,'[1]Pt1-AvionicsComponentCosts'!$A:$A,0),2)","v":"Freighter"},"Boeing",1,"Boeing 747","Boeing 747-400F/ERF","747-400F/ERF","747-400F/ERF",{"$f":"MATCH(\"*\"&F97&\"*\",Sheet1!C:C,0)","v":{"$error":"#N/A"}},{"$f":"MATCH(\"*\"&H97&\"*\",Sheet1!C:C,0)","v":{"$error":"#N/A"}},{"$f":"MATCH(\"*\"&I97&\"*\",Sheet1!B:B,0)","v":{"$error":"#N/A"}},null,null,null,{"$f":"INDEX('[2]Pt1-AvionicsComponentCosts'!$A:$NE,MATCH(B97,'[2]Pt1-AvionicsComponentCosts'!$A:$A,0),MATCH(\"END MARKER\",'[2]Pt1-AvionicsComponentCosts'!$11:$11,0))","v":2020230.2880000004},0.5,0.5,""]
[null,567,{"$f":"INDEX('[1]Pt1-AvionicsComponentCosts'!$A:$B,MATCH(B98,'[1]Pt1-AvionicsComponentCosts'!$A:$A,0),2)","v":"Freighter"},"Boeing",1,"Boeing 747","Boeing 747-8F","747-8F","747-8F",{"$f":"MATCH(\"*\"&F98&\"*\",Sheet1!C:C,0)","v":{"$error":"#N/A"}},{"$f":"MATCH(\"*\"&H98&\"*\",Sheet1!C:C,0)","v":{"$error":"#N/A"}},{"$f":"MATCH(\"*\"&I98&\"*\",Sheet1!B:B,0)","v":{"$error":"#N/A"}},419.2,null,"https://www.statista.com/statistics/273941/prices-of-boeing-aircraft-by-type/",{"$f":"INDEX('[2]Pt1-AvionicsComponentCosts'!$A:$NE,MATCH(B98,'[2]Pt1-AvionicsComponentCosts'!$A:$A,0),MATCH(\"END MARKER\",'[2]Pt1-AvionicsComponentCosts'!$11:$11,0))","v":2627684.3856000002},0.5,0.5,3.1341655362595422E-2]
[null,664,{"$f":"INDEX('[1]Pt1-AvionicsComponentCosts'!$A:$B,MATCH(B99,'[1]Pt1-AvionicsComponentCosts'!$A:$A,0),2)","v":"Freighter"},"Boeing",1,"Boeing 777","Boeing 777-300 ERSF","777-300 ERSF","777-300 ERSF",{"$f":"MATCH(\"*\"&F99&\"*\",Sheet1!C:C,0)","v":{"$error":"#N/A"}},{"$f":"MATCH(\"*\"&H99&\"*\",Sheet1!C:C,0)","v":{"$error":"#N/A"}},{"$f":"MATCH(\"*\"&I99&\"*\",Sheet1!B:B,0)","v":{"$error":"#N/A"}},352.3,null,"https://www.statista.com/statistics/273941/prices-of-boeing-aircraft-by-type/",{"$f":"INDEX('[2]Pt1-AvionicsComponentCosts'!$A:$NE,MATCH(B99,'[2]Pt1-AvionicsComponentCosts'!$A:$A,0),MATCH(\"END MARKER\",'[2]Pt1-AvionicsComponentCosts'!$11:$11,0))","v":2677445.0479999995},0.5,0.5,3.7999503945500987E-2]
[null,568,{"$f":"INDEX('[1]Pt1-AvionicsComponentCosts'!$A:$B,MATCH(B100,'[1]Pt1-AvionicsComponentCosts'!$A:$A,0),2)","v":"Freighter"},"Boeing",1,"Boeing 777","Boeing 777F","777F","777F",{"$f":"MATCH(\"*\"&F100&\"*\",Sheet1!C:C,0)","v":{"$error":"#N/A"}},{"$f":"MATCH(\"*\"&H100&\"*\",Sheet1!C:C,0)","v":{"$error":"#N/A"}},{"$f":"MATCH(\"*\"&I100&\"*\",Sheet1!B:B,0)","v":33},{"$f":"INDEX(Sheet1!$A:$K,MATCH($I100,Sheet1!$B:$B,0),MATCH(M$1,Sheet1!$A$1:$K$1,0))","v":352.3},null,{"$f":"INDEX(Sheet1!$A:$K,MATCH($I100,Sheet1!$B:$B,0),MATCH(O$1,Sheet1!$A$1:$K$1,0))","v":"http://www.axonaviation.com/commercial-aircraft/aircraft-data/aircraft-pricing"},{"$f":"INDEX('[2]Pt1-AvionicsComponentCosts'!$A:$NE,MATCH(B100,'[2]Pt1-AvionicsComponentCosts'!$A:$A,0),MATCH(\"END MARKER\",'[2]Pt1-AvionicsComponentCosts'!$11:$11,0))","v":2677445.0479999995},0.5,0.5,3.7999503945500987E-2]
[null,659,{"$f":"INDEX('[1]Pt1-AvionicsComponentCosts'!$A:$B,MATCH(B101,'[1]Pt1-AvionicsComponentCosts'!$A:$A,0),2)","v":"Freighter"},"Boeing",1,"Boeing 777X","Boeing 777XF: 777-9","777XF: 777-9","777XF: 777-9",{"$f":"MATCH(\"*\"&F101&\"*\",Sheet1!C:C,0)","v":{"$error":"#N/A"}},{"$f":"MATCH(\"*\"&H101&\"*\",Sheet1!C:C,0)","v":{"$error":"#N/A"}},{"$f":"MATCH(\"*\"&I101&\"*\",Sheet1!B:B,0)","v":{"$error":"#N/A"}},442.2,null,"https://www.statista.com/statistics/273941/prices-of-boeing-aircraft-by-type/",{"$f":"INDEX('[2]Pt1-AvionicsComponentCosts'!$A:$NE,MATCH(B101,'[2]Pt1-AvionicsComponentCosts'!$A:$A,0),MATCH(\"END MARKER\",'[2]Pt1-AvionicsComponentCosts'!$11:$11,0))","v":1976043.4208},0.5,0.5,2.2343322261420172E-2]
[null,570,{"$f":"INDEX('[1]Pt1-AvionicsComponentCosts'!$A:$B,MATCH(B102,'[1]Pt1-AvionicsComponentCosts'!$A:$A,0),2)","v":"Freighter"},"Boeing",1,"Boeing 767","Boeing 767-300BCF","767-300BCF","767-300BCF",{"$f":"MATCH(\"*\"&F102&\"*\",Sheet1!C:C,0)","v":{"$error":"#N/A"}},{"$f":"MATCH(\"*\"&H102&\"*\",Sheet1!C:C,0)","v":{"$error":"#N/A"}},{"$f":"MATCH(\"*\"&I102&\"*\",Sheet1!B:B,0)","v":{"$error":"#N/A"}},null,null,null,{"$f":"INDEX('[2]Pt1-AvionicsComponentCosts'!$A:$NE,MATCH(B102,'[2]Pt1-AvionicsComponentCosts'!$A:$A,0),MATCH(\"END MARKER\",'[2]Pt1-AvionicsComponentCosts'!$11:$11,0))","v":1938483.0768000002},0.5,0.5,""]
[null,569,{"$f":"INDEX('[1]Pt1-AvionicsComponentCosts'!$A:$B,MATCH(B103,'[1]Pt1-AvionicsComponentCosts'!$A:$A,0),2)","v":"Freighter"},"Boeing",1,"Boeing 767","Boeing 767-300F","767-300F","767-300F",{"$f":"MATCH(\"*\"&F103&\"*\",Sheet1!C:C,0)","v":{"$error":"#N/A"}},{"$f":"MATCH(\"*\"&H103&\"*\",Sheet1!C:C,0)","v":{"$error":"#N/A"}},{"$f":"MATCH(\"*\"&I103&\"*\",Sheet1!B:B,0)","v":{"$error":"#N/A"}},220.3,null,"https://www.statista.com/statistics/273941/prices-of-boeing-aircraft-by-type/",{"$f":"INDEX('[2]Pt1-AvionicsComponentCosts'!$A:$NE,MATCH(B103,'[2]Pt1-AvionicsComponentCosts'!$A:$A,0),MATCH(\"END MARKER\",'[2]Pt1-AvionicsComponentCosts'!$11:$11,0))","v":1938483.0768000002},0.5,0.5,4.3996438420335911E-2]
[null,573,{"$f":"INDEX('[1]Pt1-AvionicsComponentCosts'!$A:$B,MATCH(B104,'[1]Pt1-AvionicsComponentCosts'!$A:$A,0),2)","v":"Freighter"},"Boeing",1,"Boeing 737","Boeing 737-300SF","737-300SF","737-300SF",{"$f":"MATCH(\"*\"&F104&\"*\",Sheet1!C:C,0)","v":{"$error":"#N/A"}},{"$f":"MATCH(\"*\"&H104&\"*\",Sheet1!C:C,0)","v":{"$error":"#N/A"}},{"$f":"MATCH(\"*\"&I104&\"*\",Sheet1!B:B,0)","v":{"$error":"#N/A"}},null,null,null,{"$f":"INDEX('[2]Pt1-AvionicsComponentCosts'!$A:$NE,MATCH(B104,'[2]Pt1-AvionicsComponentCosts'!$A:$A,0),MATCH(\"END MARKER\",'[2]Pt1-AvionicsComponentCosts'!$11:$11,0))","v":1395800},0.5,0.5,""]
[null,572,{"$f":"INDEX('[1]Pt1-AvionicsComponentCosts'!$A:$B,MATCH(B105,'[1]Pt1-AvionicsComponentCosts'!$A:$A,0),2)","v":"Freighter"},"Boeing",1,"Boeing 737","Boeing 737-400SF","737-400SF","737-400SF",{"$f":"MATCH(\"*\"&F105&\"*\",Sheet1!C:C,0)","v":{"$error":"#N/A"}},{"$f":"MATCH(\"*\"&H105&\"*\",Sheet1!C:C,0)","v":{"$error":"#N/A"}},{"$f":"MATCH(\"*\"&I105&\"*\",Sheet1!B:B,0)","v":{"$error":"#N/A"}},null,null,null,{"$f":"INDEX('[2]Pt1-AvionicsComponentCosts'!$A:$NE,MATCH(B105,'[2]Pt1-AvionicsComponentCosts'!$A:$A,0),MATCH(\"END MARKER\",'[2]Pt1-AvionicsComponentCosts'!$11:$11,0))","v":1395800},0.5,0.5,""]
[null,591,{"$f":"INDEX('[1]Pt1-AvionicsComponentCosts'!$A:$B,MATCH(B106,'[1]Pt1-AvionicsComponentCosts'!$A:$A,0),2)","v":"Freighter"},"Boeing",1,"Boeing 737","Boeing 737-700C","737-700C","737-700C",{"$f":"MATCH(\"*\"&F106&\"*\",Sheet1!C:C,0)","v":{"$error":"#N/A"}},{"$f":"MATCH(\"*\"&H106&\"*\",Sheet1!C:C,0)","v":{"$error":"#N/A"}},{"$f":"MATCH(\"*\"&I106&\"*\",Sheet1!B:B,0)","v":{"$error":"#N/A"}},89.1,null,"https://www.statista.com/statistics/273941/prices-of-boeing-aircraft-by-type/",{"$f":"INDEX('[2]Pt1-AvionicsComponentCosts'!$A:$NE,MATCH(B106,'[2]Pt1-AvionicsComponentCosts'!$A:$A,0),MATCH(\"END MARKER\",'[2]Pt1-AvionicsComponentCosts'!$11:$11,0))","v":1395800},0.5,0.5,7.8327721661054991E-2]
[null,571,{"$f":"INDEX('[1]Pt1-AvionicsComponentCosts'!$A:$B,MATCH(B107,'[1]Pt1-AvionicsComponentCosts'!$A:$A,0),2)","v":"Freighter"},"Boeing",1,"Boeing 737NG","Boeing 737-700/-800CF","737-700/-800CF","737-700/-800CF",{"$f":"MATCH(\"*\"&F107&\"*\",Sheet1!C:C,0)","v":{"$error":"#N/A"}},{"$f":"MATCH(\"*\"&H107&\"*\",Sheet1!C:C,0)","v":{"$error":"#N/A"}},{"$f":"MATCH(\"*\"&I107&\"*\",Sheet1!B:B,0)","v":{"$error":"#N/A"}},89.1,null,"https://www.statista.com/statistics/273941/prices-of-boeing-aircraft-by-type/",{"$f":"INDEX('[2]Pt1-AvionicsComponentCosts'!$A:$NE,MATCH(B107,'[2]Pt1-AvionicsComponentCosts'!$A:$A,0),MATCH(\"END MARKER\",'[2]Pt1-AvionicsComponentCosts'!$11:$11,0))","v":1395800},0.5,0.5,7.8327721661054991E-2]
[null,596,{"$f":"INDEX('[1]Pt1-AvionicsComponentCosts'!$A:$B,MATCH(B108,'[1]Pt1-AvionicsComponentCosts'!$A:$A,0),2)","v":"Freighter"},"Boeing",1,"Boeing 757","Boeing 757-200 PF/SF","757-200 PF/SF","757-200 PF/SF",{"$f":"MATCH(\"*\"&F108&\"*\",Sheet1!C:C,0)","v":{"$error":"#N/A"}},{"$f":"MATCH(\"*\"&H108&\"*\",Sheet1!C:C,0)","v":{"$error":"#N/A"}},{"$f":"MATCH(\"*\"&I108&\"*\",Sheet1!B:B,0)","v":{"$error":"#N/A"}},null,null,null,{"$f":"INDEX('[2]Pt1-AvionicsComponentCosts'!$A:$NE,MATCH(B108,'[2]Pt1-AvionicsComponentCosts'!$A:$A,0),MATCH(\"END MARKER\",'[2]Pt1-AvionicsComponentCosts'!$11:$11,0))","v":1395800},0.5,0.5,""]
[null,98,{"$f":"INDEX('[1]Pt1-AvionicsComponentCosts'!$A:$B,MATCH(B109,'[1]Pt1-AvionicsComponentCosts'!$A:$A,0),2)","v":"Helicopter"},"Boeing",1,"AH-64","Boeing AH-64 Apache","AH-64 Apache","AH-64 Apache",{"$f":"MATCH(\"*\"&F109&\"*\",Sheet1!C:C,0)","v":{"$error":"#N/A"}},{"$f":"MATCH(\"*\"&H109&\"*\",Sheet1!C:C,0)","v":{"$error":"#N/A"}},{"$f":"MATCH(\"*\"&I109&\"*\",Sheet1!B:B,0)","v":{"$error":"#N/A"}},null,null,null,{"$f":"INDEX('[2]Pt1-AvionicsComponentCosts'!$A:$NE,MATCH(B109,'[2]Pt1-AvionicsComponentCosts'!$A:$A,0),MATCH(\"END MARKER\",'[2]Pt1-AvionicsComponentCosts'!$11:$11,0))","v":1650480.8064753041},0.99,0.99,""]
[null,99,{"$f":"INDEX('[1]Pt1-AvionicsComponentCosts'!$A:$B,MATCH(B110,'[1]Pt1-AvionicsComponentCosts'!$A:$A,0),2)","v":"Helicopter"},"Boeing",1,"AH-64","Boeing AH-64 Apache (reman)","AH-64 Apache (reman)","AH-64 Apache (reman)",{"$f":"MATCH(\"*\"&F110&\"*\",Sheet1!C:C,0)","v":{"$error":"#N/A"}},{"$f":"MATCH(\"*\"&H110&\"*\",Sheet1!C:C,0)","v":{"$error":"#N/A"}},{"$f":"MATCH(\"*\"&I110&\"*\",Sheet1!B:B,0)","v":{"$error":"#N/A"}},null,null,null,{"$f":"INDEX('[2]Pt1-AvionicsComponentCosts'!$A:$NE,MATCH(B110,'[2]Pt1-AvionicsComponentCosts'!$A:$A,0),MATCH(\"END MARKER\",'[2]Pt1-AvionicsComponentCosts'!$11:$11,0))","v":1650480.8064753041},0.99,0.99,""]
[null,100,{"$f":"INDEX('[1]Pt1-AvionicsComponentCosts'!$A:$B,MATCH(B111,'[1]Pt1-AvionicsComponentCosts'!$A:$A,0),2)","v":"Helicopter"},"Boeing",1,"CH-47","Boeing CH-47 Chinook","CH-47 Chinook","CH-47 Chinook",{"$f":"MATCH(\"*\"&F111&\"*\",Sheet1!C:C,0)","v":{"$error":"#N/A"}},{"$f":"MATCH(\"*\"&H111&\"*\",Sheet1!C:C,0)","v":{"$error":"#N/A"}},{"$f":"MATCH(\"*\"&I111&\"*\",Sheet1!B:B,0)","v":{"$error":"#N/A"}},null,null,null,{"$f":"INDEX('[2]Pt1-AvionicsComponentCosts'!$A:$NE,MATCH(B111,'[2]Pt1-AvionicsComponentCosts'!$A:$A,0),MATCH(\"END MARKER\",'[2]Pt1-AvionicsComponentCosts'!$11:$11,0))","v":1647883.8816753041},0.99,0.99,""]
[null,101,{"$f":"INDEX('[1]Pt1-AvionicsComponentCosts'!$A:$B,MATCH(B112,'[1]Pt1-AvionicsComponentCosts'!$A:$A,0),2)","v":"Helicopter"},"Boeing",1,"CH-47","Boeing CH-47 Chinook (reman)","CH-47 Chinook (reman)","CH-47 Chinook (reman)",{"$f":"MATCH(\"*\"&F112&\"*\",Sheet1!C:C,0)","v":{"$error":"#N/A"}},{"$f":"MATCH(\"*\"&H112&\"*\",Sheet1!C:C,0)","v":{"$error":"#N/A"}},{"$f":"MATCH(\"*\"&I112&\"*\",Sheet1!B:B,0)","v":{"$error":"#N/A"}},null,null,null,{"$f":"INDEX('[2]Pt1-AvionicsComponentCosts'!$A:$NE,MATCH(B112,'[2]Pt1-AvionicsComponentCosts'!$A:$A,0),MATCH(\"END MARKER\",'[2]Pt1-AvionicsComponentCosts'!$11:$11,0))","v":1647883.8816753041},0.99,0.99,""]
[null,299,{"$f":"INDEX('[1]Pt1-AvionicsComponentCosts'!$A:$B,MATCH(B113,'[1]Pt1-AvionicsComponentCosts'!$A:$A,0),2)","v":"Large Commercial Aircraft"},"Boeing",1,"Boeing 717","Boeing 717","717","717",{"$f":"MATCH(\"*\"&F113&\"*\",Sheet1!C:C,0)","v":{"$error":"#N/A"}},{"$f":"MATCH(\"*\"&H113&\"*\",Sheet1!C:C,0)","v":{"$error":"#N/A"}},{"$f":"MATCH(\"*\"&I113&\"*\",Sheet1!B:B,0)","v":{"$error":"#N/A"}},null,null,null,{"$f":"INDEX('[2]Pt1-AvionicsComponentCosts'!$A:$NE,MATCH(B113,'[2]Pt1-AvionicsComponentCosts'!$A:$A,0),MATCH(\"END MARKER\",'[2]Pt1-AvionicsComponentCosts'!$11:$11,0))","v":1412649.8208753041},{"$f":"50%","v":0.5},{"$f":"50%","v":0.5},""]
[null,534,{"$f":"INDEX('[1]Pt1-AvionicsComponentCosts'!$A:$B,MATCH(B114,'[1]Pt1-AvionicsComponentCosts'!$A:$A,0),2)","v":"Large Commercial Aircraft"},"Boeing",1,"Boeing 737 Classic","Boeing 737 Classic: 737-300",{"$f":"TRIM(SUBSTITUTE(G114,D114,\"\"))","v":"737 Classic: 737-300"},"737-300",{"$f":"MATCH(\"*\"&F114&\"*\",Sheet1!C:C,0)","v":{"$error":"#N/A"}},{"$f":"MATCH(\"*\"&H114&\"*\",Sheet1!C:C,0)","v":{"$error":"#N/A"}},{"$f":"MATCH(\"*\"&I114&\"*\",Sheet1!B:B,0)","v":{"$error":"#N/A"}},null,"OOP",null,{"$f":"INDEX('[2]Pt1-AvionicsComponentCosts'!$A:$NE,MATCH(B114,'[2]Pt1-AvionicsComponentCosts'!$A:$A,0),MATCH(\"END MARKER\",'[2]Pt1-AvionicsComponentCosts'!$11:$11,0))","v":1450795},{"$f":"50%","v":0.5},{"$f":"50%","v":0.5},""]
[null,535,{"$f":"INDEX('[1]Pt1-AvionicsComponentCosts'!$A:$B,MATCH(B115,'[1]Pt1-AvionicsComponentCosts'!$A:$A,0),2)","v":"Large Commercial Aircraft"},"Boeing",1,"Boeing 737 Classic","Boeing 737 Classic: 737-400","737 Classic: 737-400","737-400",{"$f":"MATCH(\"*\"&F115&\"*\",Sheet1!C:C,0)","v":{"$error":"#N/A"}},{"$f":"MATCH(\"*\"&H115&\"*\",Sheet1!C:C,0)","v":{"$error":"#N/A"}},{"$f":"MATCH(\"*\"&I115&\"*\",Sheet1!B:B,0)","v":{"$error":"#N/A"}},null,"OOP",null,{"$f":"INDEX('[2]Pt1-AvionicsComponentCosts'!$A:$NE,MATCH(B115,'[2]Pt1-AvionicsComponentCosts'!$A:$A,0),MATCH(\"END MARKER\",'[2]Pt1-AvionicsComponentCosts'!$11:$11,0))","v":1450795},{"$f":"50%","v":0.5},{"$f":"50%","v":0.5},""]
[null,536,{"$f":"INDEX('[1]Pt1-AvionicsComponentCosts'!$A:$B,MATCH(B116,'[1]Pt1-AvionicsComponentCosts'!$A:$A,0),2)","v":"Large Commercial Aircraft"},"Boeing",1,"Boeing 737 Classic","Boeing 737 Classic: 737-500","737 Classic: 737-500","737-500",{"$f":"MATCH(\"*\"&F116&\"*\",Sheet1!C:C,0)","v":{"$error":"#N/A"}},{"$f":"MATCH(\"*\"&H116&\"*\",Sheet1!C:C,0)","v":{"$error":"#N/A"}},{"$f":"MATCH(\"*\"&I116&\"*\",Sheet1!B:B,0)","v":{"$error":"#N/A"}},null,"OOP",null,{"$f":"INDEX('[2]Pt1-AvionicsComponentCosts'!$A:$NE,MATCH(B116,'[2]Pt1-AvionicsComponentCosts'!$A:$A,0),MATCH(\"END MARKER\",'[2]Pt1-AvionicsComponentCosts'!$11:$11,0))","v":1450795},{"$f":"50%","v":0.5},{"$f":"50%","v":0.5},""]
[null,309,{"$f":"INDEX('[1]Pt1-AvionicsComponentCosts'!$A:$B,MATCH(B117,'[1]Pt1-AvionicsComponentCosts'!$A:$A,0),2)","v":"Large Commercial Aircraft"},"Boeing",1,"Boeing 737MAX","Boeing 737 MAX: 737 MAX 10","737 MAX: 737 MAX 10","737 MAX 10",{"$f":"MATCH(\"*\"&F117&\"*\",Sheet1!C:C,0)","v":{"$error":"#N/A"}},{"$f":"MATCH(\"*\"&H117&\"*\",Sheet1!C:C,0)","v":{"$error":"#N/A"}},{"$f":"MATCH(\"*\"&I117&\"*\",Sheet1!B:B,0)","v":{"$error":"#N/A"}},134.9,null,"https://www.statista.com/statistics/273941/prices-of-boeing-aircraft-by-type/",{"$f":"INDEX('[2]Pt1-AvionicsComponentCosts'!$A:$NE,MATCH(B117,'[2]Pt1-AvionicsComponentCosts'!$A:$A,0),MATCH(\"END MARKER\",'[2]Pt1-AvionicsComponentCosts'!$11:$11,0))","v":1450795},{"$f":"50%","v":0.5},{"$f":"50%","v":0.5},5.3772979985174205E-2]
[null,195,{"$f":"INDEX('[1]Pt1-AvionicsComponentCosts'!$A:$B,MATCH(B118,'[1]Pt1-AvionicsComponentCosts'!$A:$A,0),2)","v":"Large Commercial Aircraft"},"Boeing",1,"Boeing 737MAX","Boeing 737 MAX: 737 MAX 7","737 MAX: 737 MAX 7","737-MAX 7",{"$f":"MATCH(\"*\"&F118&\"*\",Sheet1!C:C,0)","v":{"$error":"#N/A"}},{"$f":"MATCH(\"*\"&H118&\"*\",Sheet1!C:C,0)","v":{"$error":"#N/A"}},{"$f":"MATCH(\"*\"&I118&\"*\",Sheet1!B:B,0)","v":2},{"$f":"INDEX(Sheet1!$A:$K,MATCH($I118,Sheet1!$B:$B,0),MATCH(M$1,Sheet1!$A$1:$K$1,0))","v":99.7},null,{"$f":"INDEX(Sheet1!$A:$K,MATCH($I118,Sheet1!$B:$B,0),MATCH(O$1,Sheet1!$A$1:$K$1,0))","v":"http://www.axonaviation.com/commercial-aircraft/aircraft-data/aircraft-pricing"},{"$f":"INDEX('[2]Pt1-AvionicsComponentCosts'!$A:$NE,MATCH(B118,'[2]Pt1-AvionicsComponentCosts'!$A:$A,0),MATCH(\"END MARKER\",'[2]Pt1-AvionicsComponentCosts'!$11:$11,0))","v":1450795},{"$f":"50%","v":0.5},{"$f":"50%","v":0.5},7.2758024072216654E-2]
[null,196,{"$f":"INDEX('[1]Pt1-AvionicsComponentCosts'!$A:$B,MATCH(B119,'[1]Pt1-AvionicsComponentCosts'!$A:$A,0),2)","v":"Large Commercial Aircraft"},"Boeing",1,"Boeing 737MAX","Boeing 737 MAX: 737 MAX 8","737 MAX: 737 MAX 8","737 MAX 8",{"$f":"MATCH(\"*\"&F119&\"*\",Sheet1!C:C,0)","v":{"$error":"#N/A"}},{"$f":"MATCH(\"*\"&H119&\"*\",Sheet1!C:C,0)","v":{"$error":"#N/A"}},{"$f":"MATCH(\"*\"&I119&\"*\",Sheet1!B:B,0)","v":{"$error":"#N/A"}},121.6,null,"https://www.statista.com/statistics/273941/prices-of-boeing-aircraft-by-type/",{"$f":"INDEX('[2]Pt1-AvionicsComponentCosts'!$A:$NE,MATCH(B119,'[2]Pt1-AvionicsComponentCosts'!$A:$A,0),MATCH(\"END MARKER\",'[2]Pt1-AvionicsComponentCosts'!$11:$11,0))","v":1450795},{"$f":"50%","v":0.5},{"$f":"50%","v":0.5},5.9654399671052634E-2]
[null,197,{"$f":"INDEX('[1]Pt1-AvionicsComponentCosts'!$A:$B,MATCH(B120,'[1]Pt1-AvionicsComponentCosts'!$A:$A,0),2)","v":"Large Commercial Aircraft"},"Boeing",1,"Boeing 737MAX","Boeing 737 MAX: 737 MAX 9","737 MAX: 737 MAX 9","737 MAX 9",{"$f":"MATCH(\"*\"&F120&\"*\",Sheet1!C:C,0)","v":{"$error":"#N/A"}},{"$f":"MATCH(\"*\"&H120&\"*\",Sheet1!C:C,0)","v":{"$error":"#N/A"}},{"$f":"MATCH(\"*\"&I120&\"*\",Sheet1!B:B,0)","v":{"$error":"#N/A"}},128.9,null,"https://www.statista.com/statistics/273941/prices-of-boeing-aircraft-by-type/",{"$f":"INDEX('[2]Pt1-AvionicsComponentCosts'!$A:$NE,MATCH(B120,'[2]Pt1-AvionicsComponentCosts'!$A:$A,0),MATCH(\"END MARKER\",'[2]Pt1-AvionicsComponentCosts'!$11:$11,0))","v":1450795},{"$f":"50%","v":0.5},{"$f":"50%","v":0.5},5.627598913886734E-2]
[null,300,{"$f":"INDEX('[1]Pt1-AvionicsComponentCosts'!$A:$B,MATCH(B121,'[1]Pt1-AvionicsComponentCosts'!$A:$A,0),2)","v":"Large Commercial Aircraft"},"Boeing",1,"Boeing 737NG","Boeing 737-600","737-600","737-600",{"$f":"MATCH(\"*\"&F121&\"*\",Sheet1!C:C,0)","v":{"$error":"#N/A"}},{"$f":"MATCH(\"*\"&H121&\"*\",Sheet1!C:C,0)","v":{"$error":"#N/A"}},{"$f":"MATCH(\"*\"&I121&\"*\",Sheet1!B:B,0)","v":{"$error":"#N/A"}},null,null,null,{"$f":"INDEX('[2]Pt1-AvionicsComponentCosts'!$A:$NE,MATCH(B121,'[2]Pt1-AvionicsComponentCosts'!$A:$A,0),MATCH(\"END MARKER\",'[2]Pt1-AvionicsComponentCosts'!$11:$11,0))","v":1450795},{"$f":"50%","v":0.5},{"$f":"50%","v":0.5},""]
[null,192,{"$f":"INDEX('[1]Pt1-AvionicsComponentCosts'!$A:$B,MATCH(B122,'[1]Pt1-AvionicsComponentCosts'!$A:$A,0),2)","v":"Large Commercial Aircraft"},"Boeing",1,"Boeing 737NG","Boeing 737-700","737-700","737-700",{"$f":"MATCH(\"*\"&F122&\"*\",Sheet1!C:C,0)","v":{"$error":"#N/A"}},{"$f":"MATCH(\"*\"&H122&\"*\",Sheet1!C:C,0)","v":{"$error":"#N/A"}},{"$f":"MATCH(\"*\"&I122&\"*\",Sheet1!B:B,0)","v":20},{"$f":"INDEX(Sheet1!$A:$K,MATCH($I122,Sheet1!$B:$B,0),MATCH(M$1,Sheet1!$A$1:$K$1,0))","v":89.1},null,{"$f":"INDEX(Sheet1!$A:$K,MATCH($I122,Sheet1!$B:$B,0),MATCH(O$1,Sheet1!$A$1:$K$1,0))","v":"http://www.axonaviation.com/commercial-aircraft/aircraft-data/aircraft-pricing"},{"$f":"INDEX('[2]Pt1-AvionicsComponentCosts'!$A:$NE,MATCH(B122,'[2]Pt1-AvionicsComponentCosts'!$A:$A,0),MATCH(\"END MARKER\",'[2]Pt1-AvionicsComponentCosts'!$11:$11,0))","v":1450795},{"$f":"50%","v":0.5},{"$f":"50%","v":0.5},8.1413860830527499E-2]
[null,193,{"$f":"INDEX('[1]Pt1-AvionicsComponentCosts'!$A:$B,MATCH(B123,'[1]Pt1-AvionicsComponentCosts'!$A:$A,0),2)","v":"Large Commercial Aircraft"},"Boeing",1,"Boeing 737NG","Boeing 737-800","737-800","737-800",{"$f":"MATCH(\"*\"&F123&\"*\",Sheet1!C:C,0)","v":{"$error":"#N/A"}},{"$f":"MATCH(\"*\"&H123&\"*\",Sheet1!C:C,0)","v":{"$error":"#N/A"}},{"$f":"MATCH(\"*\"&I123&\"*\",Sheet1!B:B,0)","v":21},{"$f":"INDEX(Sheet1!$A:$K,MATCH($I123,Sheet1!$B:$B,0),MATCH(M$1,Sheet1!$A$1:$K$1,0))","v":106.1},null,{"$f":"INDEX(Sheet1!$A:$K,MATCH($I123,Sheet1!$B:$B,0),MATCH(O$1,Sheet1!$A$1:$K$1,0))","v":"http://www.axonaviation.com/commercial-aircraft/aircraft-data/aircraft-pricing"},{"$f":"INDEX('[2]Pt1-AvionicsComponentCosts'!$A:$NE,MATCH(B123,'[2]Pt1-AvionicsComponentCosts'!$A:$A,0),MATCH(\"END MARKER\",'[2]Pt1-AvionicsComponentCosts'!$11:$11,0))","v":1450795},{"$f":"50%","v":0.5},{"$f":"50%","v":0.5},6.8369227144203584E-2]
[null,194,{"$f":"INDEX('[1]Pt1-AvionicsComponentCosts'!$A:$B,MATCH(B124,'[1]Pt1-AvionicsComponentCosts'!$A:$A,0),2)","v":"Large Commercial Aircraft"},"Boeing",1,"Boeing 737NG","Boeing 737-900","737-900","737-900",{"$f":"MATCH(\"*\"&F124&\"*\",Sheet1!C:C,0)","v":{"$error":"#N/A"}},{"$f":"MATCH(\"*\"&H124&\"*\",Sheet1!C:C,0)","v":{"$error":"#N/A"}},{"$f":"MATCH(\"*\"&I124&\"*\",Sheet1!B:B,0)","v":22},112.6,null,"https://www.statista.com/statistics/273941/prices-of-boeing-aircraft-by-type/",{"$f":"INDEX('[2]Pt1-AvionicsComponentCosts'!$A:$NE,MATCH(B124,'[2]Pt1-AvionicsComponentCosts'!$A:$A,0),MATCH(\"END MARKER\",'[2]Pt1-AvionicsComponentCosts'!$11:$11,0))","v":1450795},{"$f":"50%","v":0.5},{"$f":"50%","v":0.5},6.4422513321492E-2]
[null,522,{"$f":"INDEX('[1]Pt1-AvionicsComponentCosts'!$A:$B,MATCH(B125,'[1]Pt1-AvionicsComponentCosts'!$A:$A,0),2)","v":"Large Commercial Aircraft"},"Boeing",1,"Boeing 757","Boeing 757","757","757",{"$f":"MATCH(\"*\"&F125&\"*\",Sheet1!C:C,0)","v":{"$error":"#N/A"}},{"$f":"MATCH(\"*\"&H125&\"*\",Sheet1!C:C,0)","v":26},{"$f":"MATCH(\"*\"&I125&\"*\",Sheet1!B:B,0)","v":26},null,null,null,{"$f":"INDEX('[2]Pt1-AvionicsComponentCosts'!$A:$NE,MATCH(B125,'[2]Pt1-AvionicsComponentCosts'!$A:$A,0),MATCH(\"END MARKER\",'[2]Pt1-AvionicsComponentCosts'!$11:$11,0))","v":1450796},{"$f":"50%","v":0.5},{"$f":"50%","v":0.5},""]
[null,612,{"$f":"INDEX('[1]Pt1-AvionicsComponentCosts'!$A:$B,MATCH(B126,'[1]Pt1-AvionicsComponentCosts'!$A:$A,0),2)","v":"Large Commercial Aircraft"},"Boeing",1,"Boeing New Single Aisle (NSA)","Boeing New Single Aisle (NSA)","New Single Aisle (NSA)","New Single Aisle (NSA)",{"$f":"MATCH(\"*\"&F126&\"*\",Sheet1!C:C,0)","v":{"$error":"#N/A"}},{"$f":"MATCH(\"*\"&H126&\"*\",Sheet1!C:C,0)","v":{"$error":"#N/A"}},{"$f":"MATCH(\"*\"&I126&\"*\",Sheet1!B:B,0)","v":{"$error":"#N/A"}},null,null,null,{"$f":"INDEX('[2]Pt1-AvionicsComponentCosts'!$A:$NE,MATCH(B126,'[2]Pt1-AvionicsComponentCosts'!$A:$A,0),MATCH(\"END MARKER\",'[2]Pt1-AvionicsComponentCosts'!$11:$11,0))","v":1625971.1119999997},{"$f":"50%","v":0.5},{"$f":"50%","v":0.5},""]
[null,12,{"$f":"INDEX('[1]Pt1-AvionicsComponentCosts'!$A:$B,MATCH(B127,'[1]Pt1-AvionicsComponentCosts'!$A:$A,0),2)","v":"Large Commercial Aircraft"},"Boeing",1,"Boeing 767","Boeing 767","767","767",{"$f":"MATCH(\"*\"&F127&\"*\",Sheet1!C:C,0)","v":{"$error":"#N/A"}},{"$f":"MATCH(\"*\"&H127&\"*\",Sheet1!C:C,0)","v":28},{"$f":"MATCH(\"*\"&I127&\"*\",Sheet1!B:B,0)","v":28},null,null,null,{"$f":"INDEX('[2]Pt1-AvionicsComponentCosts'!$A:$NE,MATCH(B127,'[2]Pt1-AvionicsComponentCosts'!$A:$A,0),MATCH(\"END MARKER\",'[2]Pt1-AvionicsComponentCosts'!$11:$11,0))","v":1940910.3328000002},{"$f":"50%","v":0.5},{"$f":"50%","v":0.5},""]
[null,539,{"$f":"INDEX('[1]Pt1-AvionicsComponentCosts'!$A:$B,MATCH(B128,'[1]Pt1-AvionicsComponentCosts'!$A:$A,0),2)","v":"Large Commercial Aircraft"},"Boeing",1,"Boeing 777","Boeing 777: 777-200ER","777: 777-200ER","777-200ER",{"$f":"MATCH(\"*\"&F128&\"*\",Sheet1!C:C,0)","v":{"$error":"#N/A"}},{"$f":"MATCH(\"*\"&H128&\"*\",Sheet1!C:C,0)","v":{"$error":"#N/A"}},{"$f":"MATCH(\"*\"&I128&\"*\",Sheet1!B:B,0)","v":30},{"$f":"INDEX(Sheet1!$A:$K,MATCH($I128,Sheet1!$B:$B,0),MATCH(M$1,Sheet1!$A$1:$K$1,0))","v":306.60000000000002},null,{"$f":"INDEX(Sheet1!$A:$K,MATCH($I128,Sheet1!$B:$B,0),MATCH(O$1,Sheet1!$A$1:$K$1,0))","v":"http://www.axonaviation.com/commercial-aircraft/aircraft-data/aircraft-pricing"},{"$f":"INDEX('[2]Pt1-AvionicsComponentCosts'!$A:$NE,MATCH(B128,'[2]Pt1-AvionicsComponentCosts'!$A:$A,0),MATCH(\"END MARKER\",'[2]Pt1-AvionicsComponentCosts'!$11:$11,0))","v":1988363.7231999999},{"$f":"50%","v":0.5},{"$f":"50%","v":0.5},3.2426022883235484E-2]
[null,201,{"$f":"INDEX('[1]Pt1-AvionicsComponentCosts'!$A:$B,MATCH(B129,'[1]Pt1-AvionicsComponentCosts'!$A:$A,0),2)","v":"Large Commercial Aircraft"},"Boeing",1,"Boeing 777","Boeing 777: 777-200LR","777: 777-200LR","777-200LR",{"$f":"MATCH(\"*\"&F129&\"*\",Sheet1!C:C,0)","v":{"$error":"#N/A"}},{"$f":"MATCH(\"*\"&H129&\"*\",Sheet1!C:C,0)","v":{"$error":"#N/A"}},{"$f":"MATCH(\"*\"&I129&\"*\",Sheet1!B:B,0)","v":31},{"$f":"INDEX(Sheet1!$A:$K,MATCH($I129,Sheet1!$B:$B,0),MATCH(M$1,Sheet1!$A$1:$K$1,0))","v":346.9},null,{"$f":"INDEX(Sheet1!$A:$K,MATCH($I129,Sheet1!$B:$B,0),MATCH(O$1,Sheet1!$A$1:$K$1,0))","v":"http://www.axonaviation.com/commercial-aircraft/aircraft-data/aircraft-pricing"},{"$f":"INDEX('[2]Pt1-AvionicsComponentCosts'!$A:$NE,MATCH(B129,'[2]Pt1-AvionicsComponentCosts'!$A:$A,0),MATCH(\"END MARKER\",'[2]Pt1-AvionicsComponentCosts'!$11:$11,0))","v":2608129.4304},{"$f":"50%","v":0.5},{"$f":"50%","v":0.5},3.7591949126549437E-2]
[null,303,{"$f":"INDEX('[1]Pt1-AvionicsComponentCosts'!$A:$B,MATCH(B130,'[1]Pt1-AvionicsComponentCosts'!$A:$A,0),2)","v":"Large Commercial Aircraft"},"Boeing",1,"Boeing 777","Boeing 777: 777-300","777: 777-300","777-300",{"$f":"MATCH(\"*\"&F130&\"*\",Sheet1!C:C,0)","v":{"$error":"#N/A"}},{"$f":"MATCH(\"*\"&H130&\"*\",Sheet1!C:C,0)","v":{"$error":"#N/A"}},{"$f":"MATCH(\"*\"&I130&\"*\",Sheet1!B:B,0)","v":32},217.9,null,"https://www.statista.com/statistics/273941/prices-of-boeing-aircraft-by-type/",{"$f":"INDEX('[2]Pt1-AvionicsComponentCosts'!$A:$NE,MATCH(B130,'[2]Pt1-AvionicsComponentCosts'!$A:$A,0),MATCH(\"END MARKER\",'[2]Pt1-AvionicsComponentCosts'!$11:$11,0))","v":1988363.7231999999},{"$f":"50%","v":0.5},{"$f":"50%","v":0.5},4.5625601725562182E-2]
[null,202,{"$f":"INDEX('[1]Pt1-AvionicsComponentCosts'!$A:$B,MATCH(B131,'[1]Pt1-AvionicsComponentCosts'!$A:$A,0),2)","v":"Large Commercial Aircraft"},"Boeing",1,"Boeing 777","Boeing 777: 777-300ER",{"$f":"TRIM(SUBSTITUTE(G131,D131,\"\"))","v":"777: 777-300ER"},{"$f":"TRIM(SUBSTITUTE(SUBSTITUTE(SUBSTITUTE(SUBSTITUTE(SUBSTITUTE(H131,\"Family\",\"\"),\"737 Classic:\",\"\"),\"737 MAX:\",\"\"),\"787 Dreamliner:\",\"\"),\"777:\",\"\"))","v":"777-300ER"},{"$f":"MATCH(\"*\"&F131&\"*\",Sheet1!C:C,0)","v":{"$error":"#N/A"}},{"$f":"MATCH(\"*\"&H131&\"*\",Sheet1!C:C,0)","v":{"$error":"#N/A"}},{"$f":"MATCH(\"*\"&I131&\"*\",Sheet1!B:B,0)","v":32},{"$f":"INDEX(Sheet1!$A:$K,MATCH($I131,Sheet1!$B:$B,0),MATCH(M$1,Sheet1!$A$1:$K$1,0))","v":375.5},null,{"$f":"INDEX(Sheet1!$A:$K,MATCH($I131,Sheet1!$B:$B,0),MATCH(O$1,Sheet1!$A$1:$K$1,0))","v":"http://www.axonaviation.com/commercial-aircraft/aircraft-data/aircraft-pricing"},{"$f":"INDEX('[2]Pt1-AvionicsComponentCosts'!$A:$NE,MATCH(B131,'[2]Pt1-AvionicsComponentCosts'!$A:$A,0),MATCH(\"END MARKER\",'[2]Pt1-AvionicsComponentCosts'!$11:$11,0))","v":2608129.4304},{"$f":"50%","v":0.5},{"$f":"50%","v":0.5},{"$f":"IFERROR(P131/(M131*100000)*R131,\"\")","v":3.4728754066577897E-2}]
[null,203,{"$f":"INDEX('[1]Pt1-AvionicsComponentCosts'!$A:$B,MATCH(B132,'[1]Pt1-AvionicsComponentCosts'!$A:$A,0),2)","v":"Large Commercial Aircraft"},"Boeing",1,"Boeing 777X","Boeing 777X: 777-8","777X: 777-8","777X: 777-8",{"$f":"MATCH(\"*\"&F132&\"*\",Sheet1!C:C,0)","v":{"$error":"#N/A"}},{"$f":"MATCH(\"*\"&H132&\"*\",Sheet1!C:C,0)","v":{"$error":"#N/A"}},{"$f":"MATCH(\"*\"&I132&\"*\",Sheet1!B:B,0)","v":{"$error":"#N/A"}},410.2,null,"https://www.statista.com/statistics/273941/prices-of-boeing-aircraft-by-type/",{"$f":"INDEX('[2]Pt1-AvionicsComponentCosts'!$A:$NE,MATCH(B132,'[2]Pt1-AvionicsComponentCosts'!$A:$A,0),MATCH(\"END MARKER\",'[2]Pt1-AvionicsComponentCosts'!$11:$11,0))","v":2530676.0447999998},{"$f":"50%","v":0.5},{"$f":"50%","v":0.5},3.0846855738664063E-2]
[null,204,{"$f":"INDEX('[1]Pt1-AvionicsComponentCosts'!$A:$B,MATCH(B133,'[1]Pt1-AvionicsComponentCosts'!$A:$A,0),2)","v":"Large Commercial Aircraft"},"Boeing",1,"Boeing 777X","Boeing 777X: 777-9","777X: 777-9","777X: 777-9",{"$f":"MATCH(\"*\"&F133&\"*\",Sheet1!C:C,0)","v":{"$error":"#N/A"}},{"$f":"MATCH(\"*\"&H133&\"*\",Sheet1!C:C,0)","v":{"$error":"#N/A"}},{"$f":"MATCH(\"*\"&I133&\"*\",Sheet1!B:B,0)","v":{"$error":"#N/A"}},442.2,null,"https://www.statista.com/statistics/273941/prices-of-boeing-aircraft-by-type/",{"$f":"INDEX('[2]Pt1-AvionicsComponentCosts'!$A:$NE,MATCH(B133,'[2]Pt1-AvionicsComponentCosts'!$A:$A,0),MATCH(\"END MARKER\",'[2]Pt1-AvionicsComponentCosts'!$11:$11,0))","v":2505129.5520000001},{"$f":"50%","v":0.5},{"$f":"50%","v":0.5},2.8325752510176393E-2]
[null,200,{"$f":"INDEX('[1]Pt1-AvionicsComponentCosts'!$A:$B,MATCH(B134,'[1]Pt1-AvionicsComponentCosts'!$A:$A,0),2)","v":"Large Commercial Aircraft"},"Boeing",1,"Boeing 787","Boeing 787 Dreamliner: 787-10","787 Dreamliner: 787-10","787-10",{"$f":"MATCH(\"*\"&F134&\"*\",Sheet1!C:C,0)","v":{"$error":"#N/A"}},{"$f":"MATCH(\"*\"&H134&\"*\",Sheet1!C:C,0)","v":{"$error":"#N/A"}},{"$f":"MATCH(\"*\"&I134&\"*\",Sheet1!B:B,0)","v":36},{"$f":"INDEX(Sheet1!$A:$K,MATCH($I134,Sheet1!$B:$B,0),MATCH(M$1,Sheet1!$A$1:$K$1,0))","v":338.4},null,{"$f":"INDEX(Sheet1!$A:$K,MATCH($I134,Sheet1!$B:$B,0),MATCH(O$1,Sheet1!$A$1:$K$1,0))","v":"http://www.axonaviation.com/commercial-aircraft/aircraft-data/aircraft-pricing"},{"$f":"INDEX('[2]Pt1-AvionicsComponentCosts'!$A:$NE,MATCH(B134,'[2]Pt1-AvionicsComponentCosts'!$A:$A,0),MATCH(\"END MARKER\",'[2]Pt1-AvionicsComponentCosts'!$11:$11,0))","v":2640587.6352000004},{"$f":"50%","v":0.5},{"$f":"50%","v":0.5},3.9015774751773057E-2]
[null,198,{"$f":"INDEX('[1]Pt1-AvionicsComponentCosts'!$A:$B,MATCH(B135,'[1]Pt1-AvionicsComponentCosts'!$A:$A,0),2)","v":"Large Commercial Aircraft"},"Boeing",1,"Boeing 787","Boeing 787 Dreamliner: 787-8","787 Dreamliner: 787-8","787-8",{"$f":"MATCH(\"*\"&F135&\"*\",Sheet1!C:C,0)","v":{"$error":"#N/A"}},{"$f":"MATCH(\"*\"&H135&\"*\",Sheet1!C:C,0)","v":{"$error":"#N/A"}},{"$f":"MATCH(\"*\"&I135&\"*\",Sheet1!B:B,0)","v":34},{"$f":"INDEX(Sheet1!$A:$K,MATCH($I135,Sheet1!$B:$B,0),MATCH(M$1,Sheet1!$A$1:$K$1,0))","v":248.3},null,{"$f":"INDEX(Sheet1!$A:$K,MATCH($I135,Sheet1!$B:$B,0),MATCH(O$1,Sheet1!$A$1:$K$1,0))","v":"http://www.axonaviation.com/commercial-aircraft/aircraft-data/aircraft-pricing"},{"$f":"INDEX('[2]Pt1-AvionicsComponentCosts'!$A:$NE,MATCH(B135,'[2]Pt1-AvionicsComponentCosts'!$A:$A,0),MATCH(\"END MARKER\",'[2]Pt1-AvionicsComponentCosts'!$11:$11,0))","v":2640587.6352000004},{"$f":"50%","v":0.5},{"$f":"50%","v":0.5},5.3173331357229167E-2]
[null,199,{"$f":"INDEX('[1]Pt1-AvionicsComponentCosts'!$A:$B,MATCH(B136,'[1]Pt1-AvionicsComponentCosts'!$A:$A,0),2)","v":"Large Commercial Aircraft"},"Boeing",1,"Boeing 787","Boeing 787 Dreamliner: 787-9","787 Dreamliner: 787-9","787-9",{"$f":"MATCH(\"*\"&F136&\"*\",Sheet1!C:C,0)","v":{"$error":"#N/A"}},{"$f":"MATCH(\"*\"&H136&\"*\",Sheet1!C:C,0)","v":{"$error":"#N/A"}},{"$f":"MATCH(\"*\"&I136&\"*\",Sheet1!B:B,0)","v":35},{"$f":"INDEX(Sheet1!$A:$K,MATCH($I136,Sheet1!$B:$B,0),MATCH(M$1,Sheet1!$A$1:$K$1,0))","v":292.5},null,{"$f":"INDEX(Sheet1!$A:$K,MATCH($I136,Sheet1!$B:$B,0),MATCH(O$1,Sheet1!$A$1:$K$1,0))","v":"http://www.axonaviation.com/commercial-aircraft/aircraft-data/aircraft-pricing"},{"$f":"INDEX('[2]Pt1-AvionicsComponentCosts'!$A:$NE,MATCH(B136,'[2]Pt1-AvionicsComponentCosts'!$A:$A,0),MATCH(\"END MARKER\",'[2]Pt1-AvionicsComponentCosts'!$11:$11,0))","v":2640587.6352000004},{"$f":"50%","v":0.5},{"$f":"50%","v":0.5},4.5138250174358983E-2]
[null,530,{"$f":"INDEX('[1]Pt1-AvionicsComponentCosts'!$A:$B,MATCH(B137,'[1]Pt1-AvionicsComponentCosts'!$A:$A,0),2)","v":"Large Commercial Aircraft"},"Boeing",1,"Boeing 747","Boeing 747-400","747-400","747-400",{"$f":"MATCH(\"*\"&F137&\"*\",Sheet1!C:C,0)","v":{"$error":"#N/A"}},{"$f":"MATCH(\"*\"&H137&\"*\",Sheet1!C:C,0)","v":{"$error":"#N/A"}},{"$f":"MATCH(\"*\"&I137&\"*\",Sheet1!B:B,0)","v":23},{"$f":"INDEX(Sheet1!$A:$K,MATCH($I137,Sheet1!$B:$B,0),MATCH(M$1,Sheet1!$A$1:$K$1,0))","v":0},"OOP",{"$f":"INDEX(Sheet1!$A:$K,MATCH($I137,Sheet1!$B:$B,0),MATCH(O$1,Sheet1!$A$1:$K$1,0))","v":"http://www.axonaviation.com/commercial-aircraft/aircraft-data/aircraft-pricing"},{"$f":"INDEX('[2]Pt1-AvionicsComponentCosts'!$A:$NE,MATCH(B137,'[2]Pt1-AvionicsComponentCosts'!$A:$A,0),MATCH(\"END MARKER\",'[2]Pt1-AvionicsComponentCosts'!$11:$11,0))","v":2070474.2896000003},{"$f":"50%","v":0.5},{"$f":"50%","v":0.5},""]
[null,16,{"$f":"INDEX('[1]Pt1-AvionicsComponentCosts'!$A:$B,MATCH(B138,'[1]Pt1-AvionicsComponentCosts'!$A:$A,0),2)","v":"Large Commercial Aircraft"},"Boeing",1,"Boeing 747","Boeing 747-8I","747-8I","747-8I",{"$f":"MATCH(\"*\"&F138&\"*\",Sheet1!C:C,0)","v":{"$error":"#N/A"}},{"$f":"MATCH(\"*\"&H138&\"*\",Sheet1!C:C,0)","v":{"$error":"#N/A"}},{"$f":"MATCH(\"*\"&I138&\"*\",Sheet1!B:B,0)","v":25},{"$f":"INDEX(Sheet1!$A:$K,MATCH($I138,Sheet1!$B:$B,0),MATCH(M$1,Sheet1!$A$1:$K$1,0))","v":418.4},null,{"$f":"INDEX(Sheet1!$A:$K,MATCH($I138,Sheet1!$B:$B,0),MATCH(O$1,Sheet1!$A$1:$K$1,0))","v":"http://www.axonaviation.com/commercial-aircraft/aircraft-data/aircraft-pricing"},{"$f":"INDEX('[2]Pt1-AvionicsComponentCosts'!$A:$NE,MATCH(B138,'[2]Pt1-AvionicsComponentCosts'!$A:$A,0),MATCH(\"END MARKER\",'[2]Pt1-AvionicsComponentCosts'!$11:$11,0))","v":2730133.9967999998},{"$f":"50%","v":0.5},{"$f":"50%","v":0.5},3.2625884282982791E-2]
[null,636,{"$f":"INDEX('[1]Pt1-AvionicsComponentCosts'!$A:$B,MATCH(B139,'[1]Pt1-AvionicsComponentCosts'!$A:$A,0),2)","v":"Military Transport / Special Mission"},"Boeing",1,"B-52 Stratofortress","Boeing B-52 Stratofortress","B-52 Stratofortress","B-52 Stratofortress",{"$f":"MATCH(\"*\"&F139&\"*\",Sheet1!C:C,0)","v":{"$error":"#N/A"}},{"$f":"MATCH(\"*\"&H139&\"*\",Sheet1!C:C,0)","v":{"$error":"#N/A"}},{"$f":"MATCH(\"*\"&I139&\"*\",Sheet1!B:B,0)","v":{"$error":"#N/A"}},null,null,null,{"$f":"INDEX('[2]Pt1-AvionicsComponentCosts'!$A:$NE,MATCH(B139,'[2]Pt1-AvionicsComponentCosts'!$A:$A,0),MATCH(\"END MARKER\",'[2]Pt1-AvionicsComponentCosts'!$11:$11,0))","v":3079069.4173821267},1,1,""]
[null,676,{"$f":"INDEX('[1]Pt1-AvionicsComponentCosts'!$A:$B,MATCH(B140,'[1]Pt1-AvionicsComponentCosts'!$A:$A,0),2)","v":"Military Transport / Special Mission"},"Boeing",1,"B-52 Stratofortress","Boeing B-52 Stratofortress re-engine","B-52 Stratofortress re-engine","B-52 Stratofortress re-engine",{"$f":"MATCH(\"*\"&F140&\"*\",Sheet1!C:C,0)","v":{"$error":"#N/A"}},{"$f":"MATCH(\"*\"&H140&\"*\",Sheet1!C:C,0)","v":{"$error":"#N/A"}},{"$f":"MATCH(\"*\"&I140&\"*\",Sheet1!B:B,0)","v":{"$error":"#N/A"}},null,null,null,{"$f":"INDEX('[2]Pt1-AvionicsComponentCosts'!$A:$NE,MATCH(B140,'[2]Pt1-AvionicsComponentCosts'!$A:$A,0),MATCH(\"END MARKER\",'[2]Pt1-AvionicsComponentCosts'!$11:$11,0))","v":3079069.4173821267},1,1,""]
[null,157,{"$f":"INDEX('[1]Pt1-AvionicsComponentCosts'!$A:$B,MATCH(B141,'[1]Pt1-AvionicsComponentCosts'!$A:$A,0),2)","v":"Military Transport / Special Mission"},"Boeing",1,"Boeing KC-46 Pegasus","Boeing KC-46 Pegasus","KC-46 Pegasus","KC-46 Pegasus",{"$f":"MATCH(\"*\"&F141&\"*\",Sheet1!C:C,0)","v":{"$error":"#N/A"}},{"$f":"MATCH(\"*\"&H141&\"*\",Sheet1!C:C,0)","v":{"$error":"#N/A"}},{"$f":"MATCH(\"*\"&I141&\"*\",Sheet1!B:B,0)","v":{"$error":"#N/A"}},220,null,"https://simpleflying.com/how-much-do-military-transport-aircraft-cost/",{"$f":"INDEX('[2]Pt1-AvionicsComponentCosts'!$A:$NE,MATCH(B141,'[2]Pt1-AvionicsComponentCosts'!$A:$A,0),MATCH(\"END MARKER\",'[2]Pt1-AvionicsComponentCosts'!$11:$11,0))","v":3443006.9131769435},1,1,0.15650031423531563]
[null,156,{"$f":"INDEX('[1]Pt1-AvionicsComponentCosts'!$A:$B,MATCH(B142,'[1]Pt1-AvionicsComponentCosts'!$A:$A,0),2)","v":"Military Transport / Special Mission"},"Boeing",1,"Boeing P-8 Poseidon","Boeing P-8 Poseidon","P-8 Poseidon","P-8 Poseidon",{"$f":"MATCH(\"*\"&F142&\"*\",Sheet1!C:C,0)","v":{"$error":"#N/A"}},{"$f":"MATCH(\"*\"&H142&\"*\",Sheet1!C:C,0)","v":{"$error":"#N/A"}},{"$f":"MATCH(\"*\"&I142&\"*\",Sheet1!B:B,0)","v":{"$error":"#N/A"}},null,null,null,{"$f":"INDEX('[2]Pt1-AvionicsComponentCosts'!$A:$NE,MATCH(B142,'[2]Pt1-AvionicsComponentCosts'!$A:$A,0),MATCH(\"END MARKER\",'[2]Pt1-AvionicsComponentCosts'!$11:$11,0))","v":3079069.4173821267},1,1,""]
[null,158,{"$f":"INDEX('[1]Pt1-AvionicsComponentCosts'!$A:$B,MATCH(B143,'[1]Pt1-AvionicsComponentCosts'!$A:$A,0),2)","v":"Military Transport / Special Mission"},"Boeing",1,"C-17","Boeing C-17 Globemaster III","C-17 Globemaster III","C-17 Globemaster III",{"$f":"MATCH(\"*\"&F143&\"*\",Sheet1!C:C,0)","v":{"$error":"#N/A"}},{"$f":"MATCH(\"*\"&H143&\"*\",Sheet1!C:C,0)","v":{"$error":"#N/A"}},{"$f":"MATCH(\"*\"&I143&\"*\",Sheet1!B:B,0)","v":{"$error":"#N/A"}},null,null,null,{"$f":"INDEX('[2]Pt1-AvionicsComponentCosts'!$A:$NE,MATCH(B143,'[2]Pt1-AvionicsComponentCosts'!$A:$A,0),MATCH(\"END MARKER\",'[2]Pt1-AvionicsComponentCosts'!$11:$11,0))","v":3438674.3211951349},1,1,""]
[null,574,{"$f":"INDEX('[1]Pt1-AvionicsComponentCosts'!$A:$B,MATCH(B144,'[1]Pt1-AvionicsComponentCosts'!$A:$A,0),2)","v":"Military Transport / Special Mission"},"Boeing",1,"Boeing C-40 Clipper ","Boeing C-40 Clipper","C-40 Clipper","C-40 Clipper",{"$f":"MATCH(\"*\"&F144&\"*\",Sheet1!C:C,0)","v":{"$error":"#N/A"}},{"$f":"MATCH(\"*\"&H144&\"*\",Sheet1!C:C,0)","v":{"$error":"#N/A"}},{"$f":"MATCH(\"*\"&I144&\"*\",Sheet1!B:B,0)","v":{"$error":"#N/A"}},null,null,null,{"$f":"INDEX('[2]Pt1-AvionicsComponentCosts'!$A:$NE,MATCH(B144,'[2]Pt1-AvionicsComponentCosts'!$A:$A,0),MATCH(\"END MARKER\",'[2]Pt1-AvionicsComponentCosts'!$11:$11,0))","v":3079069.4173821267},1,1,""]
[null,620,{"$f":"INDEX('[1]Pt1-AvionicsComponentCosts'!$A:$B,MATCH(B145,'[1]Pt1-AvionicsComponentCosts'!$A:$A,0),2)","v":"Military Transport / Special Mission"},"Boeing",1,"Boeing KC-135 Stratotanker","Boeing KC-135 Stratotanker","KC-135 Stratotanker","KC-135 Stratotanker",{"$f":"MATCH(\"*\"&F145&\"*\",Sheet1!C:C,0)","v":{"$error":"#N/A"}},{"$f":"MATCH(\"*\"&H145&\"*\",Sheet1!C:C,0)","v":{"$error":"#N/A"}},{"$f":"MATCH(\"*\"&I145&\"*\",Sheet1!B:B,0)","v":{"$error":"#N/A"}},null,null,null,{"$f":"INDEX('[2]Pt1-AvionicsComponentCosts'!$A:$NE,MATCH(B145,'[2]Pt1-AvionicsComponentCosts'!$A:$A,0),MATCH(\"END MARKER\",'[2]Pt1-AvionicsComponentCosts'!$11:$11,0))","v":3438674.3211951349},1,1,""]
[null,582,{"$f":"INDEX('[1]Pt1-AvionicsComponentCosts'!$A:$B,MATCH(B146,'[1]Pt1-AvionicsComponentCosts'!$A:$A,0),2)","v":"Helicopter"},"Boeing/Leonardo",1,"MH139","Boeing/Leonardo MH139","MH139","MH139",{"$f":"MATCH(\"*\"&F146&\"*\",Sheet1!C:C,0)","v":{"$error":"#N/A"}},{"$f":"MATCH(\"*\"&H146&\"*\",Sheet1!C:C,0)","v":{"$error":"#N/A"}},{"$f":"MATCH(\"*\"&I146&\"*\",Sheet1!B:B,0)","v":{"$error":"#N/A"}},null,null,null,{"$f":"INDEX('[2]Pt1-AvionicsComponentCosts'!$A:$NE,MATCH(B146,'[2]Pt1-AvionicsComponentCosts'!$A:$A,0),MATCH(\"END MARKER\",'[2]Pt1-AvionicsComponentCosts'!$11:$11,0))","v":1306683.9033125332},0.99,0.99,""]
[null,35,{"$f":"INDEX('[1]Pt1-AvionicsComponentCosts'!$A:$B,MATCH(B147,'[1]Pt1-AvionicsComponentCosts'!$A:$A,0),2)","v":"Business Jet"},"Bombardier",1,"Challenger 600 series","Bombardier Challenger 600 series","Challenger 600 series","Challenger 600 series",{"$f":"MATCH(\"*\"&F147&\"*\",Sheet1!C:C,0)","v":{"$error":"#N/A"}},{"$f":"MATCH(\"*\"&H147&\"*\",Sheet1!C:C,0)","v":{"$error":"#N/A"}},{"$f":"MATCH(\"*\"&I147&\"*\",Sheet1!B:B,0)","v":{"$error":"#N/A"}},{"$f":"INDEX('Bombardier Prices'!A:D,MATCH(I147,'Bombardier Prices'!D:D,0),2)","v":31.9},null,"https://www.wijet.com/bombardier-private-jet-price-list/#google_vignette",{"$f":"INDEX('[2]Pt1-AvionicsComponentCosts'!$A:$NE,MATCH(B147,'[2]Pt1-AvionicsComponentCosts'!$A:$A,0),MATCH(\"END MARKER\",'[2]Pt1-AvionicsComponentCosts'!$11:$11,0))","v":1152968},0.75,0.75,0.27107398119122256]
[null,635,{"$f":"INDEX('[1]Pt1-AvionicsComponentCosts'!$A:$B,MATCH(B148,'[1]Pt1-AvionicsComponentCosts'!$A:$A,0),2)","v":"Business Jet"},"Bombardier",1,"Challenger 600 series","Bombardier Challenger 6XX series","Challenger 6XX series","Challenger 6XX series",{"$f":"MATCH(\"*\"&F148&\"*\",Sheet1!C:C,0)","v":{"$error":"#N/A"}},{"$f":"MATCH(\"*\"&H148&\"*\",Sheet1!C:C,0)","v":{"$error":"#N/A"}},{"$f":"MATCH(\"*\"&I148&\"*\",Sheet1!B:B,0)","v":{"$error":"#N/A"}},{"$f":"INDEX('Bombardier Prices'!A:D,MATCH(I148,'Bombardier Prices'!D:D,0),2)","v":31.9},null,"https://www.wijet.com/bombardier-private-jet-price-list/#google_vignette",{"$f":"INDEX('[2]Pt1-AvionicsComponentCosts'!$A:$NE,MATCH(B148,'[2]Pt1-AvionicsComponentCosts'!$A:$A,0),MATCH(\"END MARKER\",'[2]Pt1-AvionicsComponentCosts'!$11:$11,0))","v":1162915.4543999999},0.75,0.75,0.27341272438871472]
[null,72,{"$f":"INDEX('[1]Pt1-AvionicsComponentCosts'!$A:$B,MATCH(B149,'[1]Pt1-AvionicsComponentCosts'!$A:$A,0),2)","v":"Business Jet"},"Bombardier",1,"Challenger 850","Bombardier Challenger 850","Challenger 850","Challenger 850",{"$f":"MATCH(\"*\"&F149&\"*\",Sheet1!C:C,0)","v":{"$error":"#N/A"}},{"$f":"MATCH(\"*\"&H149&\"*\",Sheet1!C:C,0)","v":{"$error":"#N/A"}},{"$f":"MATCH(\"*\"&I149&\"*\",Sheet1!B:B,0)","v":{"$error":"#N/A"}},{"$f":"INDEX('Bombardier Prices'!A:D,MATCH(I149,'Bombardier Prices'!D:D,0),2)","v":39.9},null,"https://www.wijet.com/bombardier-private-jet-price-list/#google_vignette",{"$f":"INDEX('[2]Pt1-AvionicsComponentCosts'!$A:$NE,MATCH(B149,'[2]Pt1-AvionicsComponentCosts'!$A:$A,0),MATCH(\"END MARKER\",'[2]Pt1-AvionicsComponentCosts'!$11:$11,0))","v":1152968},0.75,0.75,0.21672330827067671]
[null,38,{"$f":"INDEX('[1]Pt1-AvionicsComponentCosts'!$A:$B,MATCH(B150,'[1]Pt1-AvionicsComponentCosts'!$A:$A,0),2)","v":"Business Jet"},"Bombardier",1,"Global 7000","Bombardier Global 7500/8000","Global 7500/8000","Global 7500/8000",{"$f":"MATCH(\"*\"&F150&\"*\",Sheet1!C:C,0)","v":{"$error":"#N/A"}},{"$f":"MATCH(\"*\"&H150&\"*\",Sheet1!C:C,0)","v":{"$error":"#N/A"}},{"$f":"MATCH(\"*\"&I150&\"*\",Sheet1!B:B,0)","v":{"$error":"#N/A"}},80,null,"https://infogram.com/bca-table-2023-jets-ultra-long-range-1ho16vorwrqkx4n",{"$f":"INDEX('[2]Pt1-AvionicsComponentCosts'!$A:$NE,MATCH(B150,'[2]Pt1-AvionicsComponentCosts'!$A:$A,0),MATCH(\"END MARKER\",'[2]Pt1-AvionicsComponentCosts'!$11:$11,0))","v":1234971},0.75,0.75,0.11577853125000001]
[null,36,{"$f":"INDEX('[1]Pt1-AvionicsComponentCosts'!$A:$B,MATCH(B151,'[1]Pt1-AvionicsComponentCosts'!$A:$A,0),2)","v":"Business Jet"},"Bombardier",1,"Global Express - 5000/6000","Bombardier Global 5000","Global 5000","Global 5000",{"$f":"MATCH(\"*\"&F151&\"*\",Sheet1!C:C,0)","v":{"$error":"#N/A"}},{"$f":"MATCH(\"*\"&H151&\"*\",Sheet1!C:C,0)","v":{"$error":"#N/A"}},{"$f":"MATCH(\"*\"&I151&\"*\",Sheet1!B:B,0)","v":{"$error":"#N/A"}},{"$f":"INDEX('Bombardier Prices'!A:D,MATCH(I151,'Bombardier Prices'!D:D,0),2)","v":46},null,"https://www.wijet.com/bombardier-private-jet-price-list/#google_vignette",{"$f":"INDEX('[2]Pt1-AvionicsComponentCosts'!$A:$NE,MATCH(B151,'[2]Pt1-AvionicsComponentCosts'!$A:$A,0),MATCH(\"END MARKER\",'[2]Pt1-AvionicsComponentCosts'!$11:$11,0))","v":1234971},0.75,0.75,0.20135396739130434]
[null,576,{"$f":"INDEX('[1]Pt1-AvionicsComponentCosts'!$A:$B,MATCH(B152,'[1]Pt1-AvionicsComponentCosts'!$A:$A,0),2)","v":"Business Jet"},"Bombardier",1,"Global Express - 5000/6000","Bombardier Global 5500","Global 5500","Global 5500",{"$f":"MATCH(\"*\"&F152&\"*\",Sheet1!C:C,0)","v":{"$error":"#N/A"}},{"$f":"MATCH(\"*\"&H152&\"*\",Sheet1!C:C,0)","v":{"$error":"#N/A"}},{"$f":"MATCH(\"*\"&I152&\"*\",Sheet1!B:B,0)","v":{"$error":"#N/A"}},{"$f":"INDEX('Bombardier Prices'!A:D,MATCH(I152,'Bombardier Prices'!D:D,0),2)","v":46},null,"https://www.wijet.com/bombardier-private-jet-price-list/#google_vignette",{"$f":"INDEX('[2]Pt1-AvionicsComponentCosts'!$A:$NE,MATCH(B152,'[2]Pt1-AvionicsComponentCosts'!$A:$A,0),MATCH(\"END MARKER\",'[2]Pt1-AvionicsComponentCosts'!$11:$11,0))","v":1234971},0.75,0.75,0.20135396739130434]
[null,37,{"$f":"INDEX('[1]Pt1-AvionicsComponentCosts'!$A:$B,MATCH(B153,'[1]Pt1-AvionicsComponentCosts'!$A:$A,0),2)","v":"Business Jet"},"Bombardier",1,"Global Express - 5000/6000","Bombardier Global 6000","Global 6000","Global 6000",{"$f":"MATCH(\"*\"&F153&\"*\",Sheet1!C:C,0)","v":{"$error":"#N/A"}},{"$f":"MATCH(\"*\"&H153&\"*\",Sheet1!C:C,0)","v":{"$error":"#N/A"}},{"$f":"MATCH(\"*\"&I153&\"*\",Sheet1!B:B,0)","v":{"$error":"#N/A"}},{"$f":"INDEX('Bombardier Prices'!A:D,MATCH(I153,'Bombardier Prices'!D:D,0),2)","v":55.8},null,"https://www.wijet.com/bombardier-private-jet-price-list/#google_vignette",{"$f":"INDEX('[2]Pt1-AvionicsComponentCosts'!$A:$NE,MATCH(B153,'[2]Pt1-AvionicsComponentCosts'!$A:$A,0),MATCH(\"END MARKER\",'[2]Pt1-AvionicsComponentCosts'!$11:$11,0))","v":1234971},0.75,0.75,0.16599072580645163]
[null,577,{"$f":"INDEX('[1]Pt1-AvionicsComponentCosts'!$A:$B,MATCH(B154,'[1]Pt1-AvionicsComponentCosts'!$A:$A,0),2)","v":"Business Jet"},"Bombardier",1,"Global Express - 5000/6000","Bombardier Global 6500","Global 6500","Global 6500",{"$f":"MATCH(\"*\"&F154&\"*\",Sheet1!C:C,0)","v":{"$error":"#N/A"}},{"$f":"MATCH(\"*\"&H154&\"*\",Sheet1!C:C,0)","v":{"$error":"#N/A"}},{"$f":"MATCH(\"*\"&I154&\"*\",Sheet1!B:B,0)","v":{"$error":"#N/A"}},58,null,"https://infogram.com/bca-table-2023-jets-ultra-long-range-1ho16vorwrqkx4n",{"$f":"INDEX('[2]Pt1-AvionicsComponentCosts'!$A:$NE,MATCH(B154,'[2]Pt1-AvionicsComponentCosts'!$A:$A,0),MATCH(\"END MARKER\",'[2]Pt1-AvionicsComponentCosts'!$11:$11,0))","v":1234971},0.75,0.75,0.15969452586206898]
[null,34,{"$f":"INDEX('[1]Pt1-AvionicsComponentCosts'!$A:$B,MATCH(B155,'[1]Pt1-AvionicsComponentCosts'!$A:$A,0),2)","v":"Business Jet"},"Bombardier",1,"Bombardier Challenger 300/350","Bombardier Challenger 300/350","Challenger 300/350","Challenger 300/350",{"$f":"MATCH(\"*\"&F155&\"*\",Sheet1!C:C,0)","v":{"$error":"#N/A"}},{"$f":"MATCH(\"*\"&H155&\"*\",Sheet1!C:C,0)","v":{"$error":"#N/A"}},{"$f":"MATCH(\"*\"&I155&\"*\",Sheet1!B:B,0)","v":{"$error":"#N/A"}},{"$f":"INDEX('Bombardier Prices'!A:D,MATCH(I155,'Bombardier Prices'!D:D,0),2)","v":14},null,"https://www.wijet.com/bombardier-private-jet-price-list/#google_vignette",{"$f":"INDEX('[2]Pt1-AvionicsComponentCosts'!$A:$NE,MATCH(B155,'[2]Pt1-AvionicsComponentCosts'!$A:$A,0),MATCH(\"END MARKER\",'[2]Pt1-AvionicsComponentCosts'!$11:$11,0))","v":750683.22080000001},0.75,0.75,0.40215172542857147]
[null,649,{"$f":"INDEX('[1]Pt1-AvionicsComponentCosts'!$A:$B,MATCH(B156,'[1]Pt1-AvionicsComponentCosts'!$A:$A,0),2)","v":"Business Jet"},"Bombardier",1,"Bombardier Challenger 3500","Bombardier Challenger 3500","Challenger 3500","Challenger 3500",{"$f":"MATCH(\"*\"&F156&\"*\",Sheet1!C:C,0)","v":{"$error":"#N/A"}},{"$f":"MATCH(\"*\"&H156&\"*\",Sheet1!C:C,0)","v":{"$error":"#N/A"}},{"$f":"MATCH(\"*\"&I156&\"*\",Sheet1!B:B,0)","v":{"$error":"#N/A"}},{"$f":"INDEX('Bombardier Prices'!A:D,MATCH(I156,'Bombardier Prices'!D:D,0),2)","v":14.9},null,"https://www.wijet.com/bombardier-private-jet-price-list/#google_vignette",{"$f":"INDEX('[2]Pt1-AvionicsComponentCosts'!$A:$NE,MATCH(B156,'[2]Pt1-AvionicsComponentCosts'!$A:$A,0),MATCH(\"END MARKER\",'[2]Pt1-AvionicsComponentCosts'!$11:$11,0))","v":750683.22080000001},0.75,0.75,0.37786068161073827]
[null,618,{"$f":"INDEX('[1]Pt1-AvionicsComponentCosts'!$A:$B,MATCH(B157,'[1]Pt1-AvionicsComponentCosts'!$A:$A,0),2)","v":"Regional"},"Bombardier",1,"Bombardier CRJ","Bombardier CRJ200","CRJ200","CRJ200",{"$f":"MATCH(\"*\"&F157&\"*\",Sheet1!C:C,0)","v":{"$error":"#N/A"}},{"$f":"MATCH(\"*\"&H157&\"*\",Sheet1!C:C,0)","v":{"$error":"#N/A"}},{"$f":"MATCH(\"*\"&I157&\"*\",Sheet1!B:B,0)","v":38},null,null,null,{"$f":"INDEX('[2]Pt1-AvionicsComponentCosts'!$A:$NE,MATCH(B157,'[2]Pt1-AvionicsComponentCosts'!$A:$A,0),MATCH(\"END MARKER\",'[2]Pt1-AvionicsComponentCosts'!$11:$11,0))","v":1047576},0.65,0.65,""]
[null,220,{"$f":"INDEX('[1]Pt1-AvionicsComponentCosts'!$A:$B,MATCH(B158,'[1]Pt1-AvionicsComponentCosts'!$A:$A,0),2)","v":"Regional"},"Bombardier",1,"Bombardier CRJ","Bombardier CRJ700-1000","CRJ700-1000","CRJ700-1000",{"$f":"MATCH(\"*\"&F158&\"*\",Sheet1!C:C,0)","v":{"$error":"#N/A"}},{"$f":"MATCH(\"*\"&H158&\"*\",Sheet1!C:C,0)","v":{"$error":"#N/A"}},{"$f":"MATCH(\"*\"&I158&\"*\",Sheet1!B:B,0)","v":{"$error":"#N/A"}},null,null,null,{"$f":"INDEX('[2]Pt1-AvionicsComponentCosts'!$A:$NE,MATCH(B158,'[2]Pt1-AvionicsComponentCosts'!$A:$A,0),MATCH(\"END MARKER\",'[2]Pt1-AvionicsComponentCosts'!$11:$11,0))","v":1047576},0.65,0.65,""]
[null,218,{"$f":"INDEX('[1]Pt1-AvionicsComponentCosts'!$A:$B,MATCH(B159,'[1]Pt1-AvionicsComponentCosts'!$A:$A,0),2)","v":"Regional"},"Bombardier",1,"Bombardier CRJ","Bombardier CRJ700-700","CRJ700-700","CRJ700-700",{"$f":"MATCH(\"*\"&F159&\"*\",Sheet1!C:C,0)","v":{"$error":"#N/A"}},{"$f":"MATCH(\"*\"&H159&\"*\",Sheet1!C:C,0)","v":{"$error":"#N/A"}},{"$f":"MATCH(\"*\"&I159&\"*\",Sheet1!B:B,0)","v":{"$error":"#N/A"}},null,null,null,{"$f":"INDEX('[2]Pt1-AvionicsComponentCosts'!$A:$NE,MATCH(B159,'[2]Pt1-AvionicsComponentCosts'!$A:$A,0),MATCH(\"END MARKER\",'[2]Pt1-AvionicsComponentCosts'!$11:$11,0))","v":1047576},0.65,0.65,""]
[null,219,{"$f":"INDEX('[1]Pt1-AvionicsComponentCosts'!$A:$B,MATCH(B160,'[1]Pt1-AvionicsComponentCosts'!$A:$A,0),2)","v":"Regional"},"Bombardier",1,"Bombardier CRJ","Bombardier CRJ700-900","CRJ700-900","CRJ700-900",{"$f":"MATCH(\"*\"&F160&\"*\",Sheet1!C:C,0)","v":{"$error":"#N/A"}},{"$f":"MATCH(\"*\"&H160&\"*\",Sheet1!C:C,0)","v":{"$error":"#N/A"}},{"$f":"MATCH(\"*\"&I160&\"*\",Sheet1!B:B,0)","v":{"$error":"#N/A"}},null,null,null,{"$f":"INDEX('[2]Pt1-AvionicsComponentCosts'!$A:$NE,MATCH(B160,'[2]Pt1-AvionicsComponentCosts'!$A:$A,0),MATCH(\"END MARKER\",'[2]Pt1-AvionicsComponentCosts'!$11:$11,0))","v":1047576},0.65,0.65,""]
[null,226,{"$f":"INDEX('[1]Pt1-AvionicsComponentCosts'!$A:$B,MATCH(B161,'[1]Pt1-AvionicsComponentCosts'!$A:$A,0),2)","v":"Turbine GA"},"Canadair",1,"Canadair CL-415","Canadair CL-415","CL-415","CL-415",{"$f":"MATCH(\"*\"&F161&\"*\",Sheet1!C:C,0)","v":{"$error":"#N/A"}},{"$f":"MATCH(\"*\"&H161&\"*\",Sheet1!C:C,0)","v":{"$error":"#N/A"}},{"$f":"MATCH(\"*\"&I161&\"*\",Sheet1!B:B,0)","v":{"$error":"#N/A"}},36.9,"in 2014","https://en.wikipedia.org/wiki/Canadair_CL-415",{"$f":"INDEX('[2]Pt1-AvionicsComponentCosts'!$A:$NE,MATCH(B161,'[2]Pt1-AvionicsComponentCosts'!$A:$A,0),MATCH(\"END MARKER\",'[2]Pt1-AvionicsComponentCosts'!$11:$11,0))","v":1018270.4815999999},1,1,0.27595406005420053]
[null,152,{"$f":"INDEX('[1]Pt1-AvionicsComponentCosts'!$A:$B,MATCH(B162,'[1]Pt1-AvionicsComponentCosts'!$A:$A,0),2)","v":"Military Transport / Special Mission"},"CASA",1,"CASA C-212 Aviocar","CASA C-212 Aviocar","C-212 Aviocar","C-212 Aviocar",{"$f":"MATCH(\"*\"&F162&\"*\",Sheet1!C:C,0)","v":{"$error":"#N/A"}},{"$f":"MATCH(\"*\"&H162&\"*\",Sheet1!C:C,0)","v":{"$error":"#N/A"}},{"$f":"MATCH(\"*\"&I162&\"*\",Sheet1!B:B,0)","v":{"$error":"#N/A"}},null,null,null,{"$f":"INDEX('[2]Pt1-AvionicsComponentCosts'!$A:$NE,MATCH(B162,'[2]Pt1-AvionicsComponentCosts'!$A:$A,0),MATCH(\"END MARKER\",'[2]Pt1-AvionicsComponentCosts'!$11:$11,0))","v":3311485.3995951349},1,1,""]
[null,153,{"$f":"INDEX('[1]Pt1-AvionicsComponentCosts'!$A:$B,MATCH(B163,'[1]Pt1-AvionicsComponentCosts'!$A:$A,0),2)","v":"Military Transport / Special Mission"},"CASA/IPTN",1,"CASA/IPTN CN-235","CASA/IPTN CN-235","CN-235","CN-235",{"$f":"MATCH(\"*\"&F163&\"*\",Sheet1!C:C,0)","v":{"$error":"#N/A"}},{"$f":"MATCH(\"*\"&H163&\"*\",Sheet1!C:C,0)","v":{"$error":"#N/A"}},{"$f":"MATCH(\"*\"&I163&\"*\",Sheet1!B:B,0)","v":{"$error":"#N/A"}},null,null,null,{"$f":"INDEX('[2]Pt1-AvionicsComponentCosts'!$A:$NE,MATCH(B163,'[2]Pt1-AvionicsComponentCosts'!$A:$A,0),MATCH(\"END MARKER\",'[2]Pt1-AvionicsComponentCosts'!$11:$11,0))","v":3356205.7419951349},1,1,""]
[null,48,{"$f":"INDEX('[1]Pt1-AvionicsComponentCosts'!$A:$B,MATCH(B164,'[1]Pt1-AvionicsComponentCosts'!$A:$A,0),2)","v":"Business Jet"},"Cessna",1,"Citation Hemisphere","Cessna Citation Hemisphere","Citation Hemisphere","Citation Hemisphere",{"$f":"MATCH(\"*\"&F164&\"*\",Sheet1!C:C,0)","v":{"$error":"#N/A"}},{"$f":"MATCH(\"*\"&H164&\"*\",Sheet1!C:C,0)","v":{"$error":"#N/A"}},{"$f":"MATCH(\"*\"&I164&\"*\",Sheet1!B:B,0)","v":{"$error":"#N/A"}},null,null,null,{"$f":"INDEX('[2]Pt1-AvionicsComponentCosts'!$A:$NE,MATCH(B164,'[2]Pt1-AvionicsComponentCosts'!$A:$A,0),MATCH(\"END MARKER\",'[2]Pt1-AvionicsComponentCosts'!$11:$11,0))","v":1152968},0.75,0.75,""]
[null,47,{"$f":"INDEX('[1]Pt1-AvionicsComponentCosts'!$A:$B,MATCH(B165,'[1]Pt1-AvionicsComponentCosts'!$A:$A,0),2)","v":"Business Jet"},"Cessna",1,"Citation Longitude","Cessna Citation Longitude","Citation Longitude","Citation Longitude",{"$f":"MATCH(\"*\"&F165&\"*\",Sheet1!C:C,0)","v":{"$error":"#N/A"}},{"$f":"MATCH(\"*\"&H165&\"*\",Sheet1!C:C,0)","v":{"$error":"#N/A"}},{"$f":"MATCH(\"*\"&I165&\"*\",Sheet1!B:B,0)","v":{"$error":"#N/A"}},29.9,null,"https://aviationweek.com/business-aviation/aircraft-propulsion/20twenty-longitude-cessnas-super-mid-flagship",{"$f":"INDEX('[2]Pt1-AvionicsComponentCosts'!$A:$NE,MATCH(B165,'[2]Pt1-AvionicsComponentCosts'!$A:$A,0),MATCH(\"END MARKER\",'[2]Pt1-AvionicsComponentCosts'!$11:$11,0))","v":1152968},0.75,0.75,0.28920602006688961]
[null,42,{"$f":"INDEX('[1]Pt1-AvionicsComponentCosts'!$A:$B,MATCH(B166,'[1]Pt1-AvionicsComponentCosts'!$A:$A,0),2)","v":"Business Jet"},"Cessna",1,"Citation CJ3","Cessna Citation CJ3","Citation CJ3","Citation CJ3",{"$f":"MATCH(\"*\"&F166&\"*\",Sheet1!C:C,0)","v":{"$error":"#N/A"}},{"$f":"MATCH(\"*\"&H166&\"*\",Sheet1!C:C,0)","v":{"$error":"#N/A"}},{"$f":"MATCH(\"*\"&I166&\"*\",Sheet1!B:B,0)","v":{"$error":"#N/A"}},null,null,null,{"$f":"INDEX('[2]Pt1-AvionicsComponentCosts'!$A:$NE,MATCH(B166,'[2]Pt1-AvionicsComponentCosts'!$A:$A,0),MATCH(\"END MARKER\",'[2]Pt1-AvionicsComponentCosts'!$11:$11,0))","v":491403.80480000004},0.75,0.75,""]
[null,43,{"$f":"INDEX('[1]Pt1-AvionicsComponentCosts'!$A:$B,MATCH(B167,'[1]Pt1-AvionicsComponentCosts'!$A:$A,0),2)","v":"Business Jet"},"Cessna",1,"Citation CJ4","Cessna Citation CJ4","Citation CJ4","Citation CJ4",{"$f":"MATCH(\"*\"&F167&\"*\",Sheet1!C:C,0)","v":{"$error":"#N/A"}},{"$f":"MATCH(\"*\"&H167&\"*\",Sheet1!C:C,0)","v":{"$error":"#N/A"}},{"$f":"MATCH(\"*\"&I167&\"*\",Sheet1!B:B,0)","v":{"$error":"#N/A"}},9.1999999999999993,null,"https://www.bjtonline.com/aircraft/cessna-citation-cj4",{"$f":"INDEX('[2]Pt1-AvionicsComponentCosts'!$A:$NE,MATCH(B167,'[2]Pt1-AvionicsComponentCosts'!$A:$A,0),MATCH(\"END MARKER\",'[2]Pt1-AvionicsComponentCosts'!$11:$11,0))","v":491403.80480000004},0.75,0.75,0.40060092782608703]
[null,39,{"$f":"INDEX('[1]Pt1-AvionicsComponentCosts'!$A:$B,MATCH(B168,'[1]Pt1-AvionicsComponentCosts'!$A:$A,0),2)","v":"Business Jet"},"Cessna",1,"Citation V","Cessna Citation Encore","Citation Encore","Citation Encore",{"$f":"MATCH(\"*\"&F168&\"*\",Sheet1!C:C,0)","v":{"$error":"#N/A"}},{"$f":"MATCH(\"*\"&H168&\"*\",Sheet1!C:C,0)","v":{"$error":"#N/A"}},{"$f":"MATCH(\"*\"&I168&\"*\",Sheet1!B:B,0)","v":{"$error":"#N/A"}},null,null,null,{"$f":"INDEX('[2]Pt1-AvionicsComponentCosts'!$A:$NE,MATCH(B168,'[2]Pt1-AvionicsComponentCosts'!$A:$A,0),MATCH(\"END MARKER\",'[2]Pt1-AvionicsComponentCosts'!$11:$11,0))","v":491403.80480000004},0.75,0.75,""]
[null,46,{"$f":"INDEX('[1]Pt1-AvionicsComponentCosts'!$A:$B,MATCH(B169,'[1]Pt1-AvionicsComponentCosts'!$A:$A,0),2)","v":"Business Jet"},"Cessna",1,"Citation Latitude","Cessna Citation Latitude","Citation Latitude","Citation Latitude",{"$f":"MATCH(\"*\"&F169&\"*\",Sheet1!C:C,0)","v":{"$error":"#N/A"}},{"$f":"MATCH(\"*\"&H169&\"*\",Sheet1!C:C,0)","v":{"$error":"#N/A"}},{"$f":"MATCH(\"*\"&I169&\"*\",Sheet1!B:B,0)","v":{"$error":"#N/A"}},20,null,"https://www.avbuyer.com/articles/private-jet-price-guides/cessna-citation-latitude-price-guide-112581#price-guide-full-dtl",{"$f":"INDEX('[2]Pt1-AvionicsComponentCosts'!$A:$NE,MATCH(B169,'[2]Pt1-AvionicsComponentCosts'!$A:$A,0),MATCH(\"END MARKER\",'[2]Pt1-AvionicsComponentCosts'!$11:$11,0))","v":743469.54080000008},0.75,0.75,0.27880107780000002]
[null,45,{"$f":"INDEX('[1]Pt1-AvionicsComponentCosts'!$A:$B,MATCH(B170,'[1]Pt1-AvionicsComponentCosts'!$A:$A,0),2)","v":"Business Jet"},"Cessna",1,"Citation Sovereign","Cessna Citation Sovereign","Citation Sovereign","Citation Sovereign",{"$f":"MATCH(\"*\"&F170&\"*\",Sheet1!C:C,0)","v":{"$error":"#N/A"}},{"$f":"MATCH(\"*\"&H170&\"*\",Sheet1!C:C,0)","v":{"$error":"#N/A"}},{"$f":"MATCH(\"*\"&I170&\"*\",Sheet1!B:B,0)","v":{"$error":"#N/A"}},null,null,null,{"$f":"INDEX('[2]Pt1-AvionicsComponentCosts'!$A:$NE,MATCH(B170,'[2]Pt1-AvionicsComponentCosts'!$A:$A,0),MATCH(\"END MARKER\",'[2]Pt1-AvionicsComponentCosts'!$11:$11,0))","v":743469.54080000008},0.75,0.75,""]
[null,49,{"$f":"INDEX('[1]Pt1-AvionicsComponentCosts'!$A:$B,MATCH(B171,'[1]Pt1-AvionicsComponentCosts'!$A:$A,0),2)","v":"Business Jet"},"Cessna",1,"Citation X","Cessna Citation X","Citation X","Citation X",{"$f":"MATCH(\"*\"&F171&\"*\",Sheet1!C:C,0)","v":{"$error":"#N/A"}},{"$f":"MATCH(\"*\"&H171&\"*\",Sheet1!C:C,0)","v":{"$error":"#N/A"}},{"$f":"MATCH(\"*\"&I171&\"*\",Sheet1!B:B,0)","v":{"$error":"#N/A"}},null,null,null,{"$f":"INDEX('[2]Pt1-AvionicsComponentCosts'!$A:$NE,MATCH(B171,'[2]Pt1-AvionicsComponentCosts'!$A:$A,0),MATCH(\"END MARKER\",'[2]Pt1-AvionicsComponentCosts'!$11:$11,0))","v":743469.54080000008},0.75,0.75,""]
[null,40,{"$f":"INDEX('[1]Pt1-AvionicsComponentCosts'!$A:$B,MATCH(B172,'[1]Pt1-AvionicsComponentCosts'!$A:$A,0),2)","v":"Business Jet"},"Cessna",1,"Citation XLS","Cessna Citation XLS","Citation XLS","Citation XLS",{"$f":"MATCH(\"*\"&F172&\"*\",Sheet1!C:C,0)","v":{"$error":"#N/A"}},{"$f":"MATCH(\"*\"&H172&\"*\",Sheet1!C:C,0)","v":{"$error":"#N/A"}},{"$f":"MATCH(\"*\"&I172&\"*\",Sheet1!B:B,0)","v":{"$error":"#N/A"}},null,null,null,{"$f":"INDEX('[2]Pt1-AvionicsComponentCosts'!$A:$NE,MATCH(B172,'[2]Pt1-AvionicsComponentCosts'!$A:$A,0),MATCH(\"END MARKER\",'[2]Pt1-AvionicsComponentCosts'!$11:$11,0))","v":743469.54080000008},0.75,0.75,""]
[null,41,{"$f":"INDEX('[1]Pt1-AvionicsComponentCosts'!$A:$B,MATCH(B173,'[1]Pt1-AvionicsComponentCosts'!$A:$A,0),2)","v":"Business Jet"},"Cessna",1,"Citation M2","Cessna Citation M2","Citation M2","Citation M2",{"$f":"MATCH(\"*\"&F173&\"*\",Sheet1!C:C,0)","v":{"$error":"#N/A"}},{"$f":"MATCH(\"*\"&H173&\"*\",Sheet1!C:C,0)","v":{"$error":"#N/A"}},{"$f":"MATCH(\"*\"&I173&\"*\",Sheet1!B:B,0)","v":{"$error":"#N/A"}},4.7,null,"https://www.bjtonline.com/aircraft/cessna-citation-m2",{"$f":"INDEX('[2]Pt1-AvionicsComponentCosts'!$A:$NE,MATCH(B173,'[2]Pt1-AvionicsComponentCosts'!$A:$A,0),MATCH(\"END MARKER\",'[2]Pt1-AvionicsComponentCosts'!$11:$11,0))","v":226255.33600000004},0.75,0.75,0.36104574893617031]
[null,44,{"$f":"INDEX('[1]Pt1-AvionicsComponentCosts'!$A:$B,MATCH(B174,'[1]Pt1-AvionicsComponentCosts'!$A:$A,0),2)","v":"Business Jet"},"Cessna",1,"Citation Mustang","Cessna Citation Mustang","Citation Mustang","Citation Mustang",{"$f":"MATCH(\"*\"&F174&\"*\",Sheet1!C:C,0)","v":{"$error":"#N/A"}},{"$f":"MATCH(\"*\"&H174&\"*\",Sheet1!C:C,0)","v":{"$error":"#N/A"}},{"$f":"MATCH(\"*\"&I174&\"*\",Sheet1!B:B,0)","v":{"$error":"#N/A"}},null,null,null,{"$f":"INDEX('[2]Pt1-AvionicsComponentCosts'!$A:$NE,MATCH(B174,'[2]Pt1-AvionicsComponentCosts'!$A:$A,0),MATCH(\"END MARKER\",'[2]Pt1-AvionicsComponentCosts'!$11:$11,0))","v":226255.33600000004},0.75,0.75,""]
[null,82,{"$f":"INDEX('[1]Pt1-AvionicsComponentCosts'!$A:$B,MATCH(B175,'[1]Pt1-AvionicsComponentCosts'!$A:$A,0),2)","v":"Turbine GA"},"Cessna",1,"Cessna 208 Caravan","Cessna 208 Caravan","208 Caravan","208 Caravan",{"$f":"MATCH(\"*\"&F175&\"*\",Sheet1!C:C,0)","v":{"$error":"#N/A"}},{"$f":"MATCH(\"*\"&H175&\"*\",Sheet1!C:C,0)","v":{"$error":"#N/A"}},{"$f":"MATCH(\"*\"&I175&\"*\",Sheet1!B:B,0)","v":{"$error":"#N/A"}},2.6,null,"https://www.bjtonline.com/aircraft/cessna-208b-grand-caravan-ex",{"$f":"INDEX('[2]Pt1-AvionicsComponentCosts'!$A:$NE,MATCH(B175,'[2]Pt1-AvionicsComponentCosts'!$A:$A,0),MATCH(\"END MARKER\",'[2]Pt1-AvionicsComponentCosts'!$11:$11,0))","v":224112.54079999996},1,1,0.86197131076923061]
[null,308,{"$f":"INDEX('[1]Pt1-AvionicsComponentCosts'!$A:$B,MATCH(B176,'[1]Pt1-AvionicsComponentCosts'!$A:$A,0),2)","v":"Turbine GA"},"Cessna",1,"Cessna 408 SkyCourier","Cessna 408 SkyCourier","408 SkyCourier","408 SkyCourier",{"$f":"MATCH(\"*\"&F176&\"*\",Sheet1!C:C,0)","v":{"$error":"#N/A"}},{"$f":"MATCH(\"*\"&H176&\"*\",Sheet1!C:C,0)","v":{"$error":"#N/A"}},{"$f":"MATCH(\"*\"&I176&\"*\",Sheet1!B:B,0)","v":{"$error":"#N/A"}},5.5,null,"https://www.bjtonline.com/business-jet-news/cessna-408-skycourier",{"$f":"INDEX('[2]Pt1-AvionicsComponentCosts'!$A:$NE,MATCH(B176,'[2]Pt1-AvionicsComponentCosts'!$A:$A,0),MATCH(\"END MARKER\",'[2]Pt1-AvionicsComponentCosts'!$11:$11,0))","v":227116.56319999998},1,1,0.41293920581818178]
[null,81,{"$f":"INDEX('[1]Pt1-AvionicsComponentCosts'!$A:$B,MATCH(B177,'[1]Pt1-AvionicsComponentCosts'!$A:$A,0),2)","v":"Turbine GA"},"Cessna",1,"Cessna Denali","Cessna Denali","Denali","Denali",{"$f":"MATCH(\"*\"&F177&\"*\",Sheet1!C:C,0)","v":{"$error":"#N/A"}},{"$f":"MATCH(\"*\"&H177&\"*\",Sheet1!C:C,0)","v":{"$error":"#N/A"}},{"$f":"MATCH(\"*\"&I177&\"*\",Sheet1!B:B,0)","v":{"$error":"#N/A"}},6.4,null,"https://www.aircharteradvisors.com/beechcraft-denali/",{"$f":"INDEX('[2]Pt1-AvionicsComponentCosts'!$A:$NE,MATCH(B177,'[2]Pt1-AvionicsComponentCosts'!$A:$A,0),MATCH(\"END MARKER\",'[2]Pt1-AvionicsComponentCosts'!$11:$11,0))","v":239259.03200000001},1,1,0.37384223750000001]
[null,550,{"$f":"INDEX('[1]Pt1-AvionicsComponentCosts'!$A:$B,MATCH(B178,'[1]Pt1-AvionicsComponentCosts'!$A:$A,0),2)","v":"Business Jet"},"Cirrus",1,"Cirrus Vision Jet SF50","Cirrus Vision Jet SF50","Vision Jet SF50","Vision Jet SF50",{"$f":"MATCH(\"*\"&F178&\"*\",Sheet1!C:C,0)","v":{"$error":"#N/A"}},{"$f":"MATCH(\"*\"&H178&\"*\",Sheet1!C:C,0)","v":{"$error":"#N/A"}},{"$f":"MATCH(\"*\"&I178&\"*\",Sheet1!B:B,0)","v":{"$error":"#N/A"}},null,null,null,{"$f":"INDEX('[2]Pt1-AvionicsComponentCosts'!$A:$NE,MATCH(B178,'[2]Pt1-AvionicsComponentCosts'!$A:$A,0),MATCH(\"END MARKER\",'[2]Pt1-AvionicsComponentCosts'!$11:$11,0))","v":226255.33600000004},0.75,0.75,""]
[null,18,{"$f":"INDEX('[1]Pt1-AvionicsComponentCosts'!$A:$B,MATCH(B179,'[1]Pt1-AvionicsComponentCosts'!$A:$A,0),2)","v":"Large Commercial Aircraft"},"Comac",1,"Comac C919","Comac C919","C919","C919",{"$f":"MATCH(\"*\"&F179&\"*\",Sheet1!C:C,0)","v":{"$error":"#N/A"}},{"$f":"MATCH(\"*\"&H179&\"*\",Sheet1!C:C,0)","v":{"$error":"#N/A"}},{"$f":"MATCH(\"*\"&I179&\"*\",Sheet1!B:B,0)","v":{"$error":"#N/A"}},null,null,null,{"$f":"INDEX('[2]Pt1-AvionicsComponentCosts'!$A:$NE,MATCH(B179,'[2]Pt1-AvionicsComponentCosts'!$A:$A,0),MATCH(\"END MARKER\",'[2]Pt1-AvionicsComponentCosts'!$11:$11,0))","v":1564558},{"$f":"50%","v":0.5},{"$f":"50%","v":0.5},""]
[null,27,{"$f":"INDEX('[1]Pt1-AvionicsComponentCosts'!$A:$B,MATCH(B180,'[1]Pt1-AvionicsComponentCosts'!$A:$A,0),2)","v":"Regional"},"Comac",1,"Comac ARJ21","Comac ARJ21","ARJ21","ARJ21",{"$f":"MATCH(\"*\"&F180&\"*\",Sheet1!C:C,0)","v":{"$error":"#N/A"}},{"$f":"MATCH(\"*\"&H180&\"*\",Sheet1!C:C,0)","v":{"$error":"#N/A"}},{"$f":"MATCH(\"*\"&I180&\"*\",Sheet1!B:B,0)","v":{"$error":"#N/A"}},null,null,null,{"$f":"INDEX('[2]Pt1-AvionicsComponentCosts'!$A:$NE,MATCH(B180,'[2]Pt1-AvionicsComponentCosts'!$A:$A,0),MATCH(\"END MARKER\",'[2]Pt1-AvionicsComponentCosts'!$11:$11,0))","v":1105909},0.65,0.65,""]
[null,587,{"$f":"INDEX('[1]Pt1-AvionicsComponentCosts'!$A:$B,MATCH(B181,'[1]Pt1-AvionicsComponentCosts'!$A:$A,0),2)","v":"Business Jet"},"Dassault",1,"Falcon 10X","Dassault Falcon 10X","Falcon 10X","Falcon 10X",{"$f":"MATCH(\"*\"&F181&\"*\",Sheet1!C:C,0)","v":{"$error":"#N/A"}},{"$f":"MATCH(\"*\"&H181&\"*\",Sheet1!C:C,0)","v":{"$error":"#N/A"}},{"$f":"MATCH(\"*\"&I181&\"*\",Sheet1!B:B,0)","v":{"$error":"#N/A"}},null,null,null,{"$f":"INDEX('[2]Pt1-AvionicsComponentCosts'!$A:$NE,MATCH(B181,'[2]Pt1-AvionicsComponentCosts'!$A:$A,0),MATCH(\"END MARKER\",'[2]Pt1-AvionicsComponentCosts'!$11:$11,0))","v":1244918.4543999999},0.75,0.75,""]
[null,51,{"$f":"INDEX('[1]Pt1-AvionicsComponentCosts'!$A:$B,MATCH(B182,'[1]Pt1-AvionicsComponentCosts'!$A:$A,0),2)","v":"Business Jet"},"Dassault",1,"Falcon 6X","Dassault Falcon 6X","Falcon 6X","Falcon 6X",{"$f":"MATCH(\"*\"&F182&\"*\",Sheet1!C:C,0)","v":{"$error":"#N/A"}},{"$f":"MATCH(\"*\"&H182&\"*\",Sheet1!C:C,0)","v":{"$error":"#N/A"}},{"$f":"MATCH(\"*\"&I182&\"*\",Sheet1!B:B,0)","v":{"$error":"#N/A"}},null,null,null,{"$f":"INDEX('[2]Pt1-AvionicsComponentCosts'!$A:$NE,MATCH(B182,'[2]Pt1-AvionicsComponentCosts'!$A:$A,0),MATCH(\"END MARKER\",'[2]Pt1-AvionicsComponentCosts'!$11:$11,0))","v":1234971},0.75,0.75,""]
[null,54,{"$f":"INDEX('[1]Pt1-AvionicsComponentCosts'!$A:$B,MATCH(B183,'[1]Pt1-AvionicsComponentCosts'!$A:$A,0),2)","v":"Business Jet"},"Dassault",1,"Falcon 7X/8X","Dassault Falcon 7X/8X","Falcon 7X/8X","Falcon 7X/8X",{"$f":"MATCH(\"*\"&F183&\"*\",Sheet1!C:C,0)","v":{"$error":"#N/A"}},{"$f":"MATCH(\"*\"&H183&\"*\",Sheet1!C:C,0)","v":{"$error":"#N/A"}},{"$f":"MATCH(\"*\"&I183&\"*\",Sheet1!B:B,0)","v":{"$error":"#N/A"}},63.8,null,"https://infogram.com/bca-table-2023-jets-ultra-long-range-1ho16vorwrqkx4n",{"$f":"INDEX('[2]Pt1-AvionicsComponentCosts'!$A:$NE,MATCH(B183,'[2]Pt1-AvionicsComponentCosts'!$A:$A,0),MATCH(\"END MARKER\",'[2]Pt1-AvionicsComponentCosts'!$11:$11,0))","v":1234971},0.75,0.75,0.14517684169278997]
[null,50,{"$f":"INDEX('[1]Pt1-AvionicsComponentCosts'!$A:$B,MATCH(B184,'[1]Pt1-AvionicsComponentCosts'!$A:$A,0),2)","v":"Business Jet"},"Dassault",1,"Falcon 900","Dassault Falcon 900","Falcon 900","Falcon 900",{"$f":"MATCH(\"*\"&F184&\"*\",Sheet1!C:C,0)","v":{"$error":"#N/A"}},{"$f":"MATCH(\"*\"&H184&\"*\",Sheet1!C:C,0)","v":{"$error":"#N/A"}},{"$f":"MATCH(\"*\"&I184&\"*\",Sheet1!B:B,0)","v":{"$error":"#N/A"}},null,null,null,{"$f":"INDEX('[2]Pt1-AvionicsComponentCosts'!$A:$NE,MATCH(B184,'[2]Pt1-AvionicsComponentCosts'!$A:$A,0),MATCH(\"END MARKER\",'[2]Pt1-AvionicsComponentCosts'!$11:$11,0))","v":1234971},0.75,0.75,""]
[null,53,{"$f":"INDEX('[1]Pt1-AvionicsComponentCosts'!$A:$B,MATCH(B185,'[1]Pt1-AvionicsComponentCosts'!$A:$A,0),2)","v":"Business Jet"},"Dassault",1,"Falcon 2000","Dassault Falcon 2000","Falcon 2000","Falcon 2000",{"$f":"MATCH(\"*\"&F185&\"*\",Sheet1!C:C,0)","v":{"$error":"#N/A"}},{"$f":"MATCH(\"*\"&H185&\"*\",Sheet1!C:C,0)","v":{"$error":"#N/A"}},{"$f":"MATCH(\"*\"&I185&\"*\",Sheet1!B:B,0)","v":{"$error":"#N/A"}},null,null,null,{"$f":"INDEX('[2]Pt1-AvionicsComponentCosts'!$A:$NE,MATCH(B185,'[2]Pt1-AvionicsComponentCosts'!$A:$A,0),MATCH(\"END MARKER\",'[2]Pt1-AvionicsComponentCosts'!$11:$11,0))","v":832686.22080000001},0.75,0.75,""]
[null,640,{"$f":"INDEX('[1]Pt1-AvionicsComponentCosts'!$A:$B,MATCH(B186,'[1]Pt1-AvionicsComponentCosts'!$A:$A,0),2)","v":"Business Jet"},"Dassault",1,"Falcon 2X","Dassault Falcon 2X","Falcon 2X","Falcon 2X",{"$f":"MATCH(\"*\"&F186&\"*\",Sheet1!C:C,0)","v":{"$error":"#N/A"}},{"$f":"MATCH(\"*\"&H186&\"*\",Sheet1!C:C,0)","v":{"$error":"#N/A"}},{"$f":"MATCH(\"*\"&I186&\"*\",Sheet1!B:B,0)","v":{"$error":"#N/A"}},null,null,null,{"$f":"INDEX('[2]Pt1-AvionicsComponentCosts'!$A:$NE,MATCH(B186,'[2]Pt1-AvionicsComponentCosts'!$A:$A,0),MATCH(\"END MARKER\",'[2]Pt1-AvionicsComponentCosts'!$11:$11,0))","v":750683.22080000001},0.75,0.75,""]
[null,141,{"$f":"INDEX('[1]Pt1-AvionicsComponentCosts'!$A:$B,MATCH(B187,'[1]Pt1-AvionicsComponentCosts'!$A:$A,0),2)","v":"Fighters and Jet Trainers"},"Dassault",1,"Dassault Rafale","Dassault Rafale","Rafale","Rafale",{"$f":"MATCH(\"*\"&F187&\"*\",Sheet1!C:C,0)","v":{"$error":"#N/A"}},{"$f":"MATCH(\"*\"&H187&\"*\",Sheet1!C:C,0)","v":{"$error":"#N/A"}},{"$f":"MATCH(\"*\"&I187&\"*\",Sheet1!B:B,0)","v":{"$error":"#N/A"}},null,null,null,{"$f":"INDEX('[2]Pt1-AvionicsComponentCosts'!$A:$NE,MATCH(B187,'[2]Pt1-AvionicsComponentCosts'!$A:$A,0),MATCH(\"END MARKER\",'[2]Pt1-AvionicsComponentCosts'!$11:$11,0))","v":3000575.599975463},1,1,""]
[null,621,{"$f":"INDEX('[1]Pt1-AvionicsComponentCosts'!$A:$B,MATCH(B188,'[1]Pt1-AvionicsComponentCosts'!$A:$A,0),2)","v":"Regional"},"De Havilland Canada",1,"De Havilland Canada DHC-8","De Havilland Canada DHC-8-100","DHC-8-100","DHC-8-100",{"$f":"MATCH(\"*\"&F188&\"*\",Sheet1!C:C,0)","v":{"$error":"#N/A"}},{"$f":"MATCH(\"*\"&H188&\"*\",Sheet1!C:C,0)","v":{"$error":"#N/A"}},{"$f":"MATCH(\"*\"&I188&\"*\",Sheet1!B:B,0)","v":{"$error":"#N/A"}},12.5,null,"https://www.modernairliners.com/bombardier-dhc-dash-8",{"$f":"INDEX('[2]Pt1-AvionicsComponentCosts'!$A:$NE,MATCH(B188,'[2]Pt1-AvionicsComponentCosts'!$A:$A,0),MATCH(\"END MARKER\",'[2]Pt1-AvionicsComponentCosts'!$11:$11,0))","v":1040302.4448000001},0.65,0.65,0.54095727129600002]
[null,622,{"$f":"INDEX('[1]Pt1-AvionicsComponentCosts'!$A:$B,MATCH(B189,'[1]Pt1-AvionicsComponentCosts'!$A:$A,0),2)","v":"Regional"},"De Havilland Canada",1,"De Havilland Canada DHC-8","De Havilland Canada DHC-8-200","DHC-8-200","DHC-8-200",{"$f":"MATCH(\"*\"&F189&\"*\",Sheet1!C:C,0)","v":{"$error":"#N/A"}},{"$f":"MATCH(\"*\"&H189&\"*\",Sheet1!C:C,0)","v":{"$error":"#N/A"}},{"$f":"MATCH(\"*\"&I189&\"*\",Sheet1!B:B,0)","v":{"$error":"#N/A"}},13,null,"https://www.modernairliners.com/bombardier-dhc-dash-8",{"$f":"INDEX('[2]Pt1-AvionicsComponentCosts'!$A:$NE,MATCH(B189,'[2]Pt1-AvionicsComponentCosts'!$A:$A,0),MATCH(\"END MARKER\",'[2]Pt1-AvionicsComponentCosts'!$11:$11,0))","v":1040302.4448000001},0.65,0.65,0.52015122240000011]
[null,623,{"$f":"INDEX('[1]Pt1-AvionicsComponentCosts'!$A:$B,MATCH(B190,'[1]Pt1-AvionicsComponentCosts'!$A:$A,0),2)","v":"Regional"},"De Havilland Canada",1,"De Havilland Canada DHC-8","De Havilland Canada DHC-8-300","DHC-8-300","DHC-8-300",{"$f":"MATCH(\"*\"&F190&\"*\",Sheet1!C:C,0)","v":{"$error":"#N/A"}},{"$f":"MATCH(\"*\"&H190&\"*\",Sheet1!C:C,0)","v":{"$error":"#N/A"}},{"$f":"MATCH(\"*\"&I190&\"*\",Sheet1!B:B,0)","v":{"$error":"#N/A"}},17,null,"https://www.modernairliners.com/bombardier-dhc-dash-8",{"$f":"INDEX('[2]Pt1-AvionicsComponentCosts'!$A:$NE,MATCH(B190,'[2]Pt1-AvionicsComponentCosts'!$A:$A,0),MATCH(\"END MARKER\",'[2]Pt1-AvionicsComponentCosts'!$11:$11,0))","v":1040302.4448000001},0.65,0.65,0.39776269948235293]
[null,21,{"$f":"INDEX('[1]Pt1-AvionicsComponentCosts'!$A:$B,MATCH(B191,'[1]Pt1-AvionicsComponentCosts'!$A:$A,0),2)","v":"Regional"},"De Havilland Canada",1,"De Havilland Canada DHC-8","De Havilland Canada DHC-8-400","DHC-8-400","DHC-8-400",{"$f":"MATCH(\"*\"&F191&\"*\",Sheet1!C:C,0)","v":{"$error":"#N/A"}},{"$f":"MATCH(\"*\"&H191&\"*\",Sheet1!C:C,0)","v":{"$error":"#N/A"}},{"$f":"MATCH(\"*\"&I191&\"*\",Sheet1!B:B,0)","v":{"$error":"#N/A"}},27,null,"https://www.modernairliners.com/bombardier-dhc-dash-8",{"$f":"INDEX('[2]Pt1-AvionicsComponentCosts'!$A:$NE,MATCH(B191,'[2]Pt1-AvionicsComponentCosts'!$A:$A,0),MATCH(\"END MARKER\",'[2]Pt1-AvionicsComponentCosts'!$11:$11,0))","v":1040302.4448000001},0.65,0.65,0.25044318115555558]
[null,624,{"$f":"INDEX('[1]Pt1-AvionicsComponentCosts'!$A:$B,MATCH(B192,'[1]Pt1-AvionicsComponentCosts'!$A:$A,0),2)","v":"Regional"},"Dornier",1,"Dornier Do 328-100","Dornier Do 328-100","Do 328-100","Do 328-100",{"$f":"MATCH(\"*\"&F192&\"*\",Sheet1!C:C,0)","v":{"$error":"#N/A"}},{"$f":"MATCH(\"*\"&H192&\"*\",Sheet1!C:C,0)","v":{"$error":"#N/A"}},{"$f":"MATCH(\"*\"&I192&\"*\",Sheet1!B:B,0)","v":{"$error":"#N/A"}},null,null,null,{"$f":"INDEX('[2]Pt1-AvionicsComponentCosts'!$A:$NE,MATCH(B192,'[2]Pt1-AvionicsComponentCosts'!$A:$A,0),MATCH(\"END MARKER\",'[2]Pt1-AvionicsComponentCosts'!$11:$11,0))","v":1040302.4448000001},0.65,0.65,""]
[null,224,{"$f":"INDEX('[1]Pt1-AvionicsComponentCosts'!$A:$B,MATCH(B193,'[1]Pt1-AvionicsComponentCosts'!$A:$A,0),2)","v":"Turbine GA"},"Dornier",1,"Dornier Do 228","Dornier Do 228","Do 228","Do 228",{"$f":"MATCH(\"*\"&F193&\"*\",Sheet1!C:C,0)","v":{"$error":"#N/A"}},{"$f":"MATCH(\"*\"&H193&\"*\",Sheet1!C:C,0)","v":{"$error":"#N/A"}},{"$f":"MATCH(\"*\"&I193&\"*\",Sheet1!B:B,0)","v":{"$error":"#N/A"}},null,null,null,{"$f":"INDEX('[2]Pt1-AvionicsComponentCosts'!$A:$NE,MATCH(B193,'[2]Pt1-AvionicsComponentCosts'!$A:$A,0),MATCH(\"END MARKER\",'[2]Pt1-AvionicsComponentCosts'!$11:$11,0))","v":239259.03200000001},1,1,""]
[null,154,{"$f":"INDEX('[1]Pt1-AvionicsComponentCosts'!$A:$B,MATCH(B194,'[1]Pt1-AvionicsComponentCosts'!$A:$A,0),2)","v":"Military Transport / Special Mission"},"EADS",1,"EADS CASA C-295","EADS CASA C-295","CASA C-295","CASA C-295",{"$f":"MATCH(\"*\"&F194&\"*\",Sheet1!C:C,0)","v":{"$error":"#N/A"}},{"$f":"MATCH(\"*\"&H194&\"*\",Sheet1!C:C,0)","v":{"$error":"#N/A"}},{"$f":"MATCH(\"*\"&I194&\"*\",Sheet1!B:B,0)","v":{"$error":"#N/A"}},null,null,null,{"$f":"INDEX('[2]Pt1-AvionicsComponentCosts'!$A:$NE,MATCH(B194,'[2]Pt1-AvionicsComponentCosts'!$A:$A,0),MATCH(\"END MARKER\",'[2]Pt1-AvionicsComponentCosts'!$11:$11,0))","v":3357528.8091951348},1,1,""]
[null,70,{"$f":"INDEX('[1]Pt1-AvionicsComponentCosts'!$A:$B,MATCH(B195,'[1]Pt1-AvionicsComponentCosts'!$A:$A,0),2)","v":"Business Jet"},"Eclipse",1,"Eclipse 550","Eclipse 550",{"$f":"TRIM(SUBSTITUTE(G195,D195,\"\"))","v":"550"},{"$f":"TRIM(SUBSTITUTE(SUBSTITUTE(SUBSTITUTE(SUBSTITUTE(SUBSTITUTE(H195,\"Family\",\"\"),\"737 Classic:\",\"\"),\"737 MAX:\",\"\"),\"787 Dreamliner:\",\"\"),\"777:\",\"\"))","v":"550"},{"$f":"MATCH(\"*\"&F195&\"*\",Sheet1!C:C,0)","v":{"$error":"#N/A"}},{"$f":"MATCH(\"*\"&H195&\"*\",Sheet1!C:C,0)","v":{"$error":"#N/A"}},{"$f":"MATCH(\"*\"&I195&\"*\",Sheet1!B:B,0)","v":{"$error":"#N/A"}},null,null,null,{"$f":"INDEX('[2]Pt1-AvionicsComponentCosts'!$A:$NE,MATCH(B195,'[2]Pt1-AvionicsComponentCosts'!$A:$A,0),MATCH(\"END MARKER\",'[2]Pt1-AvionicsComponentCosts'!$11:$11,0))","v":226255.33600000004},0.75,0.75,{"$f":"IFERROR(P195/(M195*100000)*R195,\"\")","v":""}]
[null,74,{"$f":"INDEX('[1]Pt1-AvionicsComponentCosts'!$A:$B,MATCH(B196,'[1]Pt1-AvionicsComponentCosts'!$A:$A,0),2)","v":"Business Jet"},"Embraer",1,"Legacy 600/650","Embraer Legacy 600/650","Legacy 600/650","Legacy 600/650",{"$f":"MATCH(\"*\"&F196&\"*\",Sheet1!C:C,0)","v":{"$error":"#N/A"}},{"$f":"MATCH(\"*\"&H196&\"*\",Sheet1!C:C,0)","v":{"$error":"#N/A"}},{"$f":"MATCH(\"*\"&I196&\"*\",Sheet1!B:B,0)","v":{"$error":"#N/A"}},null,null,null,{"$f":"INDEX('[2]Pt1-AvionicsComponentCosts'!$A:$NE,MATCH(B196,'[2]Pt1-AvionicsComponentCosts'!$A:$A,0),MATCH(\"END MARKER\",'[2]Pt1-AvionicsComponentCosts'!$11:$11,0))","v":1152968},0.75,0.75,""]
[null,652,{"$f":"INDEX('[1]Pt1-AvionicsComponentCosts'!$A:$B,MATCH(B197,'[1]Pt1-AvionicsComponentCosts'!$A:$A,0),2)","v":"Business Jet"},"Embraer",1,"Legacy 700","Embraer legacy 700","legacy 700","legacy 700",{"$f":"MATCH(\"*\"&F197&\"*\",Sheet1!C:C,0)","v":{"$error":"#N/A"}},{"$f":"MATCH(\"*\"&H197&\"*\",Sheet1!C:C,0)","v":{"$error":"#N/A"}},{"$f":"MATCH(\"*\"&I197&\"*\",Sheet1!B:B,0)","v":{"$error":"#N/A"}},null,null,null,{"$f":"INDEX('[2]Pt1-AvionicsComponentCosts'!$A:$NE,MATCH(B197,'[2]Pt1-AvionicsComponentCosts'!$A:$A,0),MATCH(\"END MARKER\",'[2]Pt1-AvionicsComponentCosts'!$11:$11,0))","v":1152968},0.75,0.75,""]
[null,73,{"$f":"INDEX('[1]Pt1-AvionicsComponentCosts'!$A:$B,MATCH(B198,'[1]Pt1-AvionicsComponentCosts'!$A:$A,0),2)","v":"Business Jet"},"Embraer",1,"Lineage 1000","Embraer Lineage 1000","Lineage 1000","Lineage 1000",{"$f":"MATCH(\"*\"&F198&\"*\",Sheet1!C:C,0)","v":{"$error":"#N/A"}},{"$f":"MATCH(\"*\"&H198&\"*\",Sheet1!C:C,0)","v":{"$error":"#N/A"}},{"$f":"MATCH(\"*\"&I198&\"*\",Sheet1!B:B,0)","v":{"$error":"#N/A"}},53,null,"https://www.jetfinder.com/most-expensive-private-jets/",{"$f":"INDEX('[2]Pt1-AvionicsComponentCosts'!$A:$NE,MATCH(B198,'[2]Pt1-AvionicsComponentCosts'!$A:$A,0),MATCH(\"END MARKER\",'[2]Pt1-AvionicsComponentCosts'!$11:$11,0))","v":1157418},0.75,0.75,0.16378556603773584]
[null,56,{"$f":"INDEX('[1]Pt1-AvionicsComponentCosts'!$A:$B,MATCH(B199,'[1]Pt1-AvionicsComponentCosts'!$A:$A,0),2)","v":"Business Jet"},"Embraer",1,"Phenom 300","Embraer Phenom 300","Phenom 300","Phenom 300",{"$f":"MATCH(\"*\"&F199&\"*\",Sheet1!C:C,0)","v":{"$error":"#N/A"}},{"$f":"MATCH(\"*\"&H199&\"*\",Sheet1!C:C,0)","v":{"$error":"#N/A"}},{"$f":"MATCH(\"*\"&I199&\"*\",Sheet1!B:B,0)","v":{"$error":"#N/A"}},12,null,"https://privatejetcardcomparisons.com/aircraft/embraer/phenom-300/",{"$f":"INDEX('[2]Pt1-AvionicsComponentCosts'!$A:$NE,MATCH(B199,'[2]Pt1-AvionicsComponentCosts'!$A:$A,0),MATCH(\"END MARKER\",'[2]Pt1-AvionicsComponentCosts'!$11:$11,0))","v":491403.80480000004},0.75,0.75,0.30712737800000001]
[null,641,{"$f":"INDEX('[1]Pt1-AvionicsComponentCosts'!$A:$B,MATCH(B200,'[1]Pt1-AvionicsComponentCosts'!$A:$A,0),2)","v":"Business Jet"},"Embraer",1,"Phenom 300X","Embraer Phenom 300X","Phenom 300X","Phenom 300X",{"$f":"MATCH(\"*\"&F200&\"*\",Sheet1!C:C,0)","v":{"$error":"#N/A"}},{"$f":"MATCH(\"*\"&H200&\"*\",Sheet1!C:C,0)","v":{"$error":"#N/A"}},{"$f":"MATCH(\"*\"&I200&\"*\",Sheet1!B:B,0)","v":{"$error":"#N/A"}},null,null,null,{"$f":"INDEX('[2]Pt1-AvionicsComponentCosts'!$A:$NE,MATCH(B200,'[2]Pt1-AvionicsComponentCosts'!$A:$A,0),MATCH(\"END MARKER\",'[2]Pt1-AvionicsComponentCosts'!$11:$11,0))","v":491403.80480000004},0.75,0.75,""]
[null,57,{"$f":"INDEX('[1]Pt1-AvionicsComponentCosts'!$A:$B,MATCH(B201,'[1]Pt1-AvionicsComponentCosts'!$A:$A,0),2)","v":"Business Jet"},"Embraer",1,"Legacy 450/Praetor 500","Legacy 450/Praetor 500","Legacy 450/Praetor 500","Legacy 450/Praetor 500",{"$f":"MATCH(\"*\"&F201&\"*\",Sheet1!C:C,0)","v":{"$error":"#N/A"}},{"$f":"MATCH(\"*\"&H201&\"*\",Sheet1!C:C,0)","v":{"$error":"#N/A"}},{"$f":"MATCH(\"*\"&I201&\"*\",Sheet1!B:B,0)","v":{"$error":"#N/A"}},null,null,null,{"$f":"INDEX('[2]Pt1-AvionicsComponentCosts'!$A:$NE,MATCH(B201,'[2]Pt1-AvionicsComponentCosts'!$A:$A,0),MATCH(\"END MARKER\",'[2]Pt1-AvionicsComponentCosts'!$11:$11,0))","v":743469.54080000008},0.75,0.75,""]
[null,58,{"$f":"INDEX('[1]Pt1-AvionicsComponentCosts'!$A:$B,MATCH(B202,'[1]Pt1-AvionicsComponentCosts'!$A:$A,0),2)","v":"Business Jet"},"Embraer",1,"Legacy 500/Praetor 600","Legacy 500/Praetor 600","Legacy 500/Praetor 600","Legacy 500/Praetor 600",{"$f":"MATCH(\"*\"&F202&\"*\",Sheet1!C:C,0)","v":{"$error":"#N/A"}},{"$f":"MATCH(\"*\"&H202&\"*\",Sheet1!C:C,0)","v":{"$error":"#N/A"}},{"$f":"MATCH(\"*\"&I202&\"*\",Sheet1!B:B,0)","v":{"$error":"#N/A"}},20,null,"https://www.jetfinder.com/most-expensive-private-jets/",{"$f":"INDEX('[2]Pt1-AvionicsComponentCosts'!$A:$NE,MATCH(B202,'[2]Pt1-AvionicsComponentCosts'!$A:$A,0),MATCH(\"END MARKER\",'[2]Pt1-AvionicsComponentCosts'!$11:$11,0))","v":743469.54080000008},0.75,0.75,0.27880107780000002]
[null,55,{"$f":"INDEX('[1]Pt1-AvionicsComponentCosts'!$A:$B,MATCH(B203,'[1]Pt1-AvionicsComponentCosts'!$A:$A,0),2)","v":"Business Jet"},"Embraer",1,"Phenom 100","Embraer Phenom 100","Phenom 100","Phenom 100",{"$f":"MATCH(\"*\"&F203&\"*\",Sheet1!C:C,0)","v":{"$error":"#N/A"}},{"$f":"MATCH(\"*\"&H203&\"*\",Sheet1!C:C,0)","v":{"$error":"#N/A"}},{"$f":"MATCH(\"*\"&I203&\"*\",Sheet1!B:B,0)","v":{"$error":"#N/A"}},null,null,null,{"$f":"INDEX('[2]Pt1-AvionicsComponentCosts'!$A:$NE,MATCH(B203,'[2]Pt1-AvionicsComponentCosts'!$A:$A,0),MATCH(\"END MARKER\",'[2]Pt1-AvionicsComponentCosts'!$11:$11,0))","v":226255.33600000004},0.75,0.75,""]
[null,671,{"$f":"INDEX('[1]Pt1-AvionicsComponentCosts'!$A:$B,MATCH(B204,'[1]Pt1-AvionicsComponentCosts'!$A:$A,0),2)","v":"Freighter"},"Embraer",1,"Embraer E170/190","Embraer E190F (P2F)","E190F (P2F)","E190F (P2F)",{"$f":"MATCH(\"*\"&F204&\"*\",Sheet1!C:C,0)","v":{"$error":"#N/A"}},{"$f":"MATCH(\"*\"&H204&\"*\",Sheet1!C:C,0)","v":{"$error":"#N/A"}},{"$f":"MATCH(\"*\"&I204&\"*\",Sheet1!B:B,0)","v":{"$error":"#N/A"}},null,null,null,{"$f":"INDEX('[2]Pt1-AvionicsComponentCosts'!$A:$NE,MATCH(B204,'[2]Pt1-AvionicsComponentCosts'!$A:$A,0),MATCH(\"END MARKER\",'[2]Pt1-AvionicsComponentCosts'!$11:$11,0))","v":1054023.7007999998},0.5,0.5,""]
[null,672,{"$f":"INDEX('[1]Pt1-AvionicsComponentCosts'!$A:$B,MATCH(B205,'[1]Pt1-AvionicsComponentCosts'!$A:$A,0),2)","v":"Freighter"},"Embraer",1,"Embraer E170/190","Embraer E195F (P2F)","E195F (P2F)","E195F (P2F)",{"$f":"MATCH(\"*\"&F205&\"*\",Sheet1!C:C,0)","v":{"$error":"#N/A"}},{"$f":"MATCH(\"*\"&H205&\"*\",Sheet1!C:C,0)","v":{"$error":"#N/A"}},{"$f":"MATCH(\"*\"&I205&\"*\",Sheet1!B:B,0)","v":{"$error":"#N/A"}},null,null,null,{"$f":"INDEX('[2]Pt1-AvionicsComponentCosts'!$A:$NE,MATCH(B205,'[2]Pt1-AvionicsComponentCosts'!$A:$A,0),MATCH(\"END MARKER\",'[2]Pt1-AvionicsComponentCosts'!$11:$11,0))","v":1054023.7007999998},0.5,0.5,""]
[null,159,{"$f":"INDEX('[1]Pt1-AvionicsComponentCosts'!$A:$B,MATCH(B206,'[1]Pt1-AvionicsComponentCosts'!$A:$A,0),2)","v":"Military Transport / Special Mission"},"Embraer",1,"Embraer KC-390","Embraer KC-390","KC-390","KC-390",{"$f":"MATCH(\"*\"&F206&\"*\",Sheet1!C:C,0)","v":{"$error":"#N/A"}},{"$f":"MATCH(\"*\"&H206&\"*\",Sheet1!C:C,0)","v":{"$error":"#N/A"}},{"$f":"MATCH(\"*\"&I206&\"*\",Sheet1!B:B,0)","v":{"$error":"#N/A"}},null,null,null,{"$f":"INDEX('[2]Pt1-AvionicsComponentCosts'!$A:$NE,MATCH(B206,'[2]Pt1-AvionicsComponentCosts'!$A:$A,0),MATCH(\"END MARKER\",'[2]Pt1-AvionicsComponentCosts'!$11:$11,0))","v":3377363.6331951348},1,1,""]
[null,580,{"$f":"INDEX('[1]Pt1-AvionicsComponentCosts'!$A:$B,MATCH(B207,'[1]Pt1-AvionicsComponentCosts'!$A:$A,0),2)","v":"Regional"},"Embraer",1,"Embraer E170/190","Embraer E170","E170","E170",{"$f":"MATCH(\"*\"&F207&\"*\",Sheet1!C:C,0)","v":{"$error":"#N/A"}},{"$f":"MATCH(\"*\"&H207&\"*\",Sheet1!C:C,0)","v":{"$error":"#N/A"}},{"$f":"MATCH(\"*\"&I207&\"*\",Sheet1!B:B,0)","v":{"$error":"#N/A"}},46.3,null,"https://www.aeroflap.com.br/en/find-out-how-much-an-embraer-plane-and-jet-costs/",{"$f":"INDEX('[2]Pt1-AvionicsComponentCosts'!$A:$NE,MATCH(B207,'[2]Pt1-AvionicsComponentCosts'!$A:$A,0),MATCH(\"END MARKER\",'[2]Pt1-AvionicsComponentCosts'!$11:$11,0))","v":1105909},0.65,0.65,0.15525720302375809]
[null,22,{"$f":"INDEX('[1]Pt1-AvionicsComponentCosts'!$A:$B,MATCH(B208,'[1]Pt1-AvionicsComponentCosts'!$A:$A,0),2)","v":"Regional"},"Embraer",1,"Embraer E170/190","Embraer E175","E175","E175",{"$f":"MATCH(\"*\"&F208&\"*\",Sheet1!C:C,0)","v":{"$error":"#N/A"}},{"$f":"MATCH(\"*\"&H208&\"*\",Sheet1!C:C,0)","v":{"$error":"#N/A"}},{"$f":"MATCH(\"*\"&I208&\"*\",Sheet1!B:B,0)","v":{"$error":"#N/A"}},49.9,null,"https://www.aeroflap.com.br/en/find-out-how-much-an-embraer-plane-and-jet-costs/",{"$f":"INDEX('[2]Pt1-AvionicsComponentCosts'!$A:$NE,MATCH(B208,'[2]Pt1-AvionicsComponentCosts'!$A:$A,0),MATCH(\"END MARKER\",'[2]Pt1-AvionicsComponentCosts'!$11:$11,0))","v":1105909},0.65,0.65,0.14405628256513026]
[null,24,{"$f":"INDEX('[1]Pt1-AvionicsComponentCosts'!$A:$B,MATCH(B209,'[1]Pt1-AvionicsComponentCosts'!$A:$A,0),2)","v":"Regional"},"Embraer",1,"Embraer E170/190","Embraer E175-E2","E175-E2","E175-E2",{"$f":"MATCH(\"*\"&F209&\"*\",Sheet1!C:C,0)","v":{"$error":"#N/A"}},{"$f":"MATCH(\"*\"&H209&\"*\",Sheet1!C:C,0)","v":{"$error":"#N/A"}},{"$f":"MATCH(\"*\"&I209&\"*\",Sheet1!B:B,0)","v":{"$error":"#N/A"}},56.4,null,"https://www.aeroflap.com.br/en/find-out-how-much-an-embraer-plane-and-jet-costs/",{"$f":"INDEX('[2]Pt1-AvionicsComponentCosts'!$A:$NE,MATCH(B209,'[2]Pt1-AvionicsComponentCosts'!$A:$A,0),MATCH(\"END MARKER\",'[2]Pt1-AvionicsComponentCosts'!$11:$11,0))","v":1120559},0.65,0.65,0.12914243794326241]
[null,23,{"$f":"INDEX('[1]Pt1-AvionicsComponentCosts'!$A:$B,MATCH(B210,'[1]Pt1-AvionicsComponentCosts'!$A:$A,0),2)","v":"Regional"},"Embraer",1,"Embraer E170/190","Embraer E190","E190","E190",{"$f":"MATCH(\"*\"&F210&\"*\",Sheet1!C:C,0)","v":{"$error":"#N/A"}},{"$f":"MATCH(\"*\"&H210&\"*\",Sheet1!C:C,0)","v":{"$error":"#N/A"}},{"$f":"MATCH(\"*\"&I210&\"*\",Sheet1!B:B,0)","v":{"$error":"#N/A"}},55.3,null,"https://www.aeroflap.com.br/en/find-out-how-much-an-embraer-plane-and-jet-costs/",{"$f":"INDEX('[2]Pt1-AvionicsComponentCosts'!$A:$NE,MATCH(B210,'[2]Pt1-AvionicsComponentCosts'!$A:$A,0),MATCH(\"END MARKER\",'[2]Pt1-AvionicsComponentCosts'!$11:$11,0))","v":1105909},0.65,0.65,0.12998930379746837]
[null,25,{"$f":"INDEX('[1]Pt1-AvionicsComponentCosts'!$A:$B,MATCH(B211,'[1]Pt1-AvionicsComponentCosts'!$A:$A,0),2)","v":"Regional"},"Embraer",1,"Embraer E170/190","Embraer E190-E2","E190-E2","E190-E2",{"$f":"MATCH(\"*\"&F211&\"*\",Sheet1!C:C,0)","v":{"$error":"#N/A"}},{"$f":"MATCH(\"*\"&H211&\"*\",Sheet1!C:C,0)","v":{"$error":"#N/A"}},{"$f":"MATCH(\"*\"&I211&\"*\",Sheet1!B:B,0)","v":{"$error":"#N/A"}},64.599999999999994,null,"https://www.aeroflap.com.br/en/find-out-how-much-an-embraer-plane-and-jet-costs/",{"$f":"INDEX('[2]Pt1-AvionicsComponentCosts'!$A:$NE,MATCH(B211,'[2]Pt1-AvionicsComponentCosts'!$A:$A,0),MATCH(\"END MARKER\",'[2]Pt1-AvionicsComponentCosts'!$11:$11,0))","v":1105909},0.65,0.65,0.11127567337461303]
[null,558,{"$f":"INDEX('[1]Pt1-AvionicsComponentCosts'!$A:$B,MATCH(B212,'[1]Pt1-AvionicsComponentCosts'!$A:$A,0),2)","v":"Regional"},"Embraer",1,"Embraer E170/190","Embraer E195","E195","E195",{"$f":"MATCH(\"*\"&F212&\"*\",Sheet1!C:C,0)","v":{"$error":"#N/A"}},{"$f":"MATCH(\"*\"&H212&\"*\",Sheet1!C:C,0)","v":{"$error":"#N/A"}},{"$f":"MATCH(\"*\"&I212&\"*\",Sheet1!B:B,0)","v":{"$error":"#N/A"}},58.5,null,"https://www.aeroflap.com.br/en/find-out-how-much-an-embraer-plane-and-jet-costs/",{"$f":"INDEX('[2]Pt1-AvionicsComponentCosts'!$A:$NE,MATCH(B212,'[2]Pt1-AvionicsComponentCosts'!$A:$A,0),MATCH(\"END MARKER\",'[2]Pt1-AvionicsComponentCosts'!$11:$11,0))","v":1105909},0.65,0.65,0.12287877777777778]
[null,559,{"$f":"INDEX('[1]Pt1-AvionicsComponentCosts'!$A:$B,MATCH(B213,'[1]Pt1-AvionicsComponentCosts'!$A:$A,0),2)","v":"Regional"},"Embraer",1,"Embraer E170/190","Embraer E195-E2","E195-E2","E195-E2",{"$f":"MATCH(\"*\"&F213&\"*\",Sheet1!C:C,0)","v":{"$error":"#N/A"}},{"$f":"MATCH(\"*\"&H213&\"*\",Sheet1!C:C,0)","v":{"$error":"#N/A"}},{"$f":"MATCH(\"*\"&I213&\"*\",Sheet1!B:B,0)","v":{"$error":"#N/A"}},72.8,null,"https://www.aeroflap.com.br/en/find-out-how-much-an-embraer-plane-and-jet-costs/",{"$f":"INDEX('[2]Pt1-AvionicsComponentCosts'!$A:$NE,MATCH(B213,'[2]Pt1-AvionicsComponentCosts'!$A:$A,0),MATCH(\"END MARKER\",'[2]Pt1-AvionicsComponentCosts'!$11:$11,0))","v":1105909},0.65,0.65,9.8741874999999993E-2]
[null,617,{"$f":"INDEX('[1]Pt1-AvionicsComponentCosts'!$A:$B,MATCH(B214,'[1]Pt1-AvionicsComponentCosts'!$A:$A,0),2)","v":"Regional"},"Embraer",1,"ERJ 135/140/145","Embraer ERJ 135/140/145","ERJ 135/140/145","ERJ 135/140/145",{"$f":"MATCH(\"*\"&F214&\"*\",Sheet1!C:C,0)","v":{"$error":"#N/A"}},{"$f":"MATCH(\"*\"&H214&\"*\",Sheet1!C:C,0)","v":{"$error":"#N/A"}},{"$f":"MATCH(\"*\"&I214&\"*\",Sheet1!B:B,0)","v":{"$error":"#N/A"}},null,null,null,{"$f":"INDEX('[2]Pt1-AvionicsComponentCosts'!$A:$NE,MATCH(B214,'[2]Pt1-AvionicsComponentCosts'!$A:$A,0),MATCH(\"END MARKER\",'[2]Pt1-AvionicsComponentCosts'!$11:$11,0))","v":1047576},0.65,0.65,""]
[null,170,{"$f":"INDEX('[1]Pt1-AvionicsComponentCosts'!$A:$B,MATCH(B215,'[1]Pt1-AvionicsComponentCosts'!$A:$A,0),2)","v":"Turboprop Trainers / Light Attack"},"Embraer",1,"Tucano","Embraer EMB 312/314 Tucano","EMB 312/314 Tucano","EMB 312/314 Tucano",{"$f":"MATCH(\"*\"&F215&\"*\",Sheet1!C:C,0)","v":{"$error":"#N/A"}},{"$f":"MATCH(\"*\"&H215&\"*\",Sheet1!C:C,0)","v":{"$error":"#N/A"}},{"$f":"MATCH(\"*\"&I215&\"*\",Sheet1!B:B,0)","v":{"$error":"#N/A"}},null,null,null,{"$f":"INDEX('[2]Pt1-AvionicsComponentCosts'!$A:$NE,MATCH(B215,'[2]Pt1-AvionicsComponentCosts'!$A:$A,0),MATCH(\"END MARKER\",'[2]Pt1-AvionicsComponentCosts'!$11:$11,0))","v":506858.1026686409},1,1,""]
[null,613,{"$f":"INDEX('[1]Pt1-AvionicsComponentCosts'!$A:$B,MATCH(B216,'[1]Pt1-AvionicsComponentCosts'!$A:$A,0),2)","v":"Regional"},"Embraer ",1,"Embraer ","New Embraer turboprop","New turboprop","New turboprop",{"$f":"MATCH(\"*\"&F216&\"*\",Sheet1!C:C,0)","v":{"$error":"#N/A"}},{"$f":"MATCH(\"*\"&H216&\"*\",Sheet1!C:C,0)","v":{"$error":"#N/A"}},{"$f":"MATCH(\"*\"&I216&\"*\",Sheet1!B:B,0)","v":{"$error":"#N/A"}},null,null,null,{"$f":"INDEX('[2]Pt1-AvionicsComponentCosts'!$A:$NE,MATCH(B216,'[2]Pt1-AvionicsComponentCosts'!$A:$A,0),MATCH(\"END MARKER\",'[2]Pt1-AvionicsComponentCosts'!$11:$11,0))","v":1043306.4672},0.65,0.65,""]
[null,680,{"$f":"INDEX('[1]Pt1-AvionicsComponentCosts'!$A:$B,MATCH(B217,'[1]Pt1-AvionicsComponentCosts'!$A:$A,0),2)","v":"Turbine GA"},"Epic",1,"Epic E1000","Epic E1000GX","E1000GX","E1000GX",{"$f":"MATCH(\"*\"&F217&\"*\",Sheet1!C:C,0)","v":{"$error":"#N/A"}},{"$f":"MATCH(\"*\"&H217&\"*\",Sheet1!C:C,0)","v":{"$error":"#N/A"}},{"$f":"MATCH(\"*\"&I217&\"*\",Sheet1!B:B,0)","v":{"$error":"#N/A"}},4.45,null,"https://www.ainonline.com/aviation-news/business-aviation/2023-07-24/epic-gradually-raising-production-turboprop-single",{"$f":"INDEX('[2]Pt1-AvionicsComponentCosts'!$A:$NE,MATCH(B217,'[2]Pt1-AvionicsComponentCosts'!$A:$A,0),MATCH(\"END MARKER\",'[2]Pt1-AvionicsComponentCosts'!$11:$11,0))","v":217209},1,1,0.48811011235955054]
[null,673,{"$f":"INDEX('[1]Pt1-AvionicsComponentCosts'!$A:$B,MATCH(B218,'[1]Pt1-AvionicsComponentCosts'!$A:$A,0),2)","v":"UAV"},"Eurodrone",1,"Eurodrone","Eurodrone",{"$f":"G218","v":"Eurodrone"},"Eurodrone",{"$f":"MATCH(\"*\"&F218&\"*\",Sheet1!C:C,0)","v":{"$error":"#N/A"}},{"$f":"MATCH(\"*\"&H218&\"*\",Sheet1!C:C,0)","v":{"$error":"#N/A"}},{"$f":"MATCH(\"*\"&I218&\"*\",Sheet1!B:B,0)","v":{"$error":"#N/A"}},null,null,null,{"$f":"INDEX('[2]Pt1-AvionicsComponentCosts'!$A:$NE,MATCH(B218,'[2]Pt1-AvionicsComponentCosts'!$A:$A,0),MATCH(\"END MARKER\",'[2]Pt1-AvionicsComponentCosts'!$11:$11,0))","v":1073581.2143999999},1,1,""]
[null,142,{"$f":"INDEX('[1]Pt1-AvionicsComponentCosts'!$A:$B,MATCH(B219,'[1]Pt1-AvionicsComponentCosts'!$A:$A,0),2)","v":"Fighters and Jet Trainers"},"Eurofighter",1,"Eurofighter Typhoon","Eurofighter Typhoon","Typhoon","Typhoon",{"$f":"MATCH(\"*\"&F219&\"*\",Sheet1!C:C,0)","v":{"$error":"#N/A"}},{"$f":"MATCH(\"*\"&H219&\"*\",Sheet1!C:C,0)","v":{"$error":"#N/A"}},{"$f":"MATCH(\"*\"&I219&\"*\",Sheet1!B:B,0)","v":{"$error":"#N/A"}},null,null,null,{"$f":"INDEX('[2]Pt1-AvionicsComponentCosts'!$A:$NE,MATCH(B219,'[2]Pt1-AvionicsComponentCosts'!$A:$A,0),MATCH(\"END MARKER\",'[2]Pt1-AvionicsComponentCosts'!$11:$11,0))","v":3002858.2543754629},1,1,""]
[null,171,{"$f":"INDEX('[1]Pt1-AvionicsComponentCosts'!$A:$B,MATCH(B220,'[1]Pt1-AvionicsComponentCosts'!$A:$A,0),2)","v":"Fighters and Jet Trainers"},"FMA",1,"FMA IA 63 Pampa","FMA IA 63 Pampa","IA 63 Pampa","IA 63 Pampa",{"$f":"MATCH(\"*\"&F220&\"*\",Sheet1!C:C,0)","v":{"$error":"#N/A"}},{"$f":"MATCH(\"*\"&H220&\"*\",Sheet1!C:C,0)","v":{"$error":"#N/A"}},{"$f":"MATCH(\"*\"&I220&\"*\",Sheet1!B:B,0)","v":{"$error":"#N/A"}},null,null,null,{"$f":"INDEX('[2]Pt1-AvionicsComponentCosts'!$A:$NE,MATCH(B220,'[2]Pt1-AvionicsComponentCosts'!$A:$A,0),MATCH(\"END MARKER\",'[2]Pt1-AvionicsComponentCosts'!$11:$11,0))","v":1295662.9234796404},1,1,""]
[null,144,{"$f":"INDEX('[1]Pt1-AvionicsComponentCosts'!$A:$B,MATCH(B221,'[1]Pt1-AvionicsComponentCosts'!$A:$A,0),2)","v":"Fighters and Jet Trainers"},"General Dynamics",1,"F-16","General Dynamics F-16 Fighting Falcon","F-16 Fighting Falcon","F-16 Fighting Falcon",{"$f":"MATCH(\"*\"&F221&\"*\",Sheet1!C:C,0)","v":{"$error":"#N/A"}},{"$f":"MATCH(\"*\"&H221&\"*\",Sheet1!C:C,0)","v":{"$error":"#N/A"}},{"$f":"MATCH(\"*\"&I221&\"*\",Sheet1!B:B,0)","v":{"$error":"#N/A"}},null,null,null,{"$f":"INDEX('[2]Pt1-AvionicsComponentCosts'!$A:$NE,MATCH(B221,'[2]Pt1-AvionicsComponentCosts'!$A:$A,0),MATCH(\"END MARKER\",'[2]Pt1-AvionicsComponentCosts'!$11:$11,0))","v":3332641.2943754629},1,1,""]
[null,545,{"$f":"INDEX('[1]Pt1-AvionicsComponentCosts'!$A:$B,MATCH(B222,'[1]Pt1-AvionicsComponentCosts'!$A:$A,0),2)","v":"Turbine GA"},"GippsAero",1,"Airvan 10","GippsAero GA10 Airvan","GA10 Airvan","GA10 Airvan",{"$f":"MATCH(\"*\"&F222&\"*\",Sheet1!C:C,0)","v":{"$error":"#N/A"}},{"$f":"MATCH(\"*\"&H222&\"*\",Sheet1!C:C,0)","v":{"$error":"#N/A"}},{"$f":"MATCH(\"*\"&I222&\"*\",Sheet1!B:B,0)","v":{"$error":"#N/A"}},null,"OOP","https://www.avweb.com/aviation-news/mahindra-shutters-gippsaero-puts-it-up-for-sale/",{"$f":"INDEX('[2]Pt1-AvionicsComponentCosts'!$A:$NE,MATCH(B222,'[2]Pt1-AvionicsComponentCosts'!$A:$A,0),MATCH(\"END MARKER\",'[2]Pt1-AvionicsComponentCosts'!$11:$11,0))","v":220626.48800000001},1,1,""]
[null,172,{"$f":"INDEX('[1]Pt1-AvionicsComponentCosts'!$A:$B,MATCH(B223,'[1]Pt1-AvionicsComponentCosts'!$A:$A,0),2)","v":"Turboprop Trainers / Light Attack"},"Grob",1,"Grob G 120TP","Grob G 120TP","G 120TP","G 120TP",{"$f":"MATCH(\"*\"&F223&\"*\",Sheet1!C:C,0)","v":{"$error":"#N/A"}},{"$f":"MATCH(\"*\"&H223&\"*\",Sheet1!C:C,0)","v":{"$error":"#N/A"}},{"$f":"MATCH(\"*\"&I223&\"*\",Sheet1!B:B,0)","v":{"$error":"#N/A"}},null,null,null,{"$f":"INDEX('[2]Pt1-AvionicsComponentCosts'!$A:$NE,MATCH(B223,'[2]Pt1-AvionicsComponentCosts'!$A:$A,0),MATCH(\"END MARKER\",'[2]Pt1-AvionicsComponentCosts'!$11:$11,0))","v":501568.0706686409},1,1,""]
[null,651,{"$f":"INDEX('[1]Pt1-AvionicsComponentCosts'!$A:$B,MATCH(B224,'[1]Pt1-AvionicsComponentCosts'!$A:$A,0),2)","v":"Business Jet"},"Gulfstream",1,"G400","Gulfstream G400","G400","G400",{"$f":"MATCH(\"*\"&F224&\"*\",Sheet1!C:C,0)","v":{"$error":"#N/A"}},{"$f":"MATCH(\"*\"&H224&\"*\",Sheet1!C:C,0)","v":{"$error":"#N/A"}},{"$f":"MATCH(\"*\"&I224&\"*\",Sheet1!B:B,0)","v":{"$error":"#N/A"}},34.5,null,"https://www.corporatejetinvestor.com/aircraft/buyers-guide-gulfstream-g400-business-jet/",{"$f":"INDEX('[2]Pt1-AvionicsComponentCosts'!$A:$NE,MATCH(B224,'[2]Pt1-AvionicsComponentCosts'!$A:$A,0),MATCH(\"END MARKER\",'[2]Pt1-AvionicsComponentCosts'!$11:$11,0))","v":1197825.7248},0.75,0.75,0.26039689669565219]
[null,59,{"$f":"INDEX('[1]Pt1-AvionicsComponentCosts'!$A:$B,MATCH(B225,'[1]Pt1-AvionicsComponentCosts'!$A:$A,0),2)","v":"Business Jet"},"Gulfstream",1,"G450","Gulfstream G450","G450","G450",{"$f":"MATCH(\"*\"&F225&\"*\",Sheet1!C:C,0)","v":{"$error":"#N/A"}},{"$f":"MATCH(\"*\"&H225&\"*\",Sheet1!C:C,0)","v":{"$error":"#N/A"}},{"$f":"MATCH(\"*\"&I225&\"*\",Sheet1!B:B,0)","v":{"$error":"#N/A"}},38,"2016 PRICE","https://www.sherpareport.com/aircraft/costs-gulfstream-g450.html",{"$f":"INDEX('[2]Pt1-AvionicsComponentCosts'!$A:$NE,MATCH(B225,'[2]Pt1-AvionicsComponentCosts'!$A:$A,0),MATCH(\"END MARKER\",'[2]Pt1-AvionicsComponentCosts'!$11:$11,0))","v":1152968},0.75,0.75,0.22755947368421053]
[null,61,{"$f":"INDEX('[1]Pt1-AvionicsComponentCosts'!$A:$B,MATCH(B226,'[1]Pt1-AvionicsComponentCosts'!$A:$A,0),2)","v":"Business Jet"},"Gulfstream",1,"G500/G600","Gulfstream G500","G500","G500",{"$f":"MATCH(\"*\"&F226&\"*\",Sheet1!C:C,0)","v":{"$error":"#N/A"}},{"$f":"MATCH(\"*\"&H226&\"*\",Sheet1!C:C,0)","v":{"$error":"#N/A"}},{"$f":"MATCH(\"*\"&I226&\"*\",Sheet1!B:B,0)","v":{"$error":"#N/A"}},44,null,"https://www.jetfinder.com/most-expensive-private-jets/",{"$f":"INDEX('[2]Pt1-AvionicsComponentCosts'!$A:$NE,MATCH(B226,'[2]Pt1-AvionicsComponentCosts'!$A:$A,0),MATCH(\"END MARKER\",'[2]Pt1-AvionicsComponentCosts'!$11:$11,0))","v":1152968},0.75,0.75,0.19652863636363638]
[null,62,{"$f":"INDEX('[1]Pt1-AvionicsComponentCosts'!$A:$B,MATCH(B227,'[1]Pt1-AvionicsComponentCosts'!$A:$A,0),2)","v":"Business Jet"},"Gulfstream",1,"G500/G600","Gulfstream G600 ","G600","G600",{"$f":"MATCH(\"*\"&F227&\"*\",Sheet1!C:C,0)","v":{"$error":"#N/A"}},{"$f":"MATCH(\"*\"&H227&\"*\",Sheet1!C:C,0)","v":{"$error":"#N/A"}},{"$f":"MATCH(\"*\"&I227&\"*\",Sheet1!B:B,0)","v":{"$error":"#N/A"}},59.5,null,"https://infogram.com/bca-table-2023-jets-ultra-long-range-1ho16vorwrqkx4n",{"$f":"INDEX('[2]Pt1-AvionicsComponentCosts'!$A:$NE,MATCH(B227,'[2]Pt1-AvionicsComponentCosts'!$A:$A,0),MATCH(\"END MARKER\",'[2]Pt1-AvionicsComponentCosts'!$11:$11,0))","v":1152968},0.75,0.75,0.14533210084033613]
[null,60,{"$f":"INDEX('[1]Pt1-AvionicsComponentCosts'!$A:$B,MATCH(B228,'[1]Pt1-AvionicsComponentCosts'!$A:$A,0),2)","v":"Business Jet"},"Gulfstream",1,"G550","Gulfstream G550","G550","G550",{"$f":"MATCH(\"*\"&F228&\"*\",Sheet1!C:C,0)","v":{"$error":"#N/A"}},{"$f":"MATCH(\"*\"&H228&\"*\",Sheet1!C:C,0)","v":{"$error":"#N/A"}},{"$f":"MATCH(\"*\"&I228&\"*\",Sheet1!B:B,0)","v":{"$error":"#N/A"}},62,null,"https://privatejetcardcomparisons.com/aircraft/gulfstream/g550/",{"$f":"INDEX('[2]Pt1-AvionicsComponentCosts'!$A:$NE,MATCH(B228,'[2]Pt1-AvionicsComponentCosts'!$A:$A,0),MATCH(\"END MARKER\",'[2]Pt1-AvionicsComponentCosts'!$11:$11,0))","v":1152968},0.75,0.75,0.13947193548387099]
[null,63,{"$f":"INDEX('[1]Pt1-AvionicsComponentCosts'!$A:$B,MATCH(B229,'[1]Pt1-AvionicsComponentCosts'!$A:$A,0),2)","v":"Business Jet"},"Gulfstream",1,"G650","Gulfstream G650","G650","G650",{"$f":"MATCH(\"*\"&F229&\"*\",Sheet1!C:C,0)","v":{"$error":"#N/A"}},{"$f":"MATCH(\"*\"&H229&\"*\",Sheet1!C:C,0)","v":{"$error":"#N/A"}},{"$f":"MATCH(\"*\"&I229&\"*\",Sheet1!B:B,0)","v":{"$error":"#N/A"}},68.5,null,"https://infogram.com/bca-table-2023-jets-ultra-long-range-1ho16vorwrqkx4n",{"$f":"INDEX('[2]Pt1-AvionicsComponentCosts'!$A:$NE,MATCH(B229,'[2]Pt1-AvionicsComponentCosts'!$A:$A,0),MATCH(\"END MARKER\",'[2]Pt1-AvionicsComponentCosts'!$11:$11,0))","v":1152968},0.75,0.75,0.12623737226277373]
[null,598,{"$f":"INDEX('[1]Pt1-AvionicsComponentCosts'!$A:$B,MATCH(B230,'[1]Pt1-AvionicsComponentCosts'!$A:$A,0),2)","v":"Business Jet"},"Gulfstream",1,"G700","Gulfstream G700","G700","G700",{"$f":"MATCH(\"*\"&F230&\"*\",Sheet1!C:C,0)","v":{"$error":"#N/A"}},{"$f":"MATCH(\"*\"&H230&\"*\",Sheet1!C:C,0)","v":{"$error":"#N/A"}},{"$f":"MATCH(\"*\"&I230&\"*\",Sheet1!B:B,0)","v":{"$error":"#N/A"}},79.900000000000006,null,"https://infogram.com/bca-table-2023-jets-ultra-long-range-1ho16vorwrqkx4n",{"$f":"INDEX('[2]Pt1-AvionicsComponentCosts'!$A:$NE,MATCH(B230,'[2]Pt1-AvionicsComponentCosts'!$A:$A,0),MATCH(\"END MARKER\",'[2]Pt1-AvionicsComponentCosts'!$11:$11,0))","v":1152968},0.75,0.75,0.10822603254067582]
[null,670,{"$f":"INDEX('[1]Pt1-AvionicsComponentCosts'!$A:$B,MATCH(B231,'[1]Pt1-AvionicsComponentCosts'!$A:$A,0),2)","v":"Business Jet"},"Gulfstream",1,"G800","Gulfstream G800","G800","G800",{"$f":"MATCH(\"*\"&F231&\"*\",Sheet1!C:C,0)","v":{"$error":"#N/A"}},{"$f":"MATCH(\"*\"&H231&\"*\",Sheet1!C:C,0)","v":{"$error":"#N/A"}},{"$f":"MATCH(\"*\"&I231&\"*\",Sheet1!B:B,0)","v":{"$error":"#N/A"}},72.5,null,"https://infogram.com/bca-table-2023-jets-ultra-long-range-1ho16vorwrqkx4n",{"$f":"INDEX('[2]Pt1-AvionicsComponentCosts'!$A:$NE,MATCH(B231,'[2]Pt1-AvionicsComponentCosts'!$A:$A,0),MATCH(\"END MARKER\",'[2]Pt1-AvionicsComponentCosts'!$11:$11,0))","v":1197825.7248},0.75,0.75,0.1239130060137931]
[null,64,{"$f":"INDEX('[1]Pt1-AvionicsComponentCosts'!$A:$B,MATCH(B232,'[1]Pt1-AvionicsComponentCosts'!$A:$A,0),2)","v":"Business Jet"},"Gulfstream",1,"G100","Gulfstream G100","G100","G100",{"$f":"MATCH(\"*\"&F232&\"*\",Sheet1!C:C,0)","v":{"$error":"#N/A"}},{"$f":"MATCH(\"*\"&H232&\"*\",Sheet1!C:C,0)","v":{"$error":"#N/A"}},{"$f":"MATCH(\"*\"&I232&\"*\",Sheet1!B:B,0)","v":{"$error":"#N/A"}},12,"OOP 2006","https://www.bjtonline.com/aircraft/gulfstream-g100",{"$f":"INDEX('[2]Pt1-AvionicsComponentCosts'!$A:$NE,MATCH(B232,'[2]Pt1-AvionicsComponentCosts'!$A:$A,0),MATCH(\"END MARKER\",'[2]Pt1-AvionicsComponentCosts'!$11:$11,0))","v":750683.22080000001},0.75,0.75,0.46917701299999998]
[null,454,{"$f":"INDEX('[1]Pt1-AvionicsComponentCosts'!$A:$B,MATCH(B233,'[1]Pt1-AvionicsComponentCosts'!$A:$A,0),2)","v":"Business Jet"},"Gulfstream",1,"G280","Gulfstream G280","G280","G280",{"$f":"MATCH(\"*\"&F233&\"*\",Sheet1!C:C,0)","v":{"$error":"#N/A"}},{"$f":"MATCH(\"*\"&H233&\"*\",Sheet1!C:C,0)","v":{"$error":"#N/A"}},{"$f":"MATCH(\"*\"&I233&\"*\",Sheet1!B:B,0)","v":{"$error":"#N/A"}},25,null,"https://www.bjtonline.com/aircraft/gulfstream-g280",{"$f":"INDEX('[2]Pt1-AvionicsComponentCosts'!$A:$NE,MATCH(B233,'[2]Pt1-AvionicsComponentCosts'!$A:$A,0),MATCH(\"END MARKER\",'[2]Pt1-AvionicsComponentCosts'!$11:$11,0))","v":759427.22080000001},0.75,0.75,0.22782816623999999]
[null,642,{"$f":"INDEX('[1]Pt1-AvionicsComponentCosts'!$A:$B,MATCH(B234,'[1]Pt1-AvionicsComponentCosts'!$A:$A,0),2)","v":"Business Jet"},"Gulfstream",1,"G285X","Gulfstream G285X","G285X","G285X",{"$f":"MATCH(\"*\"&F234&\"*\",Sheet1!C:C,0)","v":{"$error":"#N/A"}},{"$f":"MATCH(\"*\"&H234&\"*\",Sheet1!C:C,0)","v":{"$error":"#N/A"}},{"$f":"MATCH(\"*\"&I234&\"*\",Sheet1!B:B,0)","v":{"$error":"#N/A"}},null,null,null,{"$f":"INDEX('[2]Pt1-AvionicsComponentCosts'!$A:$NE,MATCH(B234,'[2]Pt1-AvionicsComponentCosts'!$A:$A,0),MATCH(\"END MARKER\",'[2]Pt1-AvionicsComponentCosts'!$11:$11,0))","v":803708.22400000005},0.75,0.75,""]
[null,174,{"$f":"INDEX('[1]Pt1-AvionicsComponentCosts'!$A:$B,MATCH(B235,'[1]Pt1-AvionicsComponentCosts'!$A:$A,0),2)","v":"Fighters and Jet Trainers"},"HAL",1,"HJT-36 Sitara","HAL HJT-36 Sitara","HJT-36 Sitara","HJT-36 Sitara",{"$f":"MATCH(\"*\"&F235&\"*\",Sheet1!C:C,0)","v":{"$error":"#N/A"}},{"$f":"MATCH(\"*\"&H235&\"*\",Sheet1!C:C,0)","v":{"$error":"#N/A"}},{"$f":"MATCH(\"*\"&I235&\"*\",Sheet1!B:B,0)","v":{"$error":"#N/A"}},null,null,null,{"$f":"INDEX('[2]Pt1-AvionicsComponentCosts'!$A:$NE,MATCH(B235,'[2]Pt1-AvionicsComponentCosts'!$A:$A,0),MATCH(\"END MARKER\",'[2]Pt1-AvionicsComponentCosts'!$11:$11,0))","v":1295662.9234796404},1,1,""]
[null,143,{"$f":"INDEX('[1]Pt1-AvionicsComponentCosts'!$A:$B,MATCH(B236,'[1]Pt1-AvionicsComponentCosts'!$A:$A,0),2)","v":"Fighters and Jet Trainers"},"HAL",1,"Tejas","HAL Tejas","Tejas","Tejas",{"$f":"MATCH(\"*\"&F236&\"*\",Sheet1!C:C,0)","v":{"$error":"#N/A"}},{"$f":"MATCH(\"*\"&H236&\"*\",Sheet1!C:C,0)","v":{"$error":"#N/A"}},{"$f":"MATCH(\"*\"&I236&\"*\",Sheet1!B:B,0)","v":{"$error":"#N/A"}},null,null,null,{"$f":"INDEX('[2]Pt1-AvionicsComponentCosts'!$A:$NE,MATCH(B236,'[2]Pt1-AvionicsComponentCosts'!$A:$A,0),MATCH(\"END MARKER\",'[2]Pt1-AvionicsComponentCosts'!$11:$11,0))","v":1309968.3463615018},1,1,""]
[null,116,{"$f":"INDEX('[1]Pt1-AvionicsComponentCosts'!$A:$B,MATCH(B237,'[1]Pt1-AvionicsComponentCosts'!$A:$A,0),2)","v":"Helicopter"},"HAL",1,"HAL Dhruv","HAL Dhruv","Dhruv","Dhruv",{"$f":"MATCH(\"*\"&F237&\"*\",Sheet1!C:C,0)","v":{"$error":"#N/A"}},{"$f":"MATCH(\"*\"&H237&\"*\",Sheet1!C:C,0)","v":{"$error":"#N/A"}},{"$f":"MATCH(\"*\"&I237&\"*\",Sheet1!B:B,0)","v":{"$error":"#N/A"}},null,null,null,{"$f":"INDEX('[2]Pt1-AvionicsComponentCosts'!$A:$NE,MATCH(B237,'[2]Pt1-AvionicsComponentCosts'!$A:$A,0),MATCH(\"END MARKER\",'[2]Pt1-AvionicsComponentCosts'!$11:$11,0))","v":1354323.370512533},0.99,0.99,""]
[null,137,{"$f":"INDEX('[1]Pt1-AvionicsComponentCosts'!$A:$B,MATCH(B238,'[1]Pt1-AvionicsComponentCosts'!$A:$A,0),2)","v":"Helicopter"},"HAL",1,"HAL Light Utility Helicopter","HAL Light Utility Helicopter","Light Utility Helicopter","Light Utility Helicopter",{"$f":"MATCH(\"*\"&F238&\"*\",Sheet1!C:C,0)","v":{"$error":"#N/A"}},{"$f":"MATCH(\"*\"&H238&\"*\",Sheet1!C:C,0)","v":{"$error":"#N/A"}},{"$f":"MATCH(\"*\"&I238&\"*\",Sheet1!B:B,0)","v":{"$error":"#N/A"}},null,null,null,{"$f":"INDEX('[2]Pt1-AvionicsComponentCosts'!$A:$NE,MATCH(B238,'[2]Pt1-AvionicsComponentCosts'!$A:$A,0),MATCH(\"END MARKER\",'[2]Pt1-AvionicsComponentCosts'!$11:$11,0))","v":1337317.5391999998},0.99,0.99,""]
[null,136,{"$f":"INDEX('[1]Pt1-AvionicsComponentCosts'!$A:$B,MATCH(B239,'[1]Pt1-AvionicsComponentCosts'!$A:$A,0),2)","v":"Helicopter"},"HAL",1,"HAL Medium Lift","HAL Medium Lift","Medium Lift","Medium Lift",{"$f":"MATCH(\"*\"&F239&\"*\",Sheet1!C:C,0)","v":{"$error":"#N/A"}},{"$f":"MATCH(\"*\"&H239&\"*\",Sheet1!C:C,0)","v":{"$error":"#N/A"}},{"$f":"MATCH(\"*\"&I239&\"*\",Sheet1!B:B,0)","v":{"$error":"#N/A"}},null,null,null,{"$f":"INDEX('[2]Pt1-AvionicsComponentCosts'!$A:$NE,MATCH(B239,'[2]Pt1-AvionicsComponentCosts'!$A:$A,0),MATCH(\"END MARKER\",'[2]Pt1-AvionicsComponentCosts'!$11:$11,0))","v":1360993.6521125329},0.99,0.99,""]
[null,677,{"$f":"INDEX('[1]Pt1-AvionicsComponentCosts'!$A:$B,MATCH(B240,'[1]Pt1-AvionicsComponentCosts'!$A:$A,0),2)","v":"Turboprop Trainers / Light Attack"},"HAL",1,"HHT-40","HAL HHT-40","HHT-40","HHT-40",{"$f":"MATCH(\"*\"&F240&\"*\",Sheet1!C:C,0)","v":{"$error":"#N/A"}},{"$f":"MATCH(\"*\"&H240&\"*\",Sheet1!C:C,0)","v":{"$error":"#N/A"}},{"$f":"MATCH(\"*\"&I240&\"*\",Sheet1!B:B,0)","v":{"$error":"#N/A"}},null,null,null,{"$f":"INDEX('[2]Pt1-AvionicsComponentCosts'!$A:$NE,MATCH(B240,'[2]Pt1-AvionicsComponentCosts'!$A:$A,0),MATCH(\"END MARKER\",'[2]Pt1-AvionicsComponentCosts'!$11:$11,0))","v":503373.16826864093},1,1,""]
[null,30,{"$f":"INDEX('[1]Pt1-AvionicsComponentCosts'!$A:$B,MATCH(B241,'[1]Pt1-AvionicsComponentCosts'!$A:$A,0),2)","v":"Business Jet"},"Hawker",1,"Hawker 400","Hawker 400","400","400",{"$f":"MATCH(\"*\"&F241&\"*\",Sheet1!C:C,0)","v":{"$error":"#N/A"}},{"$f":"MATCH(\"*\"&H241&\"*\",Sheet1!C:C,0)","v":{"$error":"#N/A"}},{"$f":"MATCH(\"*\"&I241&\"*\",Sheet1!B:B,0)","v":23},null,null,null,{"$f":"INDEX('[2]Pt1-AvionicsComponentCosts'!$A:$NE,MATCH(B241,'[2]Pt1-AvionicsComponentCosts'!$A:$A,0),MATCH(\"END MARKER\",'[2]Pt1-AvionicsComponentCosts'!$11:$11,0))","v":491403.80480000004},0.75,0.75,""]
[null,33,{"$f":"INDEX('[1]Pt1-AvionicsComponentCosts'!$A:$B,MATCH(B242,'[1]Pt1-AvionicsComponentCosts'!$A:$A,0),2)","v":"Business Jet"},"Hawker",1,"Hawker 4000","Hawker 4000","4000","4000",{"$f":"MATCH(\"*\"&F242&\"*\",Sheet1!C:C,0)","v":{"$error":"#N/A"}},{"$f":"MATCH(\"*\"&H242&\"*\",Sheet1!C:C,0)","v":{"$error":"#N/A"}},{"$f":"MATCH(\"*\"&I242&\"*\",Sheet1!B:B,0)","v":{"$error":"#N/A"}},null,null,null,{"$f":"INDEX('[2]Pt1-AvionicsComponentCosts'!$A:$NE,MATCH(B242,'[2]Pt1-AvionicsComponentCosts'!$A:$A,0),MATCH(\"END MARKER\",'[2]Pt1-AvionicsComponentCosts'!$11:$11,0))","v":750683.22080000001},0.75,0.75,""]
[null,32,{"$f":"INDEX('[1]Pt1-AvionicsComponentCosts'!$A:$B,MATCH(B243,'[1]Pt1-AvionicsComponentCosts'!$A:$A,0),2)","v":"Business Jet"},"Hawker",1,"Hawker 750/850/900","Hawker 750/850/900","750/850/900","750/850/900",{"$f":"MATCH(\"*\"&F243&\"*\",Sheet1!C:C,0)","v":{"$error":"#N/A"}},{"$f":"MATCH(\"*\"&H243&\"*\",Sheet1!C:C,0)","v":{"$error":"#N/A"}},{"$f":"MATCH(\"*\"&I243&\"*\",Sheet1!B:B,0)","v":{"$error":"#N/A"}},null,null,null,{"$f":"INDEX('[2]Pt1-AvionicsComponentCosts'!$A:$NE,MATCH(B243,'[2]Pt1-AvionicsComponentCosts'!$A:$A,0),MATCH(\"END MARKER\",'[2]Pt1-AvionicsComponentCosts'!$11:$11,0))","v":750683.22080000001},0.75,0.75,""]
[null,590,{"$f":"INDEX('[1]Pt1-AvionicsComponentCosts'!$A:$B,MATCH(B244,'[1]Pt1-AvionicsComponentCosts'!$A:$A,0),2)","v":"Business Jet"},"Honda",1,"HondaJet","Honda HA-2600 HondaJet","HA-2600 Jet","HA-2600 Jet",{"$f":"MATCH(\"*\"&F244&\"*\",Sheet1!C:C,0)","v":{"$error":"#N/A"}},{"$f":"MATCH(\"*\"&H244&\"*\",Sheet1!C:C,0)","v":{"$error":"#N/A"}},{"$f":"MATCH(\"*\"&I244&\"*\",Sheet1!B:B,0)","v":{"$error":"#N/A"}},null,null,null,{"$f":"INDEX('[2]Pt1-AvionicsComponentCosts'!$A:$NE,MATCH(B244,'[2]Pt1-AvionicsComponentCosts'!$A:$A,0),MATCH(\"END MARKER\",'[2]Pt1-AvionicsComponentCosts'!$11:$11,0))","v":231965.88640000005},0.75,0.75,""]
[null,66,{"$f":"INDEX('[1]Pt1-AvionicsComponentCosts'!$A:$B,MATCH(B245,'[1]Pt1-AvionicsComponentCosts'!$A:$A,0),2)","v":"Business Jet"},"Honda",1,"HondaJet","Honda HA-420 HondaJet","HA-420 Jet","HA-420 Jet",{"$f":"MATCH(\"*\"&F245&\"*\",Sheet1!C:C,0)","v":{"$error":"#N/A"}},{"$f":"MATCH(\"*\"&H245&\"*\",Sheet1!C:C,0)","v":{"$error":"#N/A"}},{"$f":"MATCH(\"*\"&I245&\"*\",Sheet1!B:B,0)","v":{"$error":"#N/A"}},null,null,null,{"$f":"INDEX('[2]Pt1-AvionicsComponentCosts'!$A:$NE,MATCH(B245,'[2]Pt1-AvionicsComponentCosts'!$A:$A,0),MATCH(\"END MARKER\",'[2]Pt1-AvionicsComponentCosts'!$11:$11,0))","v":226255.33600000004},0.75,0.75,""]
[null,173,{"$f":"INDEX('[1]Pt1-AvionicsComponentCosts'!$A:$B,MATCH(B246,'[1]Pt1-AvionicsComponentCosts'!$A:$A,0),2)","v":"Fighters and Jet Trainers"},"Hongdu",1,"Hongdu K-8","Hongdu K-8","K-8","K-8",{"$f":"MATCH(\"*\"&F246&\"*\",Sheet1!C:C,0)","v":{"$error":"#N/A"}},{"$f":"MATCH(\"*\"&H246&\"*\",Sheet1!C:C,0)","v":{"$error":"#N/A"}},{"$f":"MATCH(\"*\"&I246&\"*\",Sheet1!B:B,0)","v":{"$error":"#N/A"}},null,null,null,{"$f":"INDEX('[2]Pt1-AvionicsComponentCosts'!$A:$NE,MATCH(B246,'[2]Pt1-AvionicsComponentCosts'!$A:$A,0),MATCH(\"END MARKER\",'[2]Pt1-AvionicsComponentCosts'!$11:$11,0))","v":1295662.9234796404},1,1,""]
[null,679,{"$f":"INDEX('[1]Pt1-AvionicsComponentCosts'!$A:$B,MATCH(B247,'[1]Pt1-AvionicsComponentCosts'!$A:$A,0),2)","v":"Turbine GA"},"Indonesian Aerospace",1,"N-219","Indonesian Aerospace N-219 Nurtanio","N-219 Nurtanio","N-219 Nurtanio",{"$f":"MATCH(\"*\"&F247&\"*\",Sheet1!C:C,0)","v":{"$error":"#N/A"}},{"$f":"MATCH(\"*\"&H247&\"*\",Sheet1!C:C,0)","v":{"$error":"#N/A"}},{"$f":"MATCH(\"*\"&I247&\"*\",Sheet1!B:B,0)","v":{"$error":"#N/A"}},6,"in 2017","https://www.indonesian-aerospace.com/news/detail/878_aceh+government+purchases+n219+airplane%2C+this+is+the+price",{"$f":"INDEX('[2]Pt1-AvionicsComponentCosts'!$A:$NE,MATCH(B247,'[2]Pt1-AvionicsComponentCosts'!$A:$A,0),MATCH(\"END MARKER\",'[2]Pt1-AvionicsComponentCosts'!$11:$11,0))","v":217209},1,1,0.36201499999999998]
[null,541,{"$f":"INDEX('[1]Pt1-AvionicsComponentCosts'!$A:$B,MATCH(B248,'[1]Pt1-AvionicsComponentCosts'!$A:$A,0),2)","v":"Large Commercial Aircraft"},"Irkut",1,"Irkut MC-21","Irkut MC-21","MC-21","MC-21",{"$f":"MATCH(\"*\"&F248&\"*\",Sheet1!C:C,0)","v":{"$error":"#N/A"}},{"$f":"MATCH(\"*\"&H248&\"*\",Sheet1!C:C,0)","v":{"$error":"#N/A"}},{"$f":"MATCH(\"*\"&I248&\"*\",Sheet1!B:B,0)","v":{"$error":"#N/A"}},null,null,null,{"$f":"INDEX('[2]Pt1-AvionicsComponentCosts'!$A:$NE,MATCH(B248,'[2]Pt1-AvionicsComponentCosts'!$A:$A,0),MATCH(\"END MARKER\",'[2]Pt1-AvionicsComponentCosts'!$11:$11,0))","v":1374577.7648753042},{"$f":"50%","v":0.5},{"$f":"50%","v":0.5},""]
[null,584,{"$f":"INDEX('[1]Pt1-AvionicsComponentCosts'!$A:$B,MATCH(B249,'[1]Pt1-AvionicsComponentCosts'!$A:$A,0),2)","v":"Fighters and Jet Trainers"},"KAI",1,"KAI KF-X","KAI KF-21","KF-21","KF-21",{"$f":"MATCH(\"*\"&F249&\"*\",Sheet1!C:C,0)","v":{"$error":"#N/A"}},{"$f":"MATCH(\"*\"&H249&\"*\",Sheet1!C:C,0)","v":{"$error":"#N/A"}},{"$f":"MATCH(\"*\"&I249&\"*\",Sheet1!B:B,0)","v":{"$error":"#N/A"}},null,null,null,{"$f":"INDEX('[2]Pt1-AvionicsComponentCosts'!$A:$NE,MATCH(B249,'[2]Pt1-AvionicsComponentCosts'!$A:$A,0),MATCH(\"END MARKER\",'[2]Pt1-AvionicsComponentCosts'!$11:$11,0))","v":2983986.3727754629},1,1,""]
[null,176,{"$f":"INDEX('[1]Pt1-AvionicsComponentCosts'!$A:$B,MATCH(B250,'[1]Pt1-AvionicsComponentCosts'!$A:$A,0),2)","v":"Fighters and Jet Trainers"},"KAI",1,"KAI T-50 Golden Eagle","KAI T-50 Golden Eagle","T-50 Golden Eagle","T-50 Golden Eagle",{"$f":"MATCH(\"*\"&F250&\"*\",Sheet1!C:C,0)","v":{"$error":"#N/A"}},{"$f":"MATCH(\"*\"&H250&\"*\",Sheet1!C:C,0)","v":{"$error":"#N/A"}},{"$f":"MATCH(\"*\"&I250&\"*\",Sheet1!B:B,0)","v":{"$error":"#N/A"}},null,null,null,{"$f":"INDEX('[2]Pt1-AvionicsComponentCosts'!$A:$NE,MATCH(B250,'[2]Pt1-AvionicsComponentCosts'!$A:$A,0),MATCH(\"END MARKER\",'[2]Pt1-AvionicsComponentCosts'!$11:$11,0))","v":2983986.3727754629},1,1,""]
[null,114,{"$f":"INDEX('[1]Pt1-AvionicsComponentCosts'!$A:$B,MATCH(B251,'[1]Pt1-AvionicsComponentCosts'!$A:$A,0),2)","v":"Helicopter"},"KAI",1,"KAI KUH-1 Surion","KAI KUH-1 Surion","KUH-1 Surion","KUH-1 Surion",{"$f":"MATCH(\"*\"&F251&\"*\",Sheet1!C:C,0)","v":{"$error":"#N/A"}},{"$f":"MATCH(\"*\"&H251&\"*\",Sheet1!C:C,0)","v":{"$error":"#N/A"}},{"$f":"MATCH(\"*\"&I251&\"*\",Sheet1!B:B,0)","v":{"$error":"#N/A"}},null,null,null,{"$f":"INDEX('[2]Pt1-AvionicsComponentCosts'!$A:$NE,MATCH(B251,'[2]Pt1-AvionicsComponentCosts'!$A:$A,0),MATCH(\"END MARKER\",'[2]Pt1-AvionicsComponentCosts'!$11:$11,0))","v":1360631.2905125329},0.99,0.99,""]
[null,115,{"$f":"INDEX('[1]Pt1-AvionicsComponentCosts'!$A:$B,MATCH(B252,'[1]Pt1-AvionicsComponentCosts'!$A:$A,0),2)","v":"Helicopter"},"KAI",1,"KAI KUH-1 Surion","KAI LAH/LCH","LAH/LCH","LAH/LCH",{"$f":"MATCH(\"*\"&F252&\"*\",Sheet1!C:C,0)","v":{"$error":"#N/A"}},{"$f":"MATCH(\"*\"&H252&\"*\",Sheet1!C:C,0)","v":{"$error":"#N/A"}},{"$f":"MATCH(\"*\"&I252&\"*\",Sheet1!B:B,0)","v":{"$error":"#N/A"}},null,null,null,{"$f":"INDEX('[2]Pt1-AvionicsComponentCosts'!$A:$NE,MATCH(B252,'[2]Pt1-AvionicsComponentCosts'!$A:$A,0),MATCH(\"END MARKER\",'[2]Pt1-AvionicsComponentCosts'!$11:$11,0))","v":1358179.757712533},0.99,0.99,""]
[null,175,{"$f":"INDEX('[1]Pt1-AvionicsComponentCosts'!$A:$B,MATCH(B253,'[1]Pt1-AvionicsComponentCosts'!$A:$A,0),2)","v":"Turboprop Trainers / Light Attack"},"KAI",1,"KAI KT-1 Woongbi","KAI KT-1 Woongbi","KT-1 Woongbi","KT-1 Woongbi",{"$f":"MATCH(\"*\"&F253&\"*\",Sheet1!C:C,0)","v":{"$error":"#N/A"}},{"$f":"MATCH(\"*\"&H253&\"*\",Sheet1!C:C,0)","v":{"$error":"#N/A"}},{"$f":"MATCH(\"*\"&I253&\"*\",Sheet1!B:B,0)","v":{"$error":"#N/A"}},null,null,null,{"$f":"INDEX('[2]Pt1-AvionicsComponentCosts'!$A:$NE,MATCH(B253,'[2]Pt1-AvionicsComponentCosts'!$A:$A,0),MATCH(\"END MARKER\",'[2]Pt1-AvionicsComponentCosts'!$11:$11,0))","v":677572.94106864103},1,1,""]
[null,223,{"$f":"INDEX('[1]Pt1-AvionicsComponentCosts'!$A:$B,MATCH(B254,'[1]Pt1-AvionicsComponentCosts'!$A:$A,0),2)","v":"Helicopter"},"Kawasaki",1,"Kawasaki BK 117","Kawasaki BK 117","BK 117","BK 117",{"$f":"MATCH(\"*\"&F254&\"*\",Sheet1!C:C,0)","v":{"$error":"#N/A"}},{"$f":"MATCH(\"*\"&H254&\"*\",Sheet1!C:C,0)","v":{"$error":"#N/A"}},{"$f":"MATCH(\"*\"&I254&\"*\",Sheet1!B:B,0)","v":{"$error":"#N/A"}},null,null,null,{"$f":"INDEX('[2]Pt1-AvionicsComponentCosts'!$A:$NE,MATCH(B254,'[2]Pt1-AvionicsComponentCosts'!$A:$A,0),MATCH(\"END MARKER\",'[2]Pt1-AvionicsComponentCosts'!$11:$11,0))","v":319466.16320000001},0.99,0.99,""]
[null,118,{"$f":"INDEX('[1]Pt1-AvionicsComponentCosts'!$A:$B,MATCH(B255,'[1]Pt1-AvionicsComponentCosts'!$A:$A,0),2)","v":"Helicopter"},"Kawasaki",1,"Kawasaki OH-1","Kawasaki OH-1","OH-1","OH-1",{"$f":"MATCH(\"*\"&F255&\"*\",Sheet1!C:C,0)","v":{"$error":"#N/A"}},{"$f":"MATCH(\"*\"&H255&\"*\",Sheet1!C:C,0)","v":{"$error":"#N/A"}},{"$f":"MATCH(\"*\"&I255&\"*\",Sheet1!B:B,0)","v":{"$error":"#N/A"}},null,null,null,{"$f":"INDEX('[2]Pt1-AvionicsComponentCosts'!$A:$NE,MATCH(B255,'[2]Pt1-AvionicsComponentCosts'!$A:$A,0),MATCH(\"END MARKER\",'[2]Pt1-AvionicsComponentCosts'!$11:$11,0))","v":1277311.7792},0.99,0.99,""]
[null,160,{"$f":"INDEX('[1]Pt1-AvionicsComponentCosts'!$A:$B,MATCH(B256,'[1]Pt1-AvionicsComponentCosts'!$A:$A,0),2)","v":"Military Transport / Special Mission"},"Kawasaki",1,"Kawasaki C-2","Kawasaki C-2","C-2","C-2",{"$f":"MATCH(\"*\"&F256&\"*\",Sheet1!C:C,0)","v":{"$error":"#N/A"}},{"$f":"MATCH(\"*\"&H256&\"*\",Sheet1!C:C,0)","v":{"$error":"#N/A"}},{"$f":"MATCH(\"*\"&I256&\"*\",Sheet1!B:B,0)","v":{"$error":"#N/A"}},null,null,null,{"$f":"INDEX('[2]Pt1-AvionicsComponentCosts'!$A:$NE,MATCH(B256,'[2]Pt1-AvionicsComponentCosts'!$A:$A,0),MATCH(\"END MARKER\",'[2]Pt1-AvionicsComponentCosts'!$11:$11,0))","v":3356927.1099951351},1,1,""]
[null,161,{"$f":"INDEX('[1]Pt1-AvionicsComponentCosts'!$A:$B,MATCH(B257,'[1]Pt1-AvionicsComponentCosts'!$A:$A,0),2)","v":"Military Transport / Special Mission"},"Kawasaki",1,"Kawasaki P-1","Kawasaki P-1","P-1","P-1",{"$f":"MATCH(\"*\"&F257&\"*\",Sheet1!C:C,0)","v":{"$error":"#N/A"}},{"$f":"MATCH(\"*\"&H257&\"*\",Sheet1!C:C,0)","v":{"$error":"#N/A"}},{"$f":"MATCH(\"*\"&I257&\"*\",Sheet1!B:B,0)","v":{"$error":"#N/A"}},null,null,null,{"$f":"INDEX('[2]Pt1-AvionicsComponentCosts'!$A:$NE,MATCH(B257,'[2]Pt1-AvionicsComponentCosts'!$A:$A,0),MATCH(\"END MARKER\",'[2]Pt1-AvionicsComponentCosts'!$11:$11,0))","v":3358415.2603951348},1,1,""]
[null,68,{"$f":"INDEX('[1]Pt1-AvionicsComponentCosts'!$A:$B,MATCH(B258,'[1]Pt1-AvionicsComponentCosts'!$A:$A,0),2)","v":"Business Jet"},"Learjet",1,"Learjet 60","Learjet 60","60","60",{"$f":"MATCH(\"*\"&F258&\"*\",Sheet1!C:C,0)","v":{"$error":"#N/A"}},{"$f":"MATCH(\"*\"&H258&\"*\",Sheet1!C:C,0)","v":{"$error":"#N/A"}},{"$f":"MATCH(\"*\"&I258&\"*\",Sheet1!B:B,0)","v":{"$error":"#N/A"}},null,null,null,{"$f":"INDEX('[2]Pt1-AvionicsComponentCosts'!$A:$NE,MATCH(B258,'[2]Pt1-AvionicsComponentCosts'!$A:$A,0),MATCH(\"END MARKER\",'[2]Pt1-AvionicsComponentCosts'!$11:$11,0))","v":681310.22080000001},0.75,0.75,""]
[null,67,{"$f":"INDEX('[1]Pt1-AvionicsComponentCosts'!$A:$B,MATCH(B259,'[1]Pt1-AvionicsComponentCosts'!$A:$A,0),2)","v":"Business Jet"},"Learjet",1,"Learjet 70/75","Learjet 70/75",{"$f":"TRIM(SUBSTITUTE(G259,D259,\"\"))","v":"70/75"},{"$f":"TRIM(SUBSTITUTE(SUBSTITUTE(SUBSTITUTE(SUBSTITUTE(SUBSTITUTE(H259,\"Family\",\"\"),\"737 Classic:\",\"\"),\"737 MAX:\",\"\"),\"787 Dreamliner:\",\"\"),\"777:\",\"\"))","v":"70/75"},{"$f":"MATCH(\"*\"&F259&\"*\",Sheet1!C:C,0)","v":{"$error":"#N/A"}},{"$f":"MATCH(\"*\"&H259&\"*\",Sheet1!C:C,0)","v":{"$error":"#N/A"}},{"$f":"MATCH(\"*\"&I259&\"*\",Sheet1!B:B,0)","v":{"$error":"#N/A"}},null,null,null,{"$f":"INDEX('[2]Pt1-AvionicsComponentCosts'!$A:$NE,MATCH(B259,'[2]Pt1-AvionicsComponentCosts'!$A:$A,0),MATCH(\"END MARKER\",'[2]Pt1-AvionicsComponentCosts'!$11:$11,0))","v":743469.54080000008},0.75,0.75,{"$f":"IFERROR(P259/(M259*100000)*R259,\"\")","v":""}]
[null,648,{"$f":"INDEX('[1]Pt1-AvionicsComponentCosts'!$A:$B,MATCH(B260,'[1]Pt1-AvionicsComponentCosts'!$A:$A,0),2)","v":"Helicopter"},"Leonardo",1,"AW 249","Leonardo AW 249","AW 249","AW 249",{"$f":"MATCH(\"*\"&F260&\"*\",Sheet1!C:C,0)","v":{"$error":"#N/A"}},{"$f":"MATCH(\"*\"&H260&\"*\",Sheet1!C:C,0)","v":{"$error":"#N/A"}},{"$f":"MATCH(\"*\"&I260&\"*\",Sheet1!B:B,0)","v":{"$error":"#N/A"}},null,null,null,{"$f":"INDEX('[2]Pt1-AvionicsComponentCosts'!$A:$NE,MATCH(B260,'[2]Pt1-AvionicsComponentCosts'!$A:$A,0),MATCH(\"END MARKER\",'[2]Pt1-AvionicsComponentCosts'!$11:$11,0))","v":1650480.8064753041},0.99,0.99,""]
[null,615,{"$f":"INDEX('[1]Pt1-AvionicsComponentCosts'!$A:$B,MATCH(B261,'[1]Pt1-AvionicsComponentCosts'!$A:$A,0),2)","v":"Helicopter"},"Leonardo",1,"Kopter","Leonardo Kopter","Kopter","Kopter",{"$f":"MATCH(\"*\"&F261&\"*\",Sheet1!C:C,0)","v":{"$error":"#N/A"}},{"$f":"MATCH(\"*\"&H261&\"*\",Sheet1!C:C,0)","v":{"$error":"#N/A"}},{"$f":"MATCH(\"*\"&I261&\"*\",Sheet1!B:B,0)","v":{"$error":"#N/A"}},null,null,null,{"$f":"INDEX('[2]Pt1-AvionicsComponentCosts'!$A:$NE,MATCH(B261,'[2]Pt1-AvionicsComponentCosts'!$A:$A,0),MATCH(\"END MARKER\",'[2]Pt1-AvionicsComponentCosts'!$11:$11,0))","v":286634.03520000004},0.99,0.99,""]
[null,103,{"$f":"INDEX('[1]Pt1-AvionicsComponentCosts'!$A:$B,MATCH(B262,'[1]Pt1-AvionicsComponentCosts'!$A:$A,0),2)","v":"Helicopter"},"Leonardo",1,"Leonardo AW101","Leonardo AW101","AW101","AW101",{"$f":"MATCH(\"*\"&F262&\"*\",Sheet1!C:C,0)","v":{"$error":"#N/A"}},{"$f":"MATCH(\"*\"&H262&\"*\",Sheet1!C:C,0)","v":{"$error":"#N/A"}},{"$f":"MATCH(\"*\"&I262&\"*\",Sheet1!B:B,0)","v":{"$error":"#N/A"}},28,null,"https://www.bjtonline.com/aircraft/leonardo-helicopters-aw101",{"$f":"INDEX('[2]Pt1-AvionicsComponentCosts'!$A:$NE,MATCH(B262,'[2]Pt1-AvionicsComponentCosts'!$A:$A,0),MATCH(\"END MARKER\",'[2]Pt1-AvionicsComponentCosts'!$11:$11,0))","v":1298893.1289125329},0.99,0.99,0.45925149915121699]
[null,455,{"$f":"INDEX('[1]Pt1-AvionicsComponentCosts'!$A:$B,MATCH(B263,'[1]Pt1-AvionicsComponentCosts'!$A:$A,0),2)","v":"Helicopter"},"Leonardo",1,"Leonardo AW109","Leonardo AW109","AW109","AW109",{"$f":"MATCH(\"*\"&F263&\"*\",Sheet1!C:C,0)","v":{"$error":"#N/A"}},{"$f":"MATCH(\"*\"&H263&\"*\",Sheet1!C:C,0)","v":{"$error":"#N/A"}},{"$f":"MATCH(\"*\"&I263&\"*\",Sheet1!B:B,0)","v":{"$error":"#N/A"}},7,null,"https://www.fairlifts.com/helicopters/guide-to-2023-helicopter-prices/",{"$f":"INDEX('[2]Pt1-AvionicsComponentCosts'!$A:$NE,MATCH(B263,'[2]Pt1-AvionicsComponentCosts'!$A:$A,0),MATCH(\"END MARKER\",'[2]Pt1-AvionicsComponentCosts'!$11:$11,0))","v":282412.21920000005},0.99,0.99,0.39941156715428577]
[null,84,{"$f":"INDEX('[1]Pt1-AvionicsComponentCosts'!$A:$B,MATCH(B264,'[1]Pt1-AvionicsComponentCosts'!$A:$A,0),2)","v":"Helicopter"},"Leonardo",1,"Leonardo AW119 Koala","Leonardo AW119 Koala","AW119 Koala","AW119 Koala",{"$f":"MATCH(\"*\"&F264&\"*\",Sheet1!C:C,0)","v":{"$error":"#N/A"}},{"$f":"MATCH(\"*\"&H264&\"*\",Sheet1!C:C,0)","v":{"$error":"#N/A"}},{"$f":"MATCH(\"*\"&I264&\"*\",Sheet1!B:B,0)","v":{"$error":"#N/A"}},4.5,null,"https://www.fairlifts.com/helicopters/guide-to-2023-helicopter-prices/",{"$f":"INDEX('[2]Pt1-AvionicsComponentCosts'!$A:$NE,MATCH(B264,'[2]Pt1-AvionicsComponentCosts'!$A:$A,0),MATCH(\"END MARKER\",'[2]Pt1-AvionicsComponentCosts'!$11:$11,0))","v":282842.80320000002},0.99,0.99,0.62225416704000014]
[null,86,{"$f":"INDEX('[1]Pt1-AvionicsComponentCosts'!$A:$B,MATCH(B265,'[1]Pt1-AvionicsComponentCosts'!$A:$A,0),2)","v":"Helicopter"},"Leonardo",1,"Leonardo AW139","Leonardo AW139","AW139","AW139",{"$f":"MATCH(\"*\"&F265&\"*\",Sheet1!C:C,0)","v":{"$error":"#N/A"}},{"$f":"MATCH(\"*\"&H265&\"*\",Sheet1!C:C,0)","v":{"$error":"#N/A"}},{"$f":"MATCH(\"*\"&I265&\"*\",Sheet1!B:B,0)","v":{"$error":"#N/A"}},11,null,"https://www.bjtonline.com/aircraft/leonardo-helicopters-aw139",{"$f":"INDEX('[2]Pt1-AvionicsComponentCosts'!$A:$NE,MATCH(B265,'[2]Pt1-AvionicsComponentCosts'!$A:$A,0),MATCH(\"END MARKER\",'[2]Pt1-AvionicsComponentCosts'!$11:$11,0))","v":290490.42240000004},0.99,0.99,0.26144138016000001]
[null,134,{"$f":"INDEX('[1]Pt1-AvionicsComponentCosts'!$A:$B,MATCH(B266,'[1]Pt1-AvionicsComponentCosts'!$A:$A,0),2)","v":"Helicopter"},"Leonardo",1,"Leonardo AW159 Lynx","Leonardo AW159 Lynx","AW159 Lynx","AW159 Lynx",{"$f":"MATCH(\"*\"&F266&\"*\",Sheet1!C:C,0)","v":{"$error":"#N/A"}},{"$f":"MATCH(\"*\"&H266&\"*\",Sheet1!C:C,0)","v":{"$error":"#N/A"}},{"$f":"MATCH(\"*\"&I266&\"*\",Sheet1!B:B,0)","v":{"$error":"#N/A"}},27.14,null,"https://aerocorner.com/aircraft/agusta-westland-future-lynx/",{"$f":"INDEX('[2]Pt1-AvionicsComponentCosts'!$A:$NE,MATCH(B266,'[2]Pt1-AvionicsComponentCosts'!$A:$A,0),MATCH(\"END MARKER\",'[2]Pt1-AvionicsComponentCosts'!$11:$11,0))","v":1359332.8281125329},0.99,0.99,0.49585095793345896]
[null,88,{"$f":"INDEX('[1]Pt1-AvionicsComponentCosts'!$A:$B,MATCH(B267,'[1]Pt1-AvionicsComponentCosts'!$A:$A,0),2)","v":"Helicopter"},"Leonardo",1,"Leonardo AW169","Leonardo AW169","AW169","AW169",{"$f":"MATCH(\"*\"&F267&\"*\",Sheet1!C:C,0)","v":{"$error":"#N/A"}},{"$f":"MATCH(\"*\"&H267&\"*\",Sheet1!C:C,0)","v":{"$error":"#N/A"}},{"$f":"MATCH(\"*\"&I267&\"*\",Sheet1!B:B,0)","v":{"$error":"#N/A"}},8,null,"https://www.bjtonline.com/aircraft/leonardo-helicopters-aw169",{"$f":"INDEX('[2]Pt1-AvionicsComponentCosts'!$A:$NE,MATCH(B267,'[2]Pt1-AvionicsComponentCosts'!$A:$A,0),MATCH(\"END MARKER\",'[2]Pt1-AvionicsComponentCosts'!$11:$11,0))","v":712509.51520000002},0.99,0.99,0.88173052506000005]
[null,87,{"$f":"INDEX('[1]Pt1-AvionicsComponentCosts'!$A:$B,MATCH(B268,'[1]Pt1-AvionicsComponentCosts'!$A:$A,0),2)","v":"Helicopter"},"Leonardo",1,"Leonardo AW189","Leonardo AW189","AW189","AW189",{"$f":"MATCH(\"*\"&F268&\"*\",Sheet1!C:C,0)","v":{"$error":"#N/A"}},{"$f":"MATCH(\"*\"&H268&\"*\",Sheet1!C:C,0)","v":{"$error":"#N/A"}},{"$f":"MATCH(\"*\"&I268&\"*\",Sheet1!B:B,0)","v":{"$error":"#N/A"}},16,null,"https://www.businessairnews.com/hb_aircraftpage.html?recnum=AW189",{"$f":"INDEX('[2]Pt1-AvionicsComponentCosts'!$A:$NE,MATCH(B268,'[2]Pt1-AvionicsComponentCosts'!$A:$A,0),MATCH(\"END MARKER\",'[2]Pt1-AvionicsComponentCosts'!$11:$11,0))","v":717412.5808},0.99,0.99,0.44389903437]
[null,96,{"$f":"INDEX('[1]Pt1-AvionicsComponentCosts'!$A:$B,MATCH(B269,'[1]Pt1-AvionicsComponentCosts'!$A:$A,0),2)","v":"Helicopter"},"Leonardo",1,"Leonardo AW609","Leonardo AW609","AW609","AW609",{"$f":"MATCH(\"*\"&F269&\"*\",Sheet1!C:C,0)","v":{"$error":"#N/A"}},{"$f":"MATCH(\"*\"&H269&\"*\",Sheet1!C:C,0)","v":{"$error":"#N/A"}},{"$f":"MATCH(\"*\"&I269&\"*\",Sheet1!B:B,0)","v":{"$error":"#N/A"}},24,null,"https://www.bjtonline.com/business-jet-news/finmeccanicas-aw-609",{"$f":"INDEX('[2]Pt1-AvionicsComponentCosts'!$A:$NE,MATCH(B269,'[2]Pt1-AvionicsComponentCosts'!$A:$A,0),MATCH(\"END MARKER\",'[2]Pt1-AvionicsComponentCosts'!$11:$11,0))","v":761123.00800000003},0.99,0.99,0.31396324079999999]
[null,225,{"$f":"INDEX('[1]Pt1-AvionicsComponentCosts'!$A:$B,MATCH(B270,'[1]Pt1-AvionicsComponentCosts'!$A:$A,0),2)","v":"Turbine GA"},"Let",1,"Let L-410 Turbolet","Let L-410 Turbolet","L-410 Turbolet","L-410 Turbolet",{"$f":"MATCH(\"*\"&F270&\"*\",Sheet1!C:C,0)","v":{"$error":"#N/A"}},{"$f":"MATCH(\"*\"&H270&\"*\",Sheet1!C:C,0)","v":{"$error":"#N/A"}},{"$f":"MATCH(\"*\"&I270&\"*\",Sheet1!B:B,0)","v":{"$error":"#N/A"}},3.5,null,"https://www.paramountbusinessjets.com/private-jet-charter/aircraft/let-l-410",{"$f":"INDEX('[2]Pt1-AvionicsComponentCosts'!$A:$NE,MATCH(B270,'[2]Pt1-AvionicsComponentCosts'!$A:$A,0),MATCH(\"END MARKER\",'[2]Pt1-AvionicsComponentCosts'!$11:$11,0))","v":227116.56319999998},1,1,0.64890446628571419]
[null,658,{"$f":"INDEX('[1]Pt1-AvionicsComponentCosts'!$A:$B,MATCH(B271,'[1]Pt1-AvionicsComponentCosts'!$A:$A,0),2)","v":"Military Transport / Special Mission"},"Lockheed martin/Airbus",1,"A330 LMXT","Lockheed martin/Airbus A330 LMXT","A330 LMXT","A330 LMXT",{"$f":"MATCH(\"*\"&F271&\"*\",Sheet1!C:C,0)","v":{"$error":"#N/A"}},{"$f":"MATCH(\"*\"&H271&\"*\",Sheet1!C:C,0)","v":{"$error":"#N/A"}},{"$f":"MATCH(\"*\"&I271&\"*\",Sheet1!B:B,0)","v":{"$error":"#N/A"}},null,null,null,{"$f":"INDEX('[2]Pt1-AvionicsComponentCosts'!$A:$NE,MATCH(B271,'[2]Pt1-AvionicsComponentCosts'!$A:$A,0),MATCH(\"END MARKER\",'[2]Pt1-AvionicsComponentCosts'!$11:$11,0))","v":3430118.1727780015},1,1,""]
[null,163,{"$f":"INDEX('[1]Pt1-AvionicsComponentCosts'!$A:$B,MATCH(B272,'[1]Pt1-AvionicsComponentCosts'!$A:$A,0),2)","v":"Military Transport / Special Mission"},"Lockheed",1,"C-5","Lockheed C-5 Galaxy","C-5 Galaxy","C-5 Galaxy",{"$f":"MATCH(\"*\"&F272&\"*\",Sheet1!C:C,0)","v":{"$error":"#N/A"}},{"$f":"MATCH(\"*\"&H272&\"*\",Sheet1!C:C,0)","v":{"$error":"#N/A"}},{"$f":"MATCH(\"*\"&I272&\"*\",Sheet1!B:B,0)","v":{"$error":"#N/A"}},null,null,null,{"$f":"INDEX('[2]Pt1-AvionicsComponentCosts'!$A:$NE,MATCH(B272,'[2]Pt1-AvionicsComponentCosts'!$A:$A,0),MATCH(\"END MARKER\",'[2]Pt1-AvionicsComponentCosts'!$11:$11,0))","v":3438674.3211951349},1,1,""]
[null,145,{"$f":"INDEX('[1]Pt1-AvionicsComponentCosts'!$A:$B,MATCH(B273,'[1]Pt1-AvionicsComponentCosts'!$A:$A,0),2)","v":"Fighters and Jet Trainers"},"Lockheed Martin",1,"F-22","Lockheed Martin F-22 Raptor","F-22 Raptor","F-22 Raptor",{"$f":"MATCH(\"*\"&F273&\"*\",Sheet1!C:C,0)","v":{"$error":"#N/A"}},{"$f":"MATCH(\"*\"&H273&\"*\",Sheet1!C:C,0)","v":{"$error":"#N/A"}},{"$f":"MATCH(\"*\"&I273&\"*\",Sheet1!B:B,0)","v":{"$error":"#N/A"}},null,null,null,{"$f":"INDEX('[2]Pt1-AvionicsComponentCosts'!$A:$NE,MATCH(B273,'[2]Pt1-AvionicsComponentCosts'!$A:$A,0),MATCH(\"END MARKER\",'[2]Pt1-AvionicsComponentCosts'!$11:$11,0))","v":3075967.3078523539},1,1,""]
[null,146,{"$f":"INDEX('[1]Pt1-AvionicsComponentCosts'!$A:$B,MATCH(B274,'[1]Pt1-AvionicsComponentCosts'!$A:$A,0),2)","v":"Fighters and Jet Trainers"},"Lockheed Martin",1,"F-35","Lockheed Martin F-35 Lightning II","F-35 Lightning II","F-35 Lightning II",{"$f":"MATCH(\"*\"&F274&\"*\",Sheet1!C:C,0)","v":{"$error":"#N/A"}},{"$f":"MATCH(\"*\"&H274&\"*\",Sheet1!C:C,0)","v":{"$error":"#N/A"}},{"$f":"MATCH(\"*\"&I274&\"*\",Sheet1!B:B,0)","v":{"$error":"#N/A"}},null,null,null,{"$f":"INDEX('[2]Pt1-AvionicsComponentCosts'!$A:$NE,MATCH(B274,'[2]Pt1-AvionicsComponentCosts'!$A:$A,0),MATCH(\"END MARKER\",'[2]Pt1-AvionicsComponentCosts'!$11:$11,0))","v":3777476.304547857},1,1,""]
[null,162,{"$f":"INDEX('[1]Pt1-AvionicsComponentCosts'!$A:$B,MATCH(B275,'[1]Pt1-AvionicsComponentCosts'!$A:$A,0),2)","v":"Military Transport / Special Mission"},"Lockheed Martin",1,"C-130J","Lockheed Martin C-130J Super Hercules","C-130J Super Hercules","C-130J Super Hercules",{"$f":"MATCH(\"*\"&F275&\"*\",Sheet1!C:C,0)","v":{"$error":"#N/A"}},{"$f":"MATCH(\"*\"&H275&\"*\",Sheet1!C:C,0)","v":{"$error":"#N/A"}},{"$f":"MATCH(\"*\"&I275&\"*\",Sheet1!B:B,0)","v":{"$error":"#N/A"}},null,null,null,{"$f":"INDEX('[2]Pt1-AvionicsComponentCosts'!$A:$NE,MATCH(B275,'[2]Pt1-AvionicsComponentCosts'!$A:$A,0),MATCH(\"END MARKER\",'[2]Pt1-AvionicsComponentCosts'!$11:$11,0))","v":2872348.1611773656},1,1,""]
[null,627,{"$f":"INDEX('[1]Pt1-AvionicsComponentCosts'!$A:$B,MATCH(B276,'[1]Pt1-AvionicsComponentCosts'!$A:$A,0),2)","v":"Freighter"},"McDonnell",1,"McDonnell Douglas MD-11","McDonnell Douglas MD-11F/CF","Douglas MD-11F/CF","Douglas MD-11F/CF",{"$f":"MATCH(\"*\"&F276&\"*\",Sheet1!C:C,0)","v":{"$error":"#N/A"}},{"$f":"MATCH(\"*\"&H276&\"*\",Sheet1!C:C,0)","v":{"$error":"#N/A"}},{"$f":"MATCH(\"*\"&I276&\"*\",Sheet1!B:B,0)","v":{"$error":"#N/A"}},null,null,null,{"$f":"INDEX('[2]Pt1-AvionicsComponentCosts'!$A:$NE,MATCH(B276,'[2]Pt1-AvionicsComponentCosts'!$A:$A,0),MATCH(\"END MARKER\",'[2]Pt1-AvionicsComponentCosts'!$11:$11,0))","v":1938483.0768000002},0.5,0.5,""]
[null,619,{"$f":"INDEX('[1]Pt1-AvionicsComponentCosts'!$A:$B,MATCH(B277,'[1]Pt1-AvionicsComponentCosts'!$A:$A,0),2)","v":"Military Transport / Special Mission"},"McDonnell",1,"McDonnell Douglas KC-10","McDonnell Douglas KC-10","Douglas KC-10","Douglas KC-10",{"$f":"MATCH(\"*\"&F277&\"*\",Sheet1!C:C,0)","v":{"$error":"#N/A"}},{"$f":"MATCH(\"*\"&H277&\"*\",Sheet1!C:C,0)","v":{"$error":"#N/A"}},{"$f":"MATCH(\"*\"&I277&\"*\",Sheet1!B:B,0)","v":{"$error":"#N/A"}},null,null,null,{"$f":"INDEX('[2]Pt1-AvionicsComponentCosts'!$A:$NE,MATCH(B277,'[2]Pt1-AvionicsComponentCosts'!$A:$A,0),MATCH(\"END MARKER\",'[2]Pt1-AvionicsComponentCosts'!$11:$11,0))","v":3432488.4795769434},1,1,""]
[null,139,{"$f":"INDEX('[1]Pt1-AvionicsComponentCosts'!$A:$B,MATCH(B278,'[1]Pt1-AvionicsComponentCosts'!$A:$A,0),2)","v":"Fighters and Jet Trainers"},"McDonnell Douglas",1,"F-15","McDonnell Douglas F-15 Eagle","F-15 Eagle","F-15 Eagle",{"$f":"MATCH(\"*\"&F278&\"*\",Sheet1!C:C,0)","v":{"$error":"#N/A"}},{"$f":"MATCH(\"*\"&H278&\"*\",Sheet1!C:C,0)","v":{"$error":"#N/A"}},{"$f":"MATCH(\"*\"&I278&\"*\",Sheet1!B:B,0)","v":{"$error":"#N/A"}},null,null,null,{"$f":"INDEX('[2]Pt1-AvionicsComponentCosts'!$A:$NE,MATCH(B278,'[2]Pt1-AvionicsComponentCosts'!$A:$A,0),MATCH(\"END MARKER\",'[2]Pt1-AvionicsComponentCosts'!$11:$11,0))","v":3356323.414375463},1,1,""]
[null,168,{"$f":"INDEX('[1]Pt1-AvionicsComponentCosts'!$A:$B,MATCH(B279,'[1]Pt1-AvionicsComponentCosts'!$A:$A,0),2)","v":"Fighters and Jet Trainers"},"McDonnell Douglas",1,"T-45","McDonnell Douglas T-45 Goshawk","T-45 Goshawk","T-45 Goshawk",{"$f":"MATCH(\"*\"&F279&\"*\",Sheet1!C:C,0)","v":{"$error":"#N/A"}},{"$f":"MATCH(\"*\"&H279&\"*\",Sheet1!C:C,0)","v":{"$error":"#N/A"}},{"$f":"MATCH(\"*\"&I279&\"*\",Sheet1!B:B,0)","v":{"$error":"#N/A"}},null,null,null,{"$f":"INDEX('[2]Pt1-AvionicsComponentCosts'!$A:$NE,MATCH(B279,'[2]Pt1-AvionicsComponentCosts'!$A:$A,0),MATCH(\"END MARKER\",'[2]Pt1-AvionicsComponentCosts'!$11:$11,0))","v":1295662.9234796404},1,1,""]
[null,120,{"$f":"INDEX('[1]Pt1-AvionicsComponentCosts'!$A:$B,MATCH(B280,'[1]Pt1-AvionicsComponentCosts'!$A:$A,0),2)","v":"Helicopter"},"MD",1,"MD 500/600","MD Helicopters MD 500/600","Helicopters 500/600","Helicopters 500/600",{"$f":"MATCH(\"*\"&F280&\"*\",Sheet1!C:C,0)","v":{"$error":"#N/A"}},{"$f":"MATCH(\"*\"&H280&\"*\",Sheet1!C:C,0)","v":{"$error":"#N/A"}},{"$f":"MATCH(\"*\"&I280&\"*\",Sheet1!B:B,0)","v":{"$error":"#N/A"}},1.8,null,"https://www.fairlifts.com/helicopters/guide-to-2023-helicopter-prices/",{"$f":"INDEX('[2]Pt1-AvionicsComponentCosts'!$A:$NE,MATCH(B280,'[2]Pt1-AvionicsComponentCosts'!$A:$A,0),MATCH(\"END MARKER\",'[2]Pt1-AvionicsComponentCosts'!$11:$11,0))","v":281464.57920000004},0.99,0.99,1.5480551856000002]
[null,119,{"$f":"INDEX('[1]Pt1-AvionicsComponentCosts'!$A:$B,MATCH(B281,'[1]Pt1-AvionicsComponentCosts'!$A:$A,0),2)","v":"Helicopter"},"MD",1,"MD Explorer","MD Helicopters MD Explorer","Helicopters Explorer","Helicopters Explorer",{"$f":"MATCH(\"*\"&F281&\"*\",Sheet1!C:C,0)","v":{"$error":"#N/A"}},{"$f":"MATCH(\"*\"&H281&\"*\",Sheet1!C:C,0)","v":{"$error":"#N/A"}},{"$f":"MATCH(\"*\"&I281&\"*\",Sheet1!B:B,0)","v":{"$error":"#N/A"}},7.5,null,"https://www.paramountbusinessjets.com/private-jet-charter/aircraft/mcdonnell-douglas-md-902-explorer",{"$f":"INDEX('[2]Pt1-AvionicsComponentCosts'!$A:$NE,MATCH(B281,'[2]Pt1-AvionicsComponentCosts'!$A:$A,0),MATCH(\"END MARKER\",'[2]Pt1-AvionicsComponentCosts'!$11:$11,0))","v":283565.28960000002},0.99,0.99,0.37430618227200002]
[null,147,{"$f":"INDEX('[1]Pt1-AvionicsComponentCosts'!$A:$B,MATCH(B282,'[1]Pt1-AvionicsComponentCosts'!$A:$A,0),2)","v":"Fighters and Jet Trainers"},"Mitsubishi",1,"Mitsubishi F-2","Mitsubishi F-2","F-2","F-2",{"$f":"MATCH(\"*\"&F282&\"*\",Sheet1!C:C,0)","v":{"$error":"#N/A"}},{"$f":"MATCH(\"*\"&H282&\"*\",Sheet1!C:C,0)","v":{"$error":"#N/A"}},{"$f":"MATCH(\"*\"&I282&\"*\",Sheet1!B:B,0)","v":{"$error":"#N/A"}},null,null,null,{"$f":"INDEX('[2]Pt1-AvionicsComponentCosts'!$A:$NE,MATCH(B282,'[2]Pt1-AvionicsComponentCosts'!$A:$A,0),MATCH(\"END MARKER\",'[2]Pt1-AvionicsComponentCosts'!$11:$11,0))","v":2993481.5887754629},1,1,""]
[null,449,{"$f":"INDEX('[1]Pt1-AvionicsComponentCosts'!$A:$B,MATCH(B283,'[1]Pt1-AvionicsComponentCosts'!$A:$A,0),2)","v":"UAV"},"MQ-4C",1,"MQ-4C Triton","MQ-4C Triton","Triton","Triton",{"$f":"MATCH(\"*\"&F283&\"*\",Sheet1!C:C,0)","v":{"$error":"#N/A"}},{"$f":"MATCH(\"*\"&H283&\"*\",Sheet1!C:C,0)","v":{"$error":"#N/A"}},{"$f":"MATCH(\"*\"&I283&\"*\",Sheet1!B:B,0)","v":{"$error":"#N/A"}},null,null,null,{"$f":"INDEX('[2]Pt1-AvionicsComponentCosts'!$A:$NE,MATCH(B283,'[2]Pt1-AvionicsComponentCosts'!$A:$A,0),MATCH(\"END MARKER\",'[2]Pt1-AvionicsComponentCosts'!$11:$11,0))","v":1022235.4122686401},1,1,""]
[null,903,{"$f":"INDEX('[1]Pt1-AvionicsComponentCosts'!$A:$B,MATCH(B284,'[1]Pt1-AvionicsComponentCosts'!$A:$A,0),2)","v":"UAV"},"MQ-8",1,"MQ-8","MQ-8","","",{"$f":"MATCH(\"*\"&F284&\"*\",Sheet1!C:C,0)","v":{"$error":"#N/A"}},{"$f":"MATCH(\"*\"&H284&\"*\",Sheet1!C:C,0)","v":1},{"$f":"MATCH(\"*\"&I284&\"*\",Sheet1!B:B,0)","v":1},null,null,null,{"$f":"INDEX('[2]Pt1-AvionicsComponentCosts'!$A:$NE,MATCH(B284,'[2]Pt1-AvionicsComponentCosts'!$A:$A,0),MATCH(\"END MARKER\",'[2]Pt1-AvionicsComponentCosts'!$11:$11,0))","v":914017},1,1,""]
[null,450,{"$f":"INDEX('[1]Pt1-AvionicsComponentCosts'!$A:$B,MATCH(B285,'[1]Pt1-AvionicsComponentCosts'!$A:$A,0),2)","v":"UAV"},"MQ-9",1,"MQ-9 Reaper","MQ-9 Reaper","Reaper","Reaper",{"$f":"MATCH(\"*\"&F285&\"*\",Sheet1!C:C,0)","v":{"$error":"#N/A"}},{"$f":"MATCH(\"*\"&H285&\"*\",Sheet1!C:C,0)","v":{"$error":"#N/A"}},{"$f":"MATCH(\"*\"&I285&\"*\",Sheet1!B:B,0)","v":{"$error":"#N/A"}},null,null,null,{"$f":"INDEX('[2]Pt1-AvionicsComponentCosts'!$A:$NE,MATCH(B285,'[2]Pt1-AvionicsComponentCosts'!$A:$A,0),MATCH(\"END MARKER\",'[2]Pt1-AvionicsComponentCosts'!$11:$11,0))","v":1022235.4122686401},1,1,""]
[null,180,{"$f":"INDEX('[1]Pt1-AvionicsComponentCosts'!$A:$B,MATCH(B286,'[1]Pt1-AvionicsComponentCosts'!$A:$A,0),2)","v":"Business Jet"},"Nextant Aerospace - Nextant",1,"Nextant 400XT","Nextant Aerospace - Nextant 400XT Aircraft","400XT Aircraft","400XT Aircraft",{"$f":"MATCH(\"*\"&F286&\"*\",Sheet1!C:C,0)","v":{"$error":"#N/A"}},{"$f":"MATCH(\"*\"&H286&\"*\",Sheet1!C:C,0)","v":{"$error":"#N/A"}},{"$f":"MATCH(\"*\"&I286&\"*\",Sheet1!B:B,0)","v":{"$error":"#N/A"}},null,null,null,{"$f":"INDEX('[2]Pt1-AvionicsComponentCosts'!$A:$NE,MATCH(B286,'[2]Pt1-AvionicsComponentCosts'!$A:$A,0),MATCH(\"END MARKER\",'[2]Pt1-AvionicsComponentCosts'!$11:$11,0))","v":226255.33600000004},0.75,0.75,""]
[null,122,{"$f":"INDEX('[1]Pt1-AvionicsComponentCosts'!$A:$B,MATCH(B287,'[1]Pt1-AvionicsComponentCosts'!$A:$A,0),2)","v":"Helicopter"},"NHIndustries",1,"NH90","NHIndustries NATO Frigate Helicopter","NATO Frigate Helicopter","NATO Frigate Helicopter",{"$f":"MATCH(\"*\"&F287&\"*\",Sheet1!C:C,0)","v":{"$error":"#N/A"}},{"$f":"MATCH(\"*\"&H287&\"*\",Sheet1!C:C,0)","v":{"$error":"#N/A"}},{"$f":"MATCH(\"*\"&I287&\"*\",Sheet1!B:B,0)","v":{"$error":"#N/A"}},56,null,"https://aerocorner.com/aircraft/nhi-nh90-nfh/",{"$f":"INDEX('[2]Pt1-AvionicsComponentCosts'!$A:$NE,MATCH(B287,'[2]Pt1-AvionicsComponentCosts'!$A:$A,0),MATCH(\"END MARKER\",'[2]Pt1-AvionicsComponentCosts'!$11:$11,0))","v":1483865.225675304},0.99,0.99,0.26232617382474127]
[null,638,{"$f":"INDEX('[1]Pt1-AvionicsComponentCosts'!$A:$B,MATCH(B288,'[1]Pt1-AvionicsComponentCosts'!$A:$A,0),2)","v":"Helicopter"},"NHIndustries",1,"NH90","NHIndustries Tactical Transport Helicopter","Tactical Transport Helicopter","Tactical Transport Helicopter",{"$f":"MATCH(\"*\"&F288&\"*\",Sheet1!C:C,0)","v":{"$error":"#N/A"}},{"$f":"MATCH(\"*\"&H288&\"*\",Sheet1!C:C,0)","v":{"$error":"#N/A"}},{"$f":"MATCH(\"*\"&I288&\"*\",Sheet1!B:B,0)","v":{"$error":"#N/A"}},null,null,null,{"$f":"INDEX('[2]Pt1-AvionicsComponentCosts'!$A:$NE,MATCH(B288,'[2]Pt1-AvionicsComponentCosts'!$A:$A,0),MATCH(\"END MARKER\",'[2]Pt1-AvionicsComponentCosts'!$11:$11,0))","v":1479248.4704753042},0.99,0.99,""]
[null,149,{"$f":"INDEX('[1]Pt1-AvionicsComponentCosts'!$A:$B,MATCH(B289,'[1]Pt1-AvionicsComponentCosts'!$A:$A,0),2)","v":"Fighters and Jet Trainers"},"Northrop Grumman",1,"B-21","Northrop Grumman B-21 Raider","B-21 Raider","B-21 Raider",{"$f":"MATCH(\"*\"&F289&\"*\",Sheet1!C:C,0)","v":{"$error":"#N/A"}},{"$f":"MATCH(\"*\"&H289&\"*\",Sheet1!C:C,0)","v":{"$error":"#N/A"}},{"$f":"MATCH(\"*\"&I289&\"*\",Sheet1!B:B,0)","v":{"$error":"#N/A"}},null,null,null,{"$f":"INDEX('[2]Pt1-AvionicsComponentCosts'!$A:$NE,MATCH(B289,'[2]Pt1-AvionicsComponentCosts'!$A:$A,0),MATCH(\"END MARKER\",'[2]Pt1-AvionicsComponentCosts'!$11:$11,0))","v":3075967.3078523539},1,1,""]
[null,164,{"$f":"INDEX('[1]Pt1-AvionicsComponentCosts'!$A:$B,MATCH(B290,'[1]Pt1-AvionicsComponentCosts'!$A:$A,0),2)","v":"Military Transport / Special Mission"},"Northrop Grumman",1,"E-2","Northrop Grumman E-2 Hawkeye","E-2 Hawkeye","E-2 Hawkeye",{"$f":"MATCH(\"*\"&F290&\"*\",Sheet1!C:C,0)","v":{"$error":"#N/A"}},{"$f":"MATCH(\"*\"&H290&\"*\",Sheet1!C:C,0)","v":{"$error":"#N/A"}},{"$f":"MATCH(\"*\"&I290&\"*\",Sheet1!B:B,0)","v":{"$error":"#N/A"}},null,null,null,{"$f":"INDEX('[2]Pt1-AvionicsComponentCosts'!$A:$NE,MATCH(B290,'[2]Pt1-AvionicsComponentCosts'!$A:$A,0),MATCH(\"END MARKER\",'[2]Pt1-AvionicsComponentCosts'!$11:$11,0))","v":3362939.628395135},1,1,""]
[null,905,{"$f":"INDEX('[1]Pt1-AvionicsComponentCosts'!$A:$B,MATCH(B291,'[1]Pt1-AvionicsComponentCosts'!$A:$A,0),2)","v":"UAV"},"Other",1,"Other CUAV","Other CUAV","CUAV","CUAV",{"$f":"MATCH(\"*\"&F291&\"*\",Sheet1!C:C,0)","v":{"$error":"#N/A"}},{"$f":"MATCH(\"*\"&H291&\"*\",Sheet1!C:C,0)","v":{"$error":"#N/A"}},{"$f":"MATCH(\"*\"&I291&\"*\",Sheet1!B:B,0)","v":{"$error":"#N/A"}},null,null,null,{"$f":"INDEX('[2]Pt1-AvionicsComponentCosts'!$A:$NE,MATCH(B291,'[2]Pt1-AvionicsComponentCosts'!$A:$A,0),MATCH(\"END MARKER\",'[2]Pt1-AvionicsComponentCosts'!$11:$11,0))","v":914017},1,1,""]
[null,904,{"$f":"INDEX('[1]Pt1-AvionicsComponentCosts'!$A:$B,MATCH(B292,'[1]Pt1-AvionicsComponentCosts'!$A:$A,0),2)","v":"UAV"},"Other",1,"Other VTUAV","Other VTUAV","VTUAV","VTUAV",{"$f":"MATCH(\"*\"&F292&\"*\",Sheet1!C:C,0)","v":{"$error":"#N/A"}},{"$f":"MATCH(\"*\"&H292&\"*\",Sheet1!C:C,0)","v":{"$error":"#N/A"}},{"$f":"MATCH(\"*\"&I292&\"*\",Sheet1!B:B,0)","v":{"$error":"#N/A"}},null,null,null,{"$f":"INDEX('[2]Pt1-AvionicsComponentCosts'!$A:$NE,MATCH(B292,'[2]Pt1-AvionicsComponentCosts'!$A:$A,0),MATCH(\"END MARKER\",'[2]Pt1-AvionicsComponentCosts'!$11:$11,0))","v":914017},1,1,""]
[null,902,{"$f":"INDEX('[1]Pt1-AvionicsComponentCosts'!$A:$B,MATCH(B293,'[1]Pt1-AvionicsComponentCosts'!$A:$A,0),2)","v":"UAV"},"Other MALE/HALE",1,"Other MALE/HALE","Other MALE/HALE","","",{"$f":"MATCH(\"*\"&F293&\"*\",Sheet1!C:C,0)","v":{"$error":"#N/A"}},{"$f":"MATCH(\"*\"&H293&\"*\",Sheet1!C:C,0)","v":1},{"$f":"MATCH(\"*\"&I293&\"*\",Sheet1!B:B,0)","v":1},null,null,null,{"$f":"INDEX('[2]Pt1-AvionicsComponentCosts'!$A:$NE,MATCH(B293,'[2]Pt1-AvionicsComponentCosts'!$A:$A,0),MATCH(\"END MARKER\",'[2]Pt1-AvionicsComponentCosts'!$11:$11,0))","v":914017},1,1,""]
[null,907,{"$f":"INDEX('[1]Pt1-AvionicsComponentCosts'!$A:$B,MATCH(B294,'[1]Pt1-AvionicsComponentCosts'!$A:$A,0),2)","v":"UAV"},"Other TUAV",1,"Other TUAV","Other TUAV","","",{"$f":"MATCH(\"*\"&F294&\"*\",Sheet1!C:C,0)","v":{"$error":"#N/A"}},{"$f":"MATCH(\"*\"&H294&\"*\",Sheet1!C:C,0)","v":1},{"$f":"MATCH(\"*\"&I294&\"*\",Sheet1!B:B,0)","v":1},null,null,null,{"$f":"INDEX('[2]Pt1-AvionicsComponentCosts'!$A:$NE,MATCH(B294,'[2]Pt1-AvionicsComponentCosts'!$A:$A,0),MATCH(\"END MARKER\",'[2]Pt1-AvionicsComponentCosts'!$11:$11,0))","v":914017},1,1,""]
[null,227,{"$f":"INDEX('[1]Pt1-AvionicsComponentCosts'!$A:$B,MATCH(B295,'[1]Pt1-AvionicsComponentCosts'!$A:$A,0),2)","v":"Turboprop Trainers / Light Attack"},"Other Turboprop trainers",1,"Other Turboprop trainers/light attack","Other Turboprop trainers/light attack","/light attack","/light attack",{"$f":"MATCH(\"*\"&F295&\"*\",Sheet1!C:C,0)","v":{"$error":"#N/A"}},{"$f":"MATCH(\"*\"&H295&\"*\",Sheet1!C:C,0)","v":{"$error":"#N/A"}},{"$f":"MATCH(\"*\"&I295&\"*\",Sheet1!B:B,0)","v":{"$error":"#N/A"}},null,null,null,{"$f":"INDEX('[2]Pt1-AvionicsComponentCosts'!$A:$NE,MATCH(B295,'[2]Pt1-AvionicsComponentCosts'!$A:$A,0),MATCH(\"END MARKER\",'[2]Pt1-AvionicsComponentCosts'!$11:$11,0))","v":501568.0706686409},1,1,""]
[null,546,{"$f":"INDEX('[1]Pt1-AvionicsComponentCosts'!$A:$B,MATCH(B296,'[1]Pt1-AvionicsComponentCosts'!$A:$A,0),2)","v":"Turbine GA"},"PAC",1,"PAC P-750 XSTOL","PAC P-750 XSTOL","P-750 XSTOL","P-750 XSTOL",{"$f":"MATCH(\"*\"&F296&\"*\",Sheet1!C:C,0)","v":{"$error":"#N/A"}},{"$f":"MATCH(\"*\"&H296&\"*\",Sheet1!C:C,0)","v":{"$error":"#N/A"}},{"$f":"MATCH(\"*\"&I296&\"*\",Sheet1!B:B,0)","v":{"$error":"#N/A"}},null,null,null,{"$f":"INDEX('[2]Pt1-AvionicsComponentCosts'!$A:$NE,MATCH(B296,'[2]Pt1-AvionicsComponentCosts'!$A:$A,0),MATCH(\"END MARKER\",'[2]Pt1-AvionicsComponentCosts'!$11:$11,0))","v":221828.76800000004},1,1,""]
[null,75,{"$f":"INDEX('[1]Pt1-AvionicsComponentCosts'!$A:$B,MATCH(B297,'[1]Pt1-AvionicsComponentCosts'!$A:$A,0),2)","v":"Turbine GA"},"Piaggio",1,"Piaggio P.180 Avanti","Piaggio P.180 Avanti","P.180 Avanti","P.180 Avanti",{"$f":"MATCH(\"*\"&F297&\"*\",Sheet1!C:C,0)","v":{"$error":"#N/A"}},{"$f":"MATCH(\"*\"&H297&\"*\",Sheet1!C:C,0)","v":{"$error":"#N/A"}},{"$f":"MATCH(\"*\"&I297&\"*\",Sheet1!B:B,0)","v":{"$error":"#N/A"}},null,null,null,{"$f":"INDEX('[2]Pt1-AvionicsComponentCosts'!$A:$NE,MATCH(B297,'[2]Pt1-AvionicsComponentCosts'!$A:$A,0),MATCH(\"END MARKER\",'[2]Pt1-AvionicsComponentCosts'!$11:$11,0))","v":221828.76800000004},1,1,""]
[null,71,{"$f":"INDEX('[1]Pt1-AvionicsComponentCosts'!$A:$B,MATCH(B298,'[1]Pt1-AvionicsComponentCosts'!$A:$A,0),2)","v":"Business Jet"},"Pilatus",1,"PC-24","Pilatus PC-24","PC-24","PC-24",{"$f":"MATCH(\"*\"&F298&\"*\",Sheet1!C:C,0)","v":{"$error":"#N/A"}},{"$f":"MATCH(\"*\"&H298&\"*\",Sheet1!C:C,0)","v":{"$error":"#N/A"}},{"$f":"MATCH(\"*\"&I298&\"*\",Sheet1!B:B,0)","v":{"$error":"#N/A"}},null,null,null,{"$f":"INDEX('[2]Pt1-AvionicsComponentCosts'!$A:$NE,MATCH(B298,'[2]Pt1-AvionicsComponentCosts'!$A:$A,0),MATCH(\"END MARKER\",'[2]Pt1-AvionicsComponentCosts'!$11:$11,0))","v":674096.54080000008},0.75,0.75,""]
[null,77,{"$f":"INDEX('[1]Pt1-AvionicsComponentCosts'!$A:$B,MATCH(B299,'[1]Pt1-AvionicsComponentCosts'!$A:$A,0),2)","v":"Turbine GA"},"Pilatus",1,"Pilatus PC-12","Pilatus PC-12","PC-12","PC-12",{"$f":"MATCH(\"*\"&F299&\"*\",Sheet1!C:C,0)","v":{"$error":"#N/A"}},{"$f":"MATCH(\"*\"&H299&\"*\",Sheet1!C:C,0)","v":{"$error":"#N/A"}},{"$f":"MATCH(\"*\"&I299&\"*\",Sheet1!B:B,0)","v":{"$error":"#N/A"}},null,null,null,{"$f":"INDEX('[2]Pt1-AvionicsComponentCosts'!$A:$NE,MATCH(B299,'[2]Pt1-AvionicsComponentCosts'!$A:$A,0),MATCH(\"END MARKER\",'[2]Pt1-AvionicsComponentCosts'!$11:$11,0))","v":227116.56319999998},1,1,""]
[null,177,{"$f":"INDEX('[1]Pt1-AvionicsComponentCosts'!$A:$B,MATCH(B300,'[1]Pt1-AvionicsComponentCosts'!$A:$A,0),2)","v":"Turboprop Trainers / Light Attack"},"Pilatus",1,"PC-7","Pilatus PC-7 Mk II","PC-7 Mk II","PC-7 Mk II",{"$f":"MATCH(\"*\"&F300&\"*\",Sheet1!C:C,0)","v":{"$error":"#N/A"}},{"$f":"MATCH(\"*\"&H300&\"*\",Sheet1!C:C,0)","v":{"$error":"#N/A"}},{"$f":"MATCH(\"*\"&I300&\"*\",Sheet1!B:B,0)","v":{"$error":"#N/A"}},null,null,null,{"$f":"INDEX('[2]Pt1-AvionicsComponentCosts'!$A:$NE,MATCH(B300,'[2]Pt1-AvionicsComponentCosts'!$A:$A,0),MATCH(\"END MARKER\",'[2]Pt1-AvionicsComponentCosts'!$11:$11,0))","v":500967.4898686409},1,1,""]
[null,178,{"$f":"INDEX('[1]Pt1-AvionicsComponentCosts'!$A:$B,MATCH(B301,'[1]Pt1-AvionicsComponentCosts'!$A:$A,0),2)","v":"Turboprop Trainers / Light Attack"},"Pilatus",1,"PC-9","Pilatus PC-9/PC-21","PC-9/PC-21","PC-9/PC-21",{"$f":"MATCH(\"*\"&F301&\"*\",Sheet1!C:C,0)","v":{"$error":"#N/A"}},{"$f":"MATCH(\"*\"&H301&\"*\",Sheet1!C:C,0)","v":{"$error":"#N/A"}},{"$f":"MATCH(\"*\"&I301&\"*\",Sheet1!B:B,0)","v":{"$error":"#N/A"}},null,null,null,{"$f":"INDEX('[2]Pt1-AvionicsComponentCosts'!$A:$NE,MATCH(B301,'[2]Pt1-AvionicsComponentCosts'!$A:$A,0),MATCH(\"END MARKER\",'[2]Pt1-AvionicsComponentCosts'!$11:$11,0))","v":503973.74906864087},1,1,""]
[null,76,{"$f":"INDEX('[1]Pt1-AvionicsComponentCosts'!$A:$B,MATCH(B302,'[1]Pt1-AvionicsComponentCosts'!$A:$A,0),2)","v":"Turbine GA"},"Piper",1,"Piper PA-46","Piper PA-46","PA-46","PA-46",{"$f":"MATCH(\"*\"&F302&\"*\",Sheet1!C:C,0)","v":{"$error":"#N/A"}},{"$f":"MATCH(\"*\"&H302&\"*\",Sheet1!C:C,0)","v":{"$error":"#N/A"}},{"$f":"MATCH(\"*\"&I302&\"*\",Sheet1!B:B,0)","v":{"$error":"#N/A"}},null,null,null,{"$f":"INDEX('[2]Pt1-AvionicsComponentCosts'!$A:$NE,MATCH(B302,'[2]Pt1-AvionicsComponentCosts'!$A:$A,0),MATCH(\"END MARKER\",'[2]Pt1-AvionicsComponentCosts'!$11:$11,0))","v":224112.54079999996},1,1,""]
[null,186,{"$f":"INDEX('[1]Pt1-AvionicsComponentCosts'!$A:$B,MATCH(B303,'[1]Pt1-AvionicsComponentCosts'!$A:$A,0),2)","v":"Turbine GA"},"PT6A powered",1,"PT6A powered light aircraft","many and various using the Pratt & Whitney Canada PT6A","many and various using the Pratt & Whitney Canada PT6A","many and various using the Pratt & Whitney Canada PT6A",{"$f":"MATCH(\"*\"&F303&\"*\",Sheet1!C:C,0)","v":{"$error":"#N/A"}},{"$f":"MATCH(\"*\"&H303&\"*\",Sheet1!C:C,0)","v":{"$error":"#N/A"}},{"$f":"MATCH(\"*\"&I303&\"*\",Sheet1!B:B,0)","v":{"$error":"#N/A"}},null,null,null,{"$f":"INDEX('[2]Pt1-AvionicsComponentCosts'!$A:$NE,MATCH(B303,'[2]Pt1-AvionicsComponentCosts'!$A:$A,0),MATCH(\"END MARKER\",'[2]Pt1-AvionicsComponentCosts'!$11:$11,0))","v":221828.76800000004},1,1,""]
[null,547,{"$f":"INDEX('[1]Pt1-AvionicsComponentCosts'!$A:$B,MATCH(B304,'[1]Pt1-AvionicsComponentCosts'!$A:$A,0),2)","v":"Turbine GA"},"Quest",1,"Quest Kodiak","Quest Kodiak","Kodiak","Kodiak",{"$f":"MATCH(\"*\"&F304&\"*\",Sheet1!C:C,0)","v":{"$error":"#N/A"}},{"$f":"MATCH(\"*\"&H304&\"*\",Sheet1!C:C,0)","v":{"$error":"#N/A"}},{"$f":"MATCH(\"*\"&I304&\"*\",Sheet1!B:B,0)","v":{"$error":"#N/A"}},3.5,null,"https://www.aopa.org/news-and-media/all-news/2022/july/25/larger-faster-kodiak-unveiled",{"$f":"INDEX('[2]Pt1-AvionicsComponentCosts'!$A:$NE,MATCH(B304,'[2]Pt1-AvionicsComponentCosts'!$A:$A,0),MATCH(\"END MARKER\",'[2]Pt1-AvionicsComponentCosts'!$11:$11,0))","v":221828.76800000004},1,1,0.63379648000000011]
[null,79,{"$f":"INDEX('[1]Pt1-AvionicsComponentCosts'!$A:$B,MATCH(B305,'[1]Pt1-AvionicsComponentCosts'!$A:$A,0),2)","v":"Turbine GA"},"Reims-Cessna",1,"Reims-Cessna F406 Caravan II","Reims-Cessna F406 Caravan II","F406 Caravan II","F406 Caravan II",{"$f":"MATCH(\"*\"&F305&\"*\",Sheet1!C:C,0)","v":{"$error":"#N/A"}},{"$f":"MATCH(\"*\"&H305&\"*\",Sheet1!C:C,0)","v":{"$error":"#N/A"}},{"$f":"MATCH(\"*\"&I305&\"*\",Sheet1!B:B,0)","v":{"$error":"#N/A"}},null,null,null,{"$f":"INDEX('[2]Pt1-AvionicsComponentCosts'!$A:$NE,MATCH(B305,'[2]Pt1-AvionicsComponentCosts'!$A:$A,0),MATCH(\"END MARKER\",'[2]Pt1-AvionicsComponentCosts'!$11:$11,0))","v":221828.76800000004},1,1,""]
[null,124,{"$f":"INDEX('[1]Pt1-AvionicsComponentCosts'!$A:$B,MATCH(B306,'[1]Pt1-AvionicsComponentCosts'!$A:$A,0),2)","v":"Helicopter"},"Robinson",1,"R66","Robinson R66","R66","R66",{"$f":"MATCH(\"*\"&F306&\"*\",Sheet1!C:C,0)","v":{"$error":"#N/A"}},{"$f":"MATCH(\"*\"&H306&\"*\",Sheet1!C:C,0)","v":{"$error":"#N/A"}},{"$f":"MATCH(\"*\"&I306&\"*\",Sheet1!B:B,0)","v":{"$error":"#N/A"}},0.95,null,"https://www.fairlifts.com/helicopters/guide-to-2023-helicopter-prices/",{"$f":"INDEX('[2]Pt1-AvionicsComponentCosts'!$A:$NE,MATCH(B306,'[2]Pt1-AvionicsComponentCosts'!$A:$A,0),MATCH(\"END MARKER\",'[2]Pt1-AvionicsComponentCosts'!$11:$11,0))","v":161200.88},0.99,0.99,1.6798828547368421]
[null,452,{"$f":"INDEX('[1]Pt1-AvionicsComponentCosts'!$A:$B,MATCH(B307,'[1]Pt1-AvionicsComponentCosts'!$A:$A,0),2)","v":"UAV"},"RQ-4A",1,"RQ-4A Global Hawk","RQ-4A Global Hawk","Global Hawk","Global Hawk",{"$f":"MATCH(\"*\"&F307&\"*\",Sheet1!C:C,0)","v":{"$error":"#N/A"}},{"$f":"MATCH(\"*\"&H307&\"*\",Sheet1!C:C,0)","v":{"$error":"#N/A"}},{"$f":"MATCH(\"*\"&I307&\"*\",Sheet1!B:B,0)","v":{"$error":"#N/A"}},null,null,null,{"$f":"INDEX('[2]Pt1-AvionicsComponentCosts'!$A:$NE,MATCH(B307,'[2]Pt1-AvionicsComponentCosts'!$A:$A,0),MATCH(\"END MARKER\",'[2]Pt1-AvionicsComponentCosts'!$11:$11,0))","v":1022235.4122686401},1,1,""]
[null,906,{"$f":"INDEX('[1]Pt1-AvionicsComponentCosts'!$A:$B,MATCH(B308,'[1]Pt1-AvionicsComponentCosts'!$A:$A,0),2)","v":"UAV"},"RQ-7",1,"RQ-7 Shadow","RQ-7 Shadow","Shadow","Shadow",{"$f":"MATCH(\"*\"&F308&\"*\",Sheet1!C:C,0)","v":{"$error":"#N/A"}},{"$f":"MATCH(\"*\"&H308&\"*\",Sheet1!C:C,0)","v":{"$error":"#N/A"}},{"$f":"MATCH(\"*\"&I308&\"*\",Sheet1!B:B,0)","v":{"$error":"#N/A"}},null,null,null,{"$f":"INDEX('[2]Pt1-AvionicsComponentCosts'!$A:$NE,MATCH(B308,'[2]Pt1-AvionicsComponentCosts'!$A:$A,0),MATCH(\"END MARKER\",'[2]Pt1-AvionicsComponentCosts'!$11:$11,0))","v":914017},1,1,""]
[null,148,{"$f":"INDEX('[1]Pt1-AvionicsComponentCosts'!$A:$B,MATCH(B309,'[1]Pt1-AvionicsComponentCosts'!$A:$A,0),2)","v":"Fighters and Jet Trainers"},"Saab",1,"Gripen","Saab JAS 39 Gripen","JAS 39 Gripen","JAS 39 Gripen",{"$f":"MATCH(\"*\"&F309&\"*\",Sheet1!C:C,0)","v":{"$error":"#N/A"}},{"$f":"MATCH(\"*\"&H309&\"*\",Sheet1!C:C,0)","v":{"$error":"#N/A"}},{"$f":"MATCH(\"*\"&I309&\"*\",Sheet1!B:B,0)","v":{"$error":"#N/A"}},null,null,null,{"$f":"INDEX('[2]Pt1-AvionicsComponentCosts'!$A:$NE,MATCH(B309,'[2]Pt1-AvionicsComponentCosts'!$A:$A,0),MATCH(\"END MARKER\",'[2]Pt1-AvionicsComponentCosts'!$11:$11,0))","v":2985667.3279754627},1,1,""]
[null,181,{"$f":"INDEX('[1]Pt1-AvionicsComponentCosts'!$A:$B,MATCH(B310,'[1]Pt1-AvionicsComponentCosts'!$A:$A,0),2)","v":"Military Transport / Special Mission"},"ShinMaywa",1,"ShinMaywa US-2","ShinMaywa US-2","US-2","US-2",{"$f":"MATCH(\"*\"&F310&\"*\",Sheet1!C:C,0)","v":{"$error":"#N/A"}},{"$f":"MATCH(\"*\"&H310&\"*\",Sheet1!C:C,0)","v":{"$error":"#N/A"}},{"$f":"MATCH(\"*\"&I310&\"*\",Sheet1!B:B,0)","v":{"$error":"#N/A"}},null,null,null,{"$f":"INDEX('[2]Pt1-AvionicsComponentCosts'!$A:$NE,MATCH(B310,'[2]Pt1-AvionicsComponentCosts'!$A:$A,0),MATCH(\"END MARKER\",'[2]Pt1-AvionicsComponentCosts'!$11:$11,0))","v":3311485.3995951349},1,1,""]
[null,125,{"$f":"INDEX('[1]Pt1-AvionicsComponentCosts'!$A:$B,MATCH(B311,'[1]Pt1-AvionicsComponentCosts'!$A:$A,0),2)","v":"Helicopter"},"Sikorsky",1,"S-76","Sikorsky S-76","S-76","S-76",{"$f":"MATCH(\"*\"&F311&\"*\",Sheet1!C:C,0)","v":{"$error":"#N/A"}},{"$f":"MATCH(\"*\"&H311&\"*\",Sheet1!C:C,0)","v":{"$error":"#N/A"}},{"$f":"MATCH(\"*\"&I311&\"*\",Sheet1!B:B,0)","v":{"$error":"#N/A"}},12.5,null,"https://www.fairlifts.com/helicopters/guide-to-2023-helicopter-prices/",{"$f":"INDEX('[2]Pt1-AvionicsComponentCosts'!$A:$NE,MATCH(B311,'[2]Pt1-AvionicsComponentCosts'!$A:$A,0),MATCH(\"END MARKER\",'[2]Pt1-AvionicsComponentCosts'!$11:$11,0))","v":712697.27359999996},0.99,0.99,0.56445624069119993]
[null,126,{"$f":"INDEX('[1]Pt1-AvionicsComponentCosts'!$A:$B,MATCH(B312,'[1]Pt1-AvionicsComponentCosts'!$A:$A,0),2)","v":"Helicopter"},"Sikorsky",1,"S-92","Sikorsky S-92","S-92","S-92",{"$f":"MATCH(\"*\"&F312&\"*\",Sheet1!C:C,0)","v":{"$error":"#N/A"}},{"$f":"MATCH(\"*\"&H312&\"*\",Sheet1!C:C,0)","v":{"$error":"#N/A"}},{"$f":"MATCH(\"*\"&I312&\"*\",Sheet1!B:B,0)","v":{"$error":"#N/A"}},27,null,"https://www.paramountbusinessjets.com/private-jet-charter/aircraft/sikorsky-s-92",{"$f":"INDEX('[2]Pt1-AvionicsComponentCosts'!$A:$NE,MATCH(B312,'[2]Pt1-AvionicsComponentCosts'!$A:$A,0),MATCH(\"END MARKER\",'[2]Pt1-AvionicsComponentCosts'!$11:$11,0))","v":719865.23200000008},0.99,0.99,0.26395058506666669]
[null,129,{"$f":"INDEX('[1]Pt1-AvionicsComponentCosts'!$A:$B,MATCH(B313,'[1]Pt1-AvionicsComponentCosts'!$A:$A,0),2)","v":"Helicopter"},"Sikorsky",1,"SH-60","Sikorsky SH-60 Seahawk - MH-60R","SH-60 Seahawk - MH-60R","SH-60 Seahawk - MH-60R",{"$f":"MATCH(\"*\"&F313&\"*\",Sheet1!C:C,0)","v":{"$error":"#N/A"}},{"$f":"MATCH(\"*\"&H313&\"*\",Sheet1!C:C,0)","v":{"$error":"#N/A"}},{"$f":"MATCH(\"*\"&I313&\"*\",Sheet1!B:B,0)","v":{"$error":"#N/A"}},37.299999999999997,null,"https://www.shephardmedia.com/news/defence-helicopter/us-navy-purchases-three-additional-mh-60r-helicopt/",{"$f":"INDEX('[2]Pt1-AvionicsComponentCosts'!$A:$NE,MATCH(B313,'[2]Pt1-AvionicsComponentCosts'!$A:$A,0),MATCH(\"END MARKER\",'[2]Pt1-AvionicsComponentCosts'!$11:$11,0))","v":1497858.6464753042},0.99,0.99,0.39755497587414246]
[null,130,{"$f":"INDEX('[1]Pt1-AvionicsComponentCosts'!$A:$B,MATCH(B314,'[1]Pt1-AvionicsComponentCosts'!$A:$A,0),2)","v":"Helicopter"},"Sikorsky",1,"SH-60","Sikorsky SH-60 Seahawk - MH-60S","SH-60 Seahawk - MH-60S","SH-60 Seahawk - MH-60S",{"$f":"MATCH(\"*\"&F314&\"*\",Sheet1!C:C,0)","v":{"$error":"#N/A"}},{"$f":"MATCH(\"*\"&H314&\"*\",Sheet1!C:C,0)","v":{"$error":"#N/A"}},{"$f":"MATCH(\"*\"&I314&\"*\",Sheet1!B:B,0)","v":{"$error":"#N/A"}},null,null,null,{"$f":"INDEX('[2]Pt1-AvionicsComponentCosts'!$A:$NE,MATCH(B314,'[2]Pt1-AvionicsComponentCosts'!$A:$A,0),MATCH(\"END MARKER\",'[2]Pt1-AvionicsComponentCosts'!$11:$11,0))","v":1497858.6464753042},0.99,0.99,""]
[null,128,{"$f":"INDEX('[1]Pt1-AvionicsComponentCosts'!$A:$B,MATCH(B315,'[1]Pt1-AvionicsComponentCosts'!$A:$A,0),2)","v":"Helicopter"},"Sikorsky",1,"SH-60","Sikorsky SH-60 Seahawk - SH-60B Seahawk","SH-60 Seahawk - SH-60B Seahawk","SH-60 Seahawk - SH-60B Seahawk",{"$f":"MATCH(\"*\"&F315&\"*\",Sheet1!C:C,0)","v":{"$error":"#N/A"}},{"$f":"MATCH(\"*\"&H315&\"*\",Sheet1!C:C,0)","v":{"$error":"#N/A"}},{"$f":"MATCH(\"*\"&I315&\"*\",Sheet1!B:B,0)","v":{"$error":"#N/A"}},null,null,"replaced",{"$f":"INDEX('[2]Pt1-AvionicsComponentCosts'!$A:$NE,MATCH(B315,'[2]Pt1-AvionicsComponentCosts'!$A:$A,0),MATCH(\"END MARKER\",'[2]Pt1-AvionicsComponentCosts'!$11:$11,0))","v":1497858.6464753042},0.99,0.99,""]
[null,127,{"$f":"INDEX('[1]Pt1-AvionicsComponentCosts'!$A:$B,MATCH(B316,'[1]Pt1-AvionicsComponentCosts'!$A:$A,0),2)","v":"Helicopter"},"Sikorsky",1,"Sikorsky CH-53K King Stallion","Sikorsky CH-53K King Stallion","CH-53K King Stallion","CH-53K King Stallion",{"$f":"MATCH(\"*\"&F316&\"*\",Sheet1!C:C,0)","v":{"$error":"#N/A"}},{"$f":"MATCH(\"*\"&H316&\"*\",Sheet1!C:C,0)","v":{"$error":"#N/A"}},{"$f":"MATCH(\"*\"&I316&\"*\",Sheet1!B:B,0)","v":{"$error":"#N/A"}},125,null,null,{"$f":"INDEX('[2]Pt1-AvionicsComponentCosts'!$A:$NE,MATCH(B316,'[2]Pt1-AvionicsComponentCosts'!$A:$A,0),MATCH(\"END MARKER\",'[2]Pt1-AvionicsComponentCosts'!$11:$11,0))","v":1504109.384075304},0.99,0.99,0.11912546321876408]
[null,131,{"$f":"INDEX('[1]Pt1-AvionicsComponentCosts'!$A:$B,MATCH(B317,'[1]Pt1-AvionicsComponentCosts'!$A:$A,0),2)","v":"Helicopter"},"Sikorsky",1,"UH-60","Sikorsky UH-60 Black Hawk","UH-60 Black Hawk","UH-60 Black Hawk",{"$f":"MATCH(\"*\"&F317&\"*\",Sheet1!C:C,0)","v":{"$error":"#N/A"}},{"$f":"MATCH(\"*\"&H317&\"*\",Sheet1!C:C,0)","v":{"$error":"#N/A"}},{"$f":"MATCH(\"*\"&I317&\"*\",Sheet1!B:B,0)","v":{"$error":"#N/A"}},50,"ish","https://www.eurasiantimes.com/us-army-orders-656-million-worth-of-uh-60m-black-hawk-combat/",{"$f":"INDEX('[2]Pt1-AvionicsComponentCosts'!$A:$NE,MATCH(B317,'[2]Pt1-AvionicsComponentCosts'!$A:$A,0),MATCH(\"END MARKER\",'[2]Pt1-AvionicsComponentCosts'!$11:$11,0))","v":1477419.8864753041},0.99,0.99,0.29252913752211018]
[null,78,{"$f":"INDEX('[1]Pt1-AvionicsComponentCosts'!$A:$B,MATCH(B318,'[1]Pt1-AvionicsComponentCosts'!$A:$A,0),2)","v":"Turbine GA"},"SOCATA",1,"SOCATA TBM","SOCATA TBM","TBM","TBM",{"$f":"MATCH(\"*\"&F318&\"*\",Sheet1!C:C,0)","v":{"$error":"#N/A"}},{"$f":"MATCH(\"*\"&H318&\"*\",Sheet1!C:C,0)","v":{"$error":"#N/A"}},{"$f":"MATCH(\"*\"&I318&\"*\",Sheet1!B:B,0)","v":{"$error":"#N/A"}},4.78,null,"https://www.flyingmag.com/we-fly-daher-tbm-960/",{"$f":"INDEX('[2]Pt1-AvionicsComponentCosts'!$A:$NE,MATCH(B318,'[2]Pt1-AvionicsComponentCosts'!$A:$A,0),MATCH(\"END MARKER\",'[2]Pt1-AvionicsComponentCosts'!$11:$11,0))","v":227960.95520000003},1,1,0.47690576401673646]
[null,583,{"$f":"INDEX('[1]Pt1-AvionicsComponentCosts'!$A:$B,MATCH(B319,'[1]Pt1-AvionicsComponentCosts'!$A:$A,0),2)","v":"Helicopter"},"Subaru/Bell",1,"Bell 412","Subaru/Bell 412","412","412",{"$f":"MATCH(\"*\"&F319&\"*\",Sheet1!C:C,0)","v":{"$error":"#N/A"}},{"$f":"MATCH(\"*\"&H319&\"*\",Sheet1!C:C,0)","v":{"$error":"#N/A"}},{"$f":"MATCH(\"*\"&I319&\"*\",Sheet1!B:B,0)","v":{"$error":"#N/A"}},null,null,null,{"$f":"INDEX('[2]Pt1-AvionicsComponentCosts'!$A:$NE,MATCH(B319,'[2]Pt1-AvionicsComponentCosts'!$A:$A,0),MATCH(\"END MARKER\",'[2]Pt1-AvionicsComponentCosts'!$11:$11,0))","v":281981.49920000002},0.99,0.99,""]
[null,29,{"$f":"INDEX('[1]Pt1-AvionicsComponentCosts'!$A:$B,MATCH(B320,'[1]Pt1-AvionicsComponentCosts'!$A:$A,0),2)","v":"Regional"},"Sukhoi",1,"Sukhoi Superjet","Sukhoi Superjet 100","Superjet 100","Superjet 100",{"$f":"MATCH(\"*\"&F320&\"*\",Sheet1!C:C,0)","v":{"$error":"#N/A"}},{"$f":"MATCH(\"*\"&H320&\"*\",Sheet1!C:C,0)","v":{"$error":"#N/A"}},{"$f":"MATCH(\"*\"&I320&\"*\",Sheet1!B:B,0)","v":{"$error":"#N/A"}},null,null,null,{"$f":"INDEX('[2]Pt1-AvionicsComponentCosts'!$A:$NE,MATCH(B320,'[2]Pt1-AvionicsComponentCosts'!$A:$A,0),MATCH(\"END MARKER\",'[2]Pt1-AvionicsComponentCosts'!$11:$11,0))","v":1105909},0.65,0.65,""]
[null,585,{"$f":"INDEX('[1]Pt1-AvionicsComponentCosts'!$A:$B,MATCH(B321,'[1]Pt1-AvionicsComponentCosts'!$A:$A,0),2)","v":"Fighters and Jet Trainers"},"TAI",1,"TAI TF-X","TAI TF-X","TF-X","TF-X",{"$f":"MATCH(\"*\"&F321&\"*\",Sheet1!C:C,0)","v":{"$error":"#N/A"}},{"$f":"MATCH(\"*\"&H321&\"*\",Sheet1!C:C,0)","v":{"$error":"#N/A"}},{"$f":"MATCH(\"*\"&I321&\"*\",Sheet1!B:B,0)","v":{"$error":"#N/A"}},null,null,null,{"$f":"INDEX('[2]Pt1-AvionicsComponentCosts'!$A:$NE,MATCH(B321,'[2]Pt1-AvionicsComponentCosts'!$A:$A,0),MATCH(\"END MARKER\",'[2]Pt1-AvionicsComponentCosts'!$11:$11,0))","v":2992640.5519754631},1,1,""]
[null,138,{"$f":"INDEX('[1]Pt1-AvionicsComponentCosts'!$A:$B,MATCH(B322,'[1]Pt1-AvionicsComponentCosts'!$A:$A,0),2)","v":"Helicopter"},"TAI",1,"TAI T625","TAI T625","T625","T625",{"$f":"MATCH(\"*\"&F322&\"*\",Sheet1!C:C,0)","v":{"$error":"#N/A"}},{"$f":"MATCH(\"*\"&H322&\"*\",Sheet1!C:C,0)","v":{"$error":"#N/A"}},{"$f":"MATCH(\"*\"&I322&\"*\",Sheet1!B:B,0)","v":{"$error":"#N/A"}},null,null,null,{"$f":"INDEX('[2]Pt1-AvionicsComponentCosts'!$A:$NE,MATCH(B322,'[2]Pt1-AvionicsComponentCosts'!$A:$A,0),MATCH(\"END MARKER\",'[2]Pt1-AvionicsComponentCosts'!$11:$11,0))","v":1474535.5328753041},0.99,0.99,""]
[null,306,{"$f":"INDEX('[1]Pt1-AvionicsComponentCosts'!$A:$B,MATCH(B323,'[1]Pt1-AvionicsComponentCosts'!$A:$A,0),2)","v":"Turboprop Trainers / Light Attack"},"TAI",1,"TAI Hürkus","TAI Hürkus",{"$f":"TRIM(SUBSTITUTE(G323,D323,\"\"))","v":"Hürkus"},{"$f":"TRIM(SUBSTITUTE(SUBSTITUTE(SUBSTITUTE(SUBSTITUTE(SUBSTITUTE(H323,\"Family\",\"\"),\"737 Classic:\",\"\"),\"737 MAX:\",\"\"),\"787 Dreamliner:\",\"\"),\"777:\",\"\"))","v":"Hürkus"},{"$f":"MATCH(\"*\"&F323&\"*\",Sheet1!C:C,0)","v":{"$error":"#N/A"}},{"$f":"MATCH(\"*\"&H323&\"*\",Sheet1!C:C,0)","v":{"$error":"#N/A"}},{"$f":"MATCH(\"*\"&I323&\"*\",Sheet1!B:B,0)","v":{"$error":"#N/A"}},null,null,null,{"$f":"INDEX('[2]Pt1-AvionicsComponentCosts'!$A:$NE,MATCH(B323,'[2]Pt1-AvionicsComponentCosts'!$A:$A,0),MATCH(\"END MARKER\",'[2]Pt1-AvionicsComponentCosts'!$11:$11,0))","v":679737.04506864108},1,1,{"$f":"IFERROR(P323/(M323*100000)*R323,\"\")","v":""}]
[null,85,{"$f":"INDEX('[1]Pt1-AvionicsComponentCosts'!$A:$B,MATCH(B324,'[1]Pt1-AvionicsComponentCosts'!$A:$A,0),2)","v":"Helicopter"},"TAI/Leonardo",1,"TAI/Leonardo T129","TAI/Leonardo T129",{"$f":"TRIM(SUBSTITUTE(G324,D324,\"\"))","v":"T129"},"T129",{"$f":"MATCH(\"*\"&F324&\"*\",Sheet1!C:C,0)","v":{"$error":"#N/A"}},{"$f":"MATCH(\"*\"&H324&\"*\",Sheet1!C:C,0)","v":{"$error":"#N/A"}},{"$f":"MATCH(\"*\"&I324&\"*\",Sheet1!B:B,0)","v":{"$error":"#N/A"}},50,null,"https://en.wikipedia.org/wiki/TAI/AgustaWestland_T129_ATAK",{"$f":"INDEX('[2]Pt1-AvionicsComponentCosts'!$A:$NE,MATCH(B324,'[2]Pt1-AvionicsComponentCosts'!$A:$A,0),MATCH(\"END MARKER\",'[2]Pt1-AvionicsComponentCosts'!$11:$11,0))","v":1477419.8864753041},0.99,0.99,0.29252913752211018]
[null,614,{"$f":"INDEX('[1]Pt1-AvionicsComponentCosts'!$A:$B,MATCH(B325,'[1]Pt1-AvionicsComponentCosts'!$A:$A,0),2)","v":"Turbine GA"},"Viking",1,"Viking Twin Otter","Viking Twin Otter",{"$f":"TRIM(SUBSTITUTE(G325,D325,\"\"))","v":"Twin Otter"},"Twin Otter",{"$f":"MATCH(\"*\"&F325&\"*\",Sheet1!C:C,0)","v":{"$error":"#N/A"}},{"$f":"MATCH(\"*\"&H325&\"*\",Sheet1!C:C,0)","v":{"$error":"#N/A"}},{"$f":"MATCH(\"*\"&I325&\"*\",Sheet1!B:B,0)","v":{"$error":"#N/A"}},null,null,null,{"$f":"INDEX('[2]Pt1-AvionicsComponentCosts'!$A:$NE,MATCH(B325,'[2]Pt1-AvionicsComponentCosts'!$A:$A,0),MATCH(\"END MARKER\",'[2]Pt1-AvionicsComponentCosts'!$11:$11,0))","v":227116.56319999998},1,1,""]
[null,639,{"$f":"INDEX('[1]Pt1-AvionicsComponentCosts'!$A:$B,MATCH(B326,'[1]Pt1-AvionicsComponentCosts'!$A:$A,0),2)","v":"Helicopter"},"Westland",1,"WAH-64","Westland WAH-64",{"$f":"TRIM(SUBSTITUTE(G326,D326,\"\"))","v":"WAH-64"},"WAH-64",{"$f":"MATCH(\"*\"&F326&\"*\",Sheet1!C:C,0)","v":{"$error":"#N/A"}},{"$f":"MATCH(\"*\"&H326&\"*\",Sheet1!C:C,0)","v":{"$error":"#N/A"}},{"$f":"MATCH(\"*\"&I326&\"*\",Sheet1!B:B,0)","v":{"$error":"#N/A"}},null,null,null,{"$f":"INDEX('[2]Pt1-AvionicsComponentCosts'!$A:$NE,MATCH(B326,'[2]Pt1-AvionicsComponentCosts'!$A:$A,0),MATCH(\"END MARKER\",'[2]Pt1-AvionicsComponentCosts'!$11:$11,0))","v":1650480.8064753041},0.99,0.99,""]
[null,625,{"$f":"INDEX('[1]Pt1-AvionicsComponentCosts'!$A:$B,MATCH(B327,'[1]Pt1-AvionicsComponentCosts'!$A:$A,0),2)","v":"Regional"},"Xian",1,"Xian MA60","Xian MA60",{"$f":"TRIM(SUBSTITUTE(G327,D327,\"\"))","v":"MA60"},"MA60",{"$f":"MATCH(\"*\"&F327&\"*\",Sheet1!C:C,0)","v":{"$error":"#N/A"}},{"$f":"MATCH(\"*\"&H327&\"*\",Sheet1!C:C,0)","v":{"$error":"#N/A"}},{"$f":"MATCH(\"*\"&I327&\"*\",Sheet1!B:B,0)","v":{"$error":"#N/A"}},null,null,null,{"$f":"INDEX('[2]Pt1-AvionicsComponentCosts'!$A:$NE,MATCH(B327,'[2]Pt1-AvionicsComponentCosts'!$A:$A,0),MATCH(\"END MARKER\",'[2]Pt1-AvionicsComponentCosts'!$11:$11,0))","v":1040302.4448000001},0.65,0.65,""]
[null,null,null,null,null,null,null,null,null,null,null,null,null,null,null,null,null,null,""]
[null,null,"Narrow Body",null,null,null,null,null,null,null,null,null,null,null,null,null,null,null,""]
[null,null,"Wide (Non-IMA)",null,null,null,null,null,null,null,null,null,null,null,null,null,null,null,""]
[null,null,null,null,null,null,null,null,null,null,null,null,null,null,null,null,null,null,""]
[null,null,null,null,null,null,null,null,null,null,null,null,null,null,null,null,null,null,""]
[null,null,null,null,null,null,null,null,null,null,null,null,null,null,null,null,null,null,""]
[null,null,null,null,null,null,null,null,null,null,null,null,null,null,null,null,null,null,""]
[null,null,null,null,null,null,null,null,null,null,null,null,null,null,null,null,null,null,""]
[null,null,null,null,null,null,null,null,null,null,null,null,null,null,null,null,null,null,""]
[null,null,null,null,null,null,null,null,null,null,null,null,null,null,null,null,null,null,""]
[null,null,null,null,null,null,null,null,null,null,null,null,null,null,null,null,null,null,""]
[null,null,null,null,null,null,null,null,null,null,null,null,null,null,null,null,null,null,""]
[null,null,null,null,null,null,null,null,null,null,null,null,null,null,null,null,null,null,""]
[null,null,null,null,null,null,null,null,null,null,null,null,null,null,null,null,null,null,""]
[null,null,null,null,null,null,null,null,null,null,null,null,null,null,null,null,null,null,""]
[null,null,null,null,null,null,null,null,null,null,null,null,null,null,null,null,null,null,""]
[null,null,null,null,null,null,null,null,null,null,null,null,null,null,null,null,null,null,""]
[null,null,null,null,null,null,null,null,null,null,null,null,null,null,null,null,null,null,""]
[null,null,null,null,null,null,null,null,null,null,null,null,null,null,null,null,null,null,""]
[null,null,null,null,null,null,null,null,null,null,null,null,null,null,null,null,null,null,""]
[null,null,null,null,null,null,null,null,null,null,null,null,null,null,null,null,null,null,""]
[null,null,null,null,null,null,null,null,null,null,null,null,null,null,null,null,null,null,""]
[null,null,null,null,null,null,null,null,null,null,null,null,null,null,null,null,null,null,""]
[null,null,null,null,null,null,null,null,null,null,null,null,null,null,null,null,null,null,""]
[null,null,null,null,null,null,null,null,null,null,null,null,null,null,null,null,null,null,""]
[null,null,null,null,null,null,null,null,null,null,null,null,null,null,null,null,null,null,""]
[null,null,null,null,null,null,null,null,null,null,null,null,null,null,null,null,null,null,""]
[null,null,null,null,null,null,null,null,null,null,null,null,null,null,null,null,null,null,""]
[null,null,null,null,null,null,null,null,null,null,null,null,null,null,null,null,null,null,""]
[null,null,null,null,null,null,null,null,null,null,null,null,null,null,null,null,null,null,""]
[null,null,null,null,null,null,null,null,null,null,null,null,null,null,null,null,null,null,""]
[null,null,null,null,null,null,null,null,null,null,null,null,null,null,null,null,null,null,""]
[null,null,null,null,null,null,null,null,null,null,null,null,null,null,null,null,null,null,""]
[null,null,null,null,null,null,null,null,null,null,null,null,null,null,null,null,null,null,""]
[null,null,null,null,null,null,null,null,null,null,null,null,null,null,null,null,null,null,""]
[null,null,null,null,null,null,null,null,null,null,null,null,null,null,null,null,null,null,""]
[null,null,null,null,null,null,null,null,null,null,null,null,null,null,null,null,null,null,""]
[null,null,null,null,null,null,null,null,null,null,null,null,null,null,null,null,null,null,""]
[null,null,null,null,null,null,null,null,null,null,null,null,null,null,null,null,null,null,""]
[null,null,null,null,null,null,null,null,null,null,null,null,null,null,null,null,null,null,""]
[null,null,null,null,null,null,null,null,null,null,null,null,null,null,null,null,null,null,""]
[null,null,null,null,null,null,null,null,null,null,null,null,null,null,null,null,null,null,""]
[null,null,null,null,null,null,null,null,null,null,null,null,null,null,null,null,null,null,""]
[null,null,null,null,null,null,null,null,null,null,null,null,null,null,null,null,null,null,""]
[null,null,null,null,null,null,null,null,null,null,null,null,null,null,null,null,null,null,""]
[null,null,null,null,null,null,null,null,null,null,null,null,null,null,null,null,null,null,""]
[null,null,null,null,null,null,null,null,null,null,null,null,null,null,null,null,null,null,""]
[null,null,null,null,null,null,null,null,null,null,null,null,null,null,null,null,null,null,""]
[null,null,null,null,null,null,null,null,null,null,null,null,null,null,null,null,null,null,""]
[null,null,null,null,null,null,null,null,null,null,null,null,null,null,null,null,null,null,""]
[null,null,null,null,null,null,null,null,null,null,null,null,null,null,null,null,null,null,""]
[null,null,null,null,null,null,null,null,null,null,null,null,null,null,null,null,null,null,""]
[null,null,null,null,null,null,null,null,null,null,null,null,null,null,null,null,null,null,""]
[null,null,null,null,null,null,null,null,null,null,null,null,null,null,null,null,null,null,""]
[null,null,null,null,null,null,null,null,null,null,null,null,null,null,null,null,null,null,""]
[null,null,null,null,null,null,null,null,null,null,null,null,null,null,null,null,null,null,""]
[null,null,null,null,null,null,null,null,null,null,null,null,null,null,null,null,null,null,""]
[null,null,null,null,null,null,null,null,null,null,null,null,null,null,null,null,null,null,""]
[null,null,null,null,null,null,null,null,null,null,null,null,null,null,null,null,null,null,""]
[null,null,null,null,null,null,null,null,null,null,null,null,null,null,null,null,null,null,{"$f":"IFERROR(P387/(M387*100000)*R387,\"\")","v":""}]
[null,null,null,null,null,null,null,null,null,null,null,null,null,null,null,null,null,null,""]
[null,null,null,null,null,null,null,null,null,null,null,null,null,null,null,null,null,null,""]
[null,null,null,null,null,null,null,null,null,null,null,null,null,null,null,null,null,null,""]
[null,null,null,null,null,null,null,null,null,null,null,null,null,null,null,null,null,null,""]
[null,null,null,null,null,null,null,null,null,null,null,null,null,null,null,null,null,null,""]
[null,null,null,null,null,null,null,null,null,null,null,null,null,null,null,null,null,null,""]
[null,null,null,null,null,null,null,null,null,null,null,null,null,null,null,null,null,null,""]
[null,null,null,null,null,null,null,null,null,null,null,null,null,null,null,null,null,null,""]
[null,null,null,null,null,null,null,null,null,null,null,null,null,null,null,null,null,null,""]
[null,null,null,null,null,null,null,null,null,null,null,null,null,null,null,null,null,null,""]
[null,null,null,null,null,null,null,null,null,null,null,null,null,null,null,null,null,null,""]
[null,null,null,null,null,null,null,null,null,null,null,null,null,null,null,null,null,null,""]
[null,null,null,null,null,null,null,null,null,null,null,null,null,null,null,null,null,null,""]
[null,null,null,null,null,null,null,null,null,null,null,null,null,null,null,null,null,null,""]
[null,null,null,null,null,null,null,null,null,null,null,null,null,null,null,null,null,null,""]
[null,null,null,null,null,null,null,null,null,null,null,null,null,null,null,null,null,null,""]
[null,null,null,null,null,null,null,null,null,null,null,null,null,null,null,null,null,null,""]
[null,null,null,null,null,null,null,null,null,null,null,null,null,null,null,null,null,null,""]
[null,null,null,null,null,null,null,null,null,null,null,null,null,null,null,null,null,null,""]
[null,null,null,null,null,null,null,null,null,null,null,null,null,null,null,null,null,null,""]
[null,null,null,null,null,null,null,null,null,null,null,null,null,null,null,null,null,null,""]
[null,null,null,null,null,null,null,null,null,null,null,null,null,null,null,null,null,null,""]
[null,null,null,null,null,null,null,null,null,null,null,null,null,null,null,null,null,null,""]
[null,null,null,null,null,null,null,null,null,null,null,null,null,null,null,null,null,null,""]
[null,null,null,null,null,null,null,null,null,null,null,null,null,null,null,null,null,null,""]
[null,null,null,null,null,null,null,null,null,null,null,null,null,null,null,null,null,null,""]
[null,null,null,null,null,null,null,null,null,null,null,null,null,null,null,null,null,null,""]
[null,null,null,null,null,null,null,null,null,null,null,null,null,null,null,null,null,null,""]
[null,null,null,null,null,null,null,null,null,null,null,null,null,null,null,null,null,null,""]
[null,null,null,null,null,null,null,null,null,null,null,null,null,null,null,null,null,null,""]
[null,null,null,null,null,null,null,null,null,null,null,null,null,null,null,null,null,null,""]
[null,null,null,null,null,null,null,null,null,null,null,null,null,null,null,null,null,null,""]
[null,null,null,null,null,null,null,null,null,null,null,null,null,null,null,null,null,null,""]
[null,null,null,null,null,null,null,null,null,null,null,null,null,null,null,null,null,null,""]
[null,null,null,null,null,null,null,null,null,null,null,null,null,null,null,null,null,null,""]
[null,null,null,null,null,null,null,null,null,null,null,null,null,null,null,null,null,null,""]
[null,null,null,null,null,null,null,null,null,null,null,null,null,null,null,null,null,null,""]
[null,null,null,null,null,null,null,null,null,null,null,null,null,null,null,null,null,null,""]
[null,null,null,null,null,null,null,null,null,null,null,null,null,null,null,null,null,null,""]
[null,null,null,null,null,null,null,null,null,null,null,null,null,null,null,null,null,null,""]
[null,null,null,null,null,null,null,null,null,null,null,null,null,null,null,null,null,null,""]
[null,null,null,null,null,null,null,null,null,null,null,null,null,null,null,null,null,null,""]
[null,null,null,null,null,null,null,null,null,null,null,null,null,null,null,null,null,null,""]
[null,null,null,null,null,null,null,null,null,null,null,null,null,null,null,null,null,null,""]
[null,null,null,null,null,null,null,null,null,null,null,null,null,null,null,null,null,null,""]
[null,null,null,null,null,null,null,null,null,null,null,null,null,null,null,null,null,null,""]
[null,null,null,null,null,null,null,null,null,null,null,null,null,null,null,null,null,null,""]
[null,null,null,null,null,null,null,null,null,null,null,null,null,null,null,null,null,null,""]
[null,null,null,null,null,null,null,null,null,null,null,null,null,null,null,null,null,null,""]
[null,null,null,null,null,null,null,null,null,null,null,null,null,null,null,null,null,null,""]
[null,null,null,null,null,null,null,null,null,null,null,null,null,null,null,null,null,null,""]
[null,null,null,null,null,null,null,null,null,null,null,null,null,null,null,null,null,null,""]
[null,null,null,null,null,null,null,null,null,null,null,null,null,null,null,null,null,null,""]
[null,null,null,null,null,null,null,null,null,null,null,null,null,null,null,null,null,null,""]
[null,null,null,null,null,null,null,null,null,null,null,null,null,null,null,null,null,null,""]
[null,null,null,null,null,null,null,null,null,null,null,null,null,null,null,null,null,null,""]
[null,null,null,null,null,null,null,null,null,null,null,null,null,null,null,null,null,null,""]
[null,null,null,null,null,null,null,null,null,null,null,null,null,null,null,null,null,null,""]
[null,null,null,null,null,null,null,null,null,null,null,null,null,null,null,null,null,null,""]
[null,null,null,null,null,null,null,null,null,null,null,null,null,null,null,null,null,null,""]
[null,null,null,null,null,null,null,null,null,null,null,null,null,null,null,null,null,null,""]
[null,null,null,null,null,null,null,null,null,null,null,null,null,null,null,null,null,null,""]
[null,null,null,null,null,null,null,null,null,null,null,null,null,null,null,null,null,null,""]
[null,null,null,null,null,null,null,null,null,null,null,null,null,null,null,null,null,null,{"$f":"IFERROR(P451/(M451*100000)*R451,\"\")","v":""}]
[null,null,null,null,null,null,null,null,null,null,null,null,null,null,null,null,null,null,""]
[null,null,null,null,null,null,null,null,null,null,null,null,null,null,null,null,null,null,""]
[null,null,null,null,null,null,null,null,null,null,null,null,null,null,null,null,null,null,""]
[null,null,null,null,null,null,null,null,null,null,null,null,null,null,null,null,null,null,""]
[null,null,null,null,null,null,null,null,null,null,null,null,null,null,null,null,null,null,""]
[null,null,null,null,null,null,null,null,null,null,null,null,null,null,null,null,null,null,""]
[null,null,null,null,null,null,null,null,null,null,null,null,null,null,null,null,null,null,""]
[null,null,null,null,null,null,null,null,null,null,null,null,null,null,null,null,null,null,""]
[null,null,null,null,null,null,null,null,null,null,null,null,null,null,null,null,null,null,""]
[null,null,null,null,null,null,null,null,null,null,null,null,null,null,null,null,null,null,""]
[null,null,null,null,null,null,null,null,null,null,null,null,null,null,null,null,null,null,""]
[null,null,null,null,null,null,null,null,null,null,null,null,null,null,null,null,null,null,""]
[null,null,null,null,null,null,null,null,null,null,null,null,null,null,null,null,null,null,""]
[null,null,null,null,null,null,null,null,null,null,null,null,null,null,null,null,null,null,""]
[null,null,null,null,null,null,null,null,null,null,null,null,null,null,null,null,null,null,""]
[null,null,null,null,null,null,null,null,null,null,null,null,null,null,null,null,null,null,""]
[null,null,null,null,null,null,null,null,null,null,null,null,null,null,null,null,null,null,""]
[null,null,null,null,null,null,null,null,null,null,null,null,null,null,null,null,null,null,""]
[null,null,null,null,null,null,null,null,null,null,null,null,null,null,null,null,null,null,""]
[null,null,null,null,null,null,null,null,null,null,null,null,null,null,null,null,null,null,""]
[null,null,null,null,null,null,null,null,null,null,null,null,null,null,null,null,null,null,""]
[]
[]
[null,null,null,null,null,null,null,null,null,null,null,null,null,"socata tbm price"]
[]
[]
[]
[]
[]
[]
[]
[]
[]
[null,null,null,null,null,null,"AE Numbers A320",null,null,null,null,null,103000000,null,null,2354900,0.65,0.65,{"$f":"IFERROR(P485/((M485)*R485),\"\")","v":3.5174010455563856E-2}]

{"sheet":"Summary","index":5,"n_rows":25,"n_cols":8,"rows_kept":25,"cut":false,"hidden":false,"merged":[[13,0,13,7],[0,0,0,7]]}
["2020 Data"]
[null,"AC Value Factor","Average Avionics Cost","Average","High","High Item","Low","Low Item"]
["Fighters and Jet Trainers",{"$f":"INDEX('2020 Data Sheet'!$A:$S,MATCH($A3,'2020 Data Sheet'!C:C,0),MATCH(B$2,'2020 Data Sheet'!$1:$1,0))","v":1},{"$f":"AVERAGEIF('2020 Data Sheet'!$C:$C,Summary!$A3,'2020 Data Sheet'!$P:$P)","v":2168883.3846153845},{"$f":"AVERAGEIF('2020 Data Sheet'!C:C,A3,'2020 Data Sheet'!S:S)","v":0.47104174095634099},{"$f":"_xlfn.MAXIFS('2020 Data Sheet'!S:S,'2020 Data Sheet'!C:C,A3)","v":0.62621459459459461},{"$f":"INDEX('2020 Data Sheet'!$A:$S,MATCH(Summary!E3,'2020 Data Sheet'!$S:$S,0),6)","v":"Aero L-39NG"},{"$f":"_xlfn.MINIFS('2020 Data Sheet'!S:S,'2020 Data Sheet'!C:C,A3)","v":0.34816140000000001},{"$f":"INDEX('2020 Data Sheet'!$A:$S,MATCH(Summary!G3,'2020 Data Sheet'!$S:$S,0),6)","v":"AIDC T-5"}]
["Turbine GA",{"$f":"INDEX('2020 Data Sheet'!$A:$S,MATCH($A4,'2020 Data Sheet'!C:C,0),MATCH(B$2,'2020 Data Sheet'!$1:$1,0))","v":1},{"$f":"AVERAGEIF('2020 Data Sheet'!$C:$C,Summary!$A4,'2020 Data Sheet'!$P:$P)","v":246230.73913043478},{"$f":"AVERAGEIF('2020 Data Sheet'!C:C,A4,'2020 Data Sheet'!S:S)","v":0.46265606953278021},{"$f":"_xlfn.MAXIFS('2020 Data Sheet'!S:S,'2020 Data Sheet'!C:C,A4)","v":0.82508846153846149},{"$f":"INDEX('2020 Data Sheet'!$A:$S,MATCH(Summary!E4,'2020 Data Sheet'!$S:$S,0),6)","v":"Cessna 208 Caravan"},{"$f":"_xlfn.MINIFS('2020 Data Sheet'!S:S,'2020 Data Sheet'!C:C,A4)","v":0.24487994579945799},{"$f":"INDEX('2020 Data Sheet'!$A:$S,MATCH(Summary!G4,'2020 Data Sheet'!$S:$S,0),6)","v":"Canadair CL-415"}]
["Business Jet",{"$f":"INDEX('2020 Data Sheet'!$A:$S,MATCH($A5,'2020 Data Sheet'!C:C,0),MATCH(B$2,'2020 Data Sheet'!$1:$1,0))","v":0.75},{"$f":"AVERAGEIF('2020 Data Sheet'!$C:$C,Summary!$A5,'2020 Data Sheet'!$P:$P)","v":889565},{"$f":"AVERAGEIF('2020 Data Sheet'!C:C,A5,'2020 Data Sheet'!S:S)","v":0.17662179203461362},{"$f":"_xlfn.MAXIFS('2020 Data Sheet'!S:S,'2020 Data Sheet'!C:C,A5)","v":0.45758749999999998},{"$f":"INDEX('2020 Data Sheet'!$A:$S,MATCH(Summary!E5,'2020 Data Sheet'!$S:$S,0),6)","v":"G100"},{"$f":"_xlfn.MINIFS('2020 Data Sheet'!S:S,'2020 Data Sheet'!C:C,A5)","v":3.3114375000000001E-2},{"$f":"INDEX('2020 Data Sheet'!$A:$S,MATCH(Summary!G5,'2020 Data Sheet'!$S:$S,0),6)","v":"Wide body VIP"}]
["Freighter",{"$f":"INDEX('2020 Data Sheet'!$A:$S,MATCH($A6,'2020 Data Sheet'!C:C,0),MATCH(B$2,'2020 Data Sheet'!$1:$1,0))","v":0.5},{"$f":"AVERAGEIF('2020 Data Sheet'!$C:$C,Summary!$A6,'2020 Data Sheet'!$P:$P)","v":1534532.4074074074},{"$f":"AVERAGEIF('2020 Data Sheet'!C:C,A6,'2020 Data Sheet'!S:S)","v":8.80536382706604E-2},{"$f":"_xlfn.MAXIFS('2020 Data Sheet'!S:S,'2020 Data Sheet'!C:C,A6)","v":0.32755388888888887},{"$f":"INDEX('2020 Data Sheet'!$A:$S,MATCH(Summary!E6,'2020 Data Sheet'!$S:$S,0),6)","v":"A330"},{"$f":"_xlfn.MINIFS('2020 Data Sheet'!S:S,'2020 Data Sheet'!C:C,A6)","v":1.9999898236092266E-2},{"$f":"INDEX('2020 Data Sheet'!$A:$S,MATCH(Summary!G6,'2020 Data Sheet'!$S:$S,0),6)","v":"Boeing 777X"}]
["Helicopter",{"$f":"INDEX('2020 Data Sheet'!$A:$S,MATCH($A7,'2020 Data Sheet'!C:C,0),MATCH(B$2,'2020 Data Sheet'!$1:$1,0))","v":0.99},{"$f":"AVERAGEIF('2020 Data Sheet'!$C:$C,Summary!$A7,'2020 Data Sheet'!$P:$P)","v":932854.37096774194},{"$f":"AVERAGEIF('2020 Data Sheet'!C:C,A7,'2020 Data Sheet'!S:S)","v":0.65077699761279229},{"$f":"_xlfn.MAXIFS('2020 Data Sheet'!S:S,'2020 Data Sheet'!C:C,A7)","v":3.5193586153846153},{"$f":"INDEX('2020 Data Sheet'!$A:$S,MATCH(Summary!E7,'2020 Data Sheet'!$S:$S,0),6)","v":"Bell 505 Jet Ranger X"},{"$f":"_xlfn.MINIFS('2020 Data Sheet'!S:S,'2020 Data Sheet'!C:C,A7)","v":0.1161681048},{"$f":"INDEX('2020 Data Sheet'!$A:$S,MATCH(Summary!G7,'2020 Data Sheet'!$S:$S,0),6)","v":"Sikorsky CH-53K King Stallion"}]
["Large Commercial Aircraft",{"$f":"INDEX('2020 Data Sheet'!$A:$S,MATCH($A8,'2020 Data Sheet'!C:C,0),MATCH(B$2,'2020 Data Sheet'!$1:$1,0))","v":0.5},{"$f":"AVERAGEIF('2020 Data Sheet'!$C:$C,Summary!$A8,'2020 Data Sheet'!$P:$P)","v":1618284.0370370371},{"$f":"AVERAGEIF('2020 Data Sheet'!C:C,A8,'2020 Data Sheet'!S:S)","v":4.6254947905196561E-2},{"$f":"_xlfn.MAXIFS('2020 Data Sheet'!S:S,'2020 Data Sheet'!C:C,A8)","v":8.4472962962962958E-2},{"$f":"INDEX('2020 Data Sheet'!$A:$S,MATCH(Summary!E8,'2020 Data Sheet'!$S:$S,0),6)","v":"A220"},{"$f":"_xlfn.MINIFS('2020 Data Sheet'!S:S,'2020 Data Sheet'!C:C,A8)","v":2.5565750791497061E-2},{"$f":"INDEX('2020 Data Sheet'!$A:$S,MATCH(Summary!G8,'2020 Data Sheet'!$S:$S,0),6)","v":"Boeing 777X"}]
["Military Transport / Special Mission",{"$f":"INDEX('2020 Data Sheet'!$A:$S,MATCH($A9,'2020 Data Sheet'!C:C,0),MATCH(B$2,'2020 Data Sheet'!$1:$1,0))","v":1},{"$f":"AVERAGEIF('2020 Data Sheet'!$C:$C,Summary!$A9,'2020 Data Sheet'!$P:$P)","v":2980996.9545454546},{"$f":"AVERAGEIF('2020 Data Sheet'!C:C,A9,'2020 Data Sheet'!S:S)","v":0.28972869193287365},{"$f":"_xlfn.MAXIFS('2020 Data Sheet'!S:S,'2020 Data Sheet'!C:C,A9)","v":0.75649875},{"$f":"INDEX('2020 Data Sheet'!$A:$S,MATCH(Summary!E9,'2020 Data Sheet'!$S:$S,0),6)","v":"Alenia C-27J"},{"$f":"_xlfn.MINIFS('2020 Data Sheet'!S:S,'2020 Data Sheet'!C:C,A9)","v":9.1313441176470583E-2},{"$f":"INDEX('2020 Data Sheet'!$A:$S,MATCH(Summary!G9,'2020 Data Sheet'!$S:$S,0),6)","v":"A330 MRTT"}]
["Regional",{"$f":"INDEX('2020 Data Sheet'!$A:$S,MATCH($A10,'2020 Data Sheet'!C:C,0),MATCH(B$2,'2020 Data Sheet'!$1:$1,0))","v":0.65},{"$f":"AVERAGEIF('2020 Data Sheet'!$C:$C,Summary!$A10,'2020 Data Sheet'!$P:$P)","v":955126.8},{"$f":"AVERAGEIF('2020 Data Sheet'!C:C,A10,'2020 Data Sheet'!S:S)","v":0.21147226336629907},{"$f":"_xlfn.MAXIFS('2020 Data Sheet'!S:S,'2020 Data Sheet'!C:C,A10)","v":0.47825960000000001},{"$f":"INDEX('2020 Data Sheet'!$A:$S,MATCH(Summary!E10,'2020 Data Sheet'!$S:$S,0),6)","v":"De Havilland Canada DHC-8"},{"$f":"_xlfn.MINIFS('2020 Data Sheet'!S:S,'2020 Data Sheet'!C:C,A10)","v":8.724812500000001E-2},{"$f":"INDEX('2020 Data Sheet'!$A:$S,MATCH(Summary!G10,'2020 Data Sheet'!$S:$S,0),6)","v":"Embraer E170/190"}]
["UAV",{"$f":"INDEX('2020 Data Sheet'!$A:$S,MATCH($A11,'2020 Data Sheet'!C:C,0),MATCH(B$2,'2020 Data Sheet'!$1:$1,0))","v":1},{"$f":"AVERAGEIF('2020 Data Sheet'!$C:$C,Summary!$A11,'2020 Data Sheet'!$P:$P)","v":918171.45454545459},{"$f":"AVERAGEIF('2020 Data Sheet'!C:C,A11,'2020 Data Sheet'!S:S)","v":4.5700849999999997},{"$f":"_xlfn.MAXIFS('2020 Data Sheet'!S:S,'2020 Data Sheet'!C:C,A11)","v":4.5700849999999997},{"$f":"INDEX('2020 Data Sheet'!$A:$S,MATCH(Summary!E11,'2020 Data Sheet'!$S:$S,0),6)","v":"Bayraktar TB-2"},{"$f":"_xlfn.MINIFS('2020 Data Sheet'!S:S,'2020 Data Sheet'!C:C,A11)","v":4.5700849999999997},{"$f":"INDEX('2020 Data Sheet'!$A:$S,MATCH(Summary!G11,'2020 Data Sheet'!$S:$S,0),6)","v":"Bayraktar TB-2"}]
["Turboprop Trainers / Light Attack",{"$f":"INDEX('2020 Data Sheet'!$A:$S,MATCH($A12,'2020 Data Sheet'!C:C,0),MATCH(B$2,'2020 Data Sheet'!$1:$1,0))","v":1},{"$f":"AVERAGEIF('2020 Data Sheet'!$C:$C,Summary!$A12,'2020 Data Sheet'!$P:$P)","v":502600.44444444444},{"$f":"AVERAGEIF('2020 Data Sheet'!C:C,A12,'2020 Data Sheet'!S:S)","v":1.0967345505617978},{"$f":"_xlfn.MAXIFS('2020 Data Sheet'!S:S,'2020 Data Sheet'!C:C,A12)","v":1.0967345505617978},{"$f":"INDEX('2020 Data Sheet'!$A:$S,MATCH(Summary!E12,'2020 Data Sheet'!$S:$S,0),6)","v":"Beechcraft T-6 Texan II"},{"$f":"_xlfn.MINIFS('2020 Data Sheet'!S:S,'2020 Data Sheet'!C:C,A12)","v":1.0967345505617978},{"$f":"INDEX('2020 Data Sheet'!$A:$S,MATCH(Summary!G12,'2020 Data Sheet'!$S:$S,0),6)","v":"Beechcraft T-6 Texan II"}]
[]
["2024 Data"]
[null,"AC Value Factor","Average Avionics Cost","Average","High","High Item","Low","Low Item"]
["Fighters and Jet Trainers",{"$f":"INDEX('2024 Data Sheet'!$A:$S,MATCH($A16,'2024 Data Sheet'!C:C,0),MATCH(B$2,'2024 Data Sheet'!$1:$1,0))","v":1},{"$f":"AVERAGEIF('2024 Data Sheet'!$C:$C,Summary!$A16,'2024 Data Sheet'!$P:$P)","v":2408537.5827712486},{"$f":"AVERAGEIF('2024 Data Sheet'!C:C,A16,'2024 Data Sheet'!S:S)","v":0.52681302827877219},{"$f":"_xlfn.MAXIFS('2024 Data Sheet'!S:S,'2024 Data Sheet'!C:C,A16)","v":0.70035833701602179},{"$f":"INDEX('2024 Data Sheet'!$A:$S,MATCH(Summary!E16,'2024 Data Sheet'!$S:$S,0),6)","v":"Aero L-39NG"},{"$f":"_xlfn.MINIFS('2024 Data Sheet'!S:S,'2024 Data Sheet'!C:C,A16)","v":0.38938366390845058},{"$f":"INDEX('2024 Data Sheet'!$A:$S,MATCH(Summary!G16,'2024 Data Sheet'!$S:$S,0),6)","v":"AIDC T-5"}]
["Turbine GA",{"$f":"INDEX('2024 Data Sheet'!$A:$S,MATCH($A17,'2024 Data Sheet'!C:C,0),MATCH(B$2,'2024 Data Sheet'!$1:$1,0))","v":1},{"$f":"AVERAGEIF('2024 Data Sheet'!$C:$C,Summary!$A17,'2024 Data Sheet'!$P:$P)","v":259734.09662608692},{"$f":"AVERAGEIF('2024 Data Sheet'!C:C,A17,'2024 Data Sheet'!S:S)","v":0.48183343408036139},{"$f":"_xlfn.MAXIFS('2024 Data Sheet'!S:S,'2024 Data Sheet'!C:C,A17)","v":0.86197131076923061},{"$f":"INDEX('2024 Data Sheet'!$A:$S,MATCH(Summary!E17,'2024 Data Sheet'!$S:$S,0),6)","v":"Cessna 208 Caravan"},{"$f":"_xlfn.MINIFS('2024 Data Sheet'!S:S,'2024 Data Sheet'!C:C,A17)","v":0.27595406005420053},{"$f":"INDEX('2024 Data Sheet'!$A:$S,MATCH(Summary!G17,'2024 Data Sheet'!$S:$S,0),6)","v":"Canadair CL-415"}]
["Business Jet",{"$f":"INDEX('2024 Data Sheet'!$A:$S,MATCH($A18,'2024 Data Sheet'!C:C,0),MATCH(B$2,'2024 Data Sheet'!$1:$1,0))","v":0.75},{"$f":"AVERAGEIF('2024 Data Sheet'!$C:$C,Summary!$A18,'2024 Data Sheet'!$P:$P)","v":995795.24809552217},{"$f":"AVERAGEIF('2024 Data Sheet'!C:C,A18,'2024 Data Sheet'!S:S)","v":0.19680522107056003},{"$f":"_xlfn.MAXIFS('2024 Data Sheet'!S:S,'2024 Data Sheet'!C:C,A18)","v":0.46917701299999998},{"$f":"INDEX('2024 Data Sheet'!$A:$S,MATCH(Summary!E18,'2024 Data Sheet'!$S:$S,0),6)","v":"G100"},{"$f":"_xlfn.MINIFS('2024 Data Sheet'!S:S,'2024 Data Sheet'!C:C,A18)","v":3.379965384615384E-2},{"$f":"INDEX('2024 Data Sheet'!$A:$S,MATCH(Summary!G18,'2024 Data Sheet'!$S:$S,0),6)","v":"Wide body VIP"}]
["Freighter",{"$f":"INDEX('2024 Data Sheet'!$A:$S,MATCH($A19,'2024 Data Sheet'!C:C,0),MATCH(B$2,'2024 Data Sheet'!$1:$1,0))","v":0.5},{"$f":"AVERAGEIF('2024 Data Sheet'!$C:$C,Summary!$A19,'2024 Data Sheet'!$P:$P)","v":1730661.9906370374},{"$f":"AVERAGEIF('2024 Data Sheet'!C:C,A19,'2024 Data Sheet'!S:S)","v":0.10039507069164369},{"$f":"_xlfn.MAXIFS('2024 Data Sheet'!S:S,'2024 Data Sheet'!C:C,A19)","v":0.36537841125925924},{"$f":"INDEX('2024 Data Sheet'!$A:$S,MATCH(Summary!E19,'2024 Data Sheet'!$S:$S,0),6)","v":"A330"},{"$f":"_xlfn.MINIFS('2024 Data Sheet'!S:S,'2024 Data Sheet'!C:C,A19)","v":2.2343322261420172E-2},{"$f":"INDEX('2024 Data Sheet'!$A:$S,MATCH(Summary!G19,'2024 Data Sheet'!$S:$S,0),6)","v":"Boeing 777X"}]
["Helicopter",{"$f":"INDEX('2024 Data Sheet'!$A:$S,MATCH($A20,'2024 Data Sheet'!C:C,0),MATCH(B$2,'2024 Data Sheet'!$1:$1,0))","v":0.99},{"$f":"AVERAGEIF('2024 Data Sheet'!$C:$C,Summary!$A20,'2024 Data Sheet'!$P:$P)","v":972988.33482955268},{"$f":"AVERAGEIF('2024 Data Sheet'!C:C,A20,'2024 Data Sheet'!S:S)","v":0.69886130494837628},{"$f":"_xlfn.MAXIFS('2024 Data Sheet'!S:S,'2024 Data Sheet'!C:C,A20)","v":3.7901060329846157},{"$f":"INDEX('2024 Data Sheet'!$A:$S,MATCH(Summary!E20,'2024 Data Sheet'!$S:$S,0),6)","v":"Bell 505 Jet Ranger X"},{"$f":"_xlfn.MINIFS('2024 Data Sheet'!S:S,'2024 Data Sheet'!C:C,A20)","v":0.11912546321876408},{"$f":"INDEX('2024 Data Sheet'!$A:$S,MATCH(Summary!G20,'2024 Data Sheet'!$S:$S,0),6)","v":"Sikorsky CH-53K King Stallion"}]
["Large Commercial Aircraft",{"$f":"INDEX('2024 Data Sheet'!$A:$S,MATCH($A21,'2024 Data Sheet'!C:C,0),MATCH(B$2,'2024 Data Sheet'!$1:$1,0))","v":0.5},{"$f":"AVERAGEIF('2024 Data Sheet'!$C:$C,Summary!$A21,'2024 Data Sheet'!$P:$P)","v":1864041.2875536042},{"$f":"AVERAGEIF('2024 Data Sheet'!C:C,A21,'2024 Data Sheet'!S:S)","v":5.3901162213681929E-2},{"$f":"_xlfn.MAXIFS('2024 Data Sheet'!S:S,'2024 Data Sheet'!C:C,A21)","v":9.6793703703703701E-2},{"$f":"INDEX('2024 Data Sheet'!$A:$S,MATCH(Summary!E21,'2024 Data Sheet'!$S:$S,0),6)","v":"A220"},{"$f":"_xlfn.MINIFS('2024 Data Sheet'!S:S,'2024 Data Sheet'!C:C,A21)","v":2.8325752510176393E-2},{"$f":"INDEX('2024 Data Sheet'!$A:$S,MATCH(Summary!G21,'2024 Data Sheet'!$S:$S,0),6)","v":"Boeing 777X"}]
["Military Transport / Special Mission",{"$f":"INDEX('2024 Data Sheet'!$A:$S,MATCH($A22,'2024 Data Sheet'!C:C,0),MATCH(B$2,'2024 Data Sheet'!$1:$1,0))","v":1},{"$f":"AVERAGEIF('2024 Data Sheet'!$C:$C,Summary!$A22,'2024 Data Sheet'!$P:$P)","v":3316926.1888978421},{"$f":"AVERAGEIF('2024 Data Sheet'!C:C,A22,'2024 Data Sheet'!S:S)","v":0.32132518933360865},{"$f":"_xlfn.MAXIFS('2024 Data Sheet'!S:S,'2024 Data Sheet'!C:C,A22)","v":0.83938220229878369},{"$f":"INDEX('2024 Data Sheet'!$A:$S,MATCH(Summary!E22,'2024 Data Sheet'!$S:$S,0),6)","v":"Alenia C-27J"},{"$f":"_xlfn.MINIFS('2024 Data Sheet'!S:S,'2024 Data Sheet'!C:C,A22)","v":0.10088582861111769},{"$f":"INDEX('2024 Data Sheet'!$A:$S,MATCH(Summary!G22,'2024 Data Sheet'!$S:$S,0),6)","v":"A330 MRTT"}]
["Regional",{"$f":"INDEX('2024 Data Sheet'!$A:$S,MATCH($A23,'2024 Data Sheet'!C:C,0),MATCH(B$2,'2024 Data Sheet'!$1:$1,0))","v":0.65},{"$f":"AVERAGEIF('2024 Data Sheet'!$C:$C,Summary!$A23,'2024 Data Sheet'!$P:$P)","v":1075200.668608},{"$f":"AVERAGEIF('2024 Data Sheet'!C:C,A23,'2024 Data Sheet'!S:S)","v":0.23926121362199324},{"$f":"_xlfn.MAXIFS('2024 Data Sheet'!S:S,'2024 Data Sheet'!C:C,A23)","v":0.54095727129600002},{"$f":"INDEX('2024 Data Sheet'!$A:$S,MATCH(Summary!E23,'2024 Data Sheet'!$S:$S,0),6)","v":"De Havilland Canada DHC-8"},{"$f":"_xlfn.MINIFS('2024 Data Sheet'!S:S,'2024 Data Sheet'!C:C,A23)","v":9.8741874999999993E-2},{"$f":"INDEX('2024 Data Sheet'!$A:$S,MATCH(Summary!G23,'2024 Data Sheet'!$S:$S,0),6)","v":"Embraer E170/190"}]
["UAV",{"$f":"INDEX('2024 Data Sheet'!$A:$S,MATCH($A24,'2024 Data Sheet'!C:C,0),MATCH(B$2,'2024 Data Sheet'!$1:$1,0))","v":1},{"$f":"AVERAGEIF('2024 Data Sheet'!$C:$C,Summary!$A24,'2024 Data Sheet'!$P:$P)","v":958036.95010962908},{"$f":"AVERAGEIF('2024 Data Sheet'!C:C,A24,'2024 Data Sheet'!S:S)","v":4.5700849999999997},{"$f":"_xlfn.MAXIFS('2024 Data Sheet'!S:S,'2024 Data Sheet'!C:C,A24)","v":4.5700849999999997},{"$f":"INDEX('2024 Data Sheet'!$A:$S,MATCH(Summary!E24,'2024 Data Sheet'!$S:$S,0),6)","v":"Bayraktar TB-2"},{"$f":"_xlfn.MINIFS('2024 Data Sheet'!S:S,'2024 Data Sheet'!C:C,A24)","v":4.5700849999999997},{"$f":"INDEX('2024 Data Sheet'!$A:$S,MATCH(Summary!G24,'2024 Data Sheet'!$S:$S,0),6)","v":"Bayraktar TB-2"}]
["Turboprop Trainers / Light Attack",{"$f":"INDEX('2024 Data Sheet'!$A:$S,MATCH($A25,'2024 Data Sheet'!C:C,0),MATCH(B$2,'2024 Data Sheet'!$1:$1,0))","v":1},{"$f":"AVERAGEIF('2024 Data Sheet'!$C:$C,Summary!$A25,'2024 Data Sheet'!$P:$P)","v":542110.20062419644},{"$f":"AVERAGEIF('2024 Data Sheet'!C:C,A25,'2024 Data Sheet'!S:S)","v":1.178307978156931},{"$f":"_xlfn.MAXIFS('2024 Data Sheet'!S:S,'2024 Data Sheet'!C:C,A25)","v":1.178307978156931},{"$f":"INDEX('2024 Data Sheet'!$A:$S,MATCH(Summary!E25,'2024 Data Sheet'!$S:$S,0),6)","v":"Beechcraft T-6 Texan II"},{"$f":"_xlfn.MINIFS('2024 Data Sheet'!S:S,'2024 Data Sheet'!C:C,A25)","v":1.178307978156931},{"$f":"INDEX('2024 Data Sheet'!$A:$S,MATCH(Summary!G25,'2024 Data Sheet'!$S:$S,0),6)","v":"Beechcraft T-6 Texan II"}]

{"sheet":"Bombardier Prices","index":6,"n_rows":15,"n_cols":4,"rows_kept":15,"cut":false,"hidden":false,"merged":[]}
[]
["Challenger 300",14,null,{"$f":"INDEX('2020 Data Sheet'!I:I,MATCH(\"*\"&A2&\"*\",'2020 Data Sheet'!I:I,0),1)","v":"Challenger 300/350"}]
["Challenger 350",14.9,null,{"$f":"INDEX('2020 Data Sheet'!I:I,MATCH(\"*\"&A3&\"*\",'2020 Data Sheet'!I:I,0),1)","v":"Challenger 3500"}]
["Challenger 3500",26.9,null,{"$f":"INDEX('2020 Data Sheet'!I:I,MATCH(\"*\"&A4&\"*\",'2020 Data Sheet'!I:I,0),1)","v":"Challenger 3500"}]
["Challenger 600",31.9,null,{"$f":"INDEX('2020 Data Sheet'!I:I,MATCH(\"*\"&A5&\"*\",'2020 Data Sheet'!I:I,0),1)","v":"Challenger 600 series"}]
["Challenger 6XX",31.9,null,{"$f":"INDEX('2020 Data Sheet'!I:I,MATCH(\"*\"&A6&\"*\",'2020 Data Sheet'!I:I,0),1)","v":"Challenger 6XX series"}]
["Challenger 850",39.9,null,{"$f":"INDEX('2020 Data Sheet'!I:I,MATCH(\"*\"&A7&\"*\",'2020 Data Sheet'!I:I,0),1)","v":"Challenger 850"}]
["Global 5000",46,null,{"$f":"INDEX('2020 Data Sheet'!I:I,MATCH(\"*\"&A8&\"*\",'2020 Data Sheet'!I:I,0),1)","v":"Global 5000"}]
["Global 5500",46,null,{"$f":"INDEX('2020 Data Sheet'!I:I,MATCH(\"*\"&A9&\"*\",'2020 Data Sheet'!I:I,0),1)","v":"Global 5500"}]
["Global 6500",55.8,null,{"$f":"INDEX('2020 Data Sheet'!I:I,MATCH(\"*\"&A10&\"*\",'2020 Data Sheet'!I:I,0),1)","v":"Global 6500"}]
["Global 6000",55.8,null,{"$f":"INDEX('2020 Data Sheet'!I:I,MATCH(\"*\"&A11&\"*\",'2020 Data Sheet'!I:I,0),1)","v":"Global 6000"}]
["Global 7500",70,null,{"$f":"INDEX('2020 Data Sheet'!I:I,MATCH(\"*\"&A12&\"*\",'2020 Data Sheet'!I:I,0),1)","v":"Global 7500/8000"}]
["Global 8000",75,null,"Global 7500/8000"]
[]
["https://www.wijet.com/bombardier-private-jet-price-list/#google_vignette"]

{"sheet":"airbus 2018","index":7,"n_rows":20,"n_cols":2,"rows_kept":20,"cut":false,"hidden":false,"merged":[]}
["AIRBUS AIRCRAFT"]
["2018 AVERAGE LIST PRICES* (USD millions)"]
["A318",77.400000000000006]
["A319",92.3]
["A320",101]
["A321",118.3]
["A319neo",101.5]
["A320neo",110.6]
["A321neo",129.5]
["A330-200",238.5]
["A330-800 (neo)",259.89999999999998]
["A330-200 Freighter",241.7]
["A330-300",264.2]
["A330-900 (neo)",296.39999999999998]
["A350-800",280.60000000000002]
["A350-900",317.39999999999998]
["A350-1000",366.5]
["A380",445.6]
[]
["https://www.airbus.com/sites/g/files/jlcbta136/files/2021-07/new-airbus-list-prices-2018.pdf"]

{"sheet":"statista 2021","index":8,"n_rows":42,"n_cols":2,"rows_kept":42,"cut":false,"hidden":false,"merged":[]}
["New production values for Airbus aircraft in 2021, by type"]
["A380",169.5]
["A350-1000",159.1]
["A350-900",145.80000000000001]
["A330neo-900",104]
["A330-800",92.2]
["A330-200 Freighter",84]
["A330-300",80.599999999999994]
["A330-200 Freighter",72.400000000000006]
["A321neo",54.5]
["A320neo",49.2]
["A321ceo",48.5]
["A320ceo",41.5]
["A220-300",36.799999999999997]
["A319neo",36.700000000000003]
["A220-100",32.6]
[]
["https://www.statista.com/statistics/273962/prices-of-airbus-aircraft-by-type/"]
[]
["737-700",89.1]
["737 MAX 7",99.7]
["737-800",106.1]
["737-900ER",112.6]
["737 MAX 8",121.6]
["737 MAX 200",124.8]
["737 MAX 9",128.9]
["737 MAX 10",134.9]
["737-300ER",217.9]
["767-300F",220.3]
["787-8",248.3]
["787-9",292.5]
["777-200ER",306.60000000000002]
["787-10",338.4]
["777-200LR",346.9]
["777F",352.3]
["777-300ER",375.5]
["777-8",410.2]
["747-8",418.4]
["747-8F",419.2]
["777-9",442.2]
[]
["https://www.statista.com/statistics/273941/prices-of-boeing-aircraft-by-type/"]

{"sheet":"Aircraft Pricing","index":9,"n_rows":41,"n_cols":6,"rows_kept":41,"cut":false,"hidden":false,"merged":[]}
["Aircraft model","Engine","Range","Typical Configuration","New Price"]
["BOEING 737 MAX 7",null,null,172,"$99.7M",{"$f":"A2&\"^\"&B2&\"^\"&C2&\"^\"&D2&\"^\"&E2","v":"BOEING 737 MAX 7^^^172^$99.7M"}]
["Airbus A318","GE, Pratt & Whitney","3,100 NM",107,"$75.1M",{"$f":"A3&\"^\"&B3&\"^\"&C3&\"^\"&D3&\"^\"&E3","v":"Airbus A318^GE, Pratt & Whitney^3,100 NM^107^$75.1M"}]
["Airbus A319","GE, International Aero Engines","3,700 nm",124,"$89.6M","Airbus A319^GE, International Aero Engines^3,700 nm^124^$89.6M"]
["Airbus A320","GE, International Aero Engines","3,300 NM",150,"$98M","Airbus A320^GE, International Aero Engines^3,300 NM^150^$98M"]
["Airbus A321","GE, International Aero Engines","3,200 NM",185,"$114.9M","Airbus A321^GE, International Aero Engines^3,200 NM^185^$114.9M"]
["Airbus A330-200","ROLLS-ROYCE, GE, Pratt & Whitney","7,250 NM",247,"$231.5M","Airbus A330-200^ROLLS-ROYCE, GE, Pratt & Whitney^7,250 NM^247^$231.5M"]
["Airbus A330-200F","Pratt & Whitney, ROLLS-ROYCE","4,000 NM","N/A","$234.7M","Airbus A330-200F^Pratt & Whitney, ROLLS-ROYCE^4,000 NM^N/A^$234.7M"]
["Airbus A330-300","ROLLS-ROYCE, GE, Pratt & Whitney","6,350 NM",277,"$256.4M","Airbus A330-300^ROLLS-ROYCE, GE, Pratt & Whitney^6,350 NM^277^$256.4M"]
["Airbus A340-300","CFM International","7,300 NM",277,"$219M","Airbus A340-300^CFM International^7,300 NM^277^$219M"]
["Airbus A350-900","ROLLS-ROYCE","8,100 NM",325,"$308.1M","Airbus A350-900^ROLLS-ROYCE^8,100 NM^325^$308.1M"]
["Airbus A350-1000","ROLLS-ROYCE","7,950 NM",366,"$355.7M","Airbus A350-1000^ROLLS-ROYCE^7,950 NM^366^$355.7M"]
["Airbus A380","ROLLS-ROYCE, Engine Alliance","8,200 NM",544,"$350M","Airbus A380^ROLLS-ROYCE, Engine Alliance^8,200 NM^544^$350M"]
["Boeing 737-700","Pratt & Whitney, GE","3,440 NM",126,"$89.1M","Boeing 737-700^Pratt & Whitney, GE^3,440 NM^126^$89.1M"]
["Boeing 737-800","Pratt & Whitney, GE, ROLLS-ROYCE","3,115 NM",162,"$106.1M","Boeing 737-800^Pratt & Whitney, GE, ROLLS-ROYCE^3,115 NM^162^$106.1M"]
["Boeing 737-900ER","Pratt & Whitney, GE","3,265 NM",178,"$112.6M","Boeing 737-900ER^Pratt & Whitney, GE^3,265 NM^178^$112.6M"]
["Boeing 747-400","Pratt & Whitney, GE, ROLLS-ROYCE","7,260 NM",410,null,"Boeing 747-400^Pratt & Whitney, GE, ROLLS-ROYCE^7,260 NM^410^"]
["Boeing 747-400F","Pratt & Whitney, GE, ROLLS-ROYCE","4,445 NM","N/A",null,"Boeing 747-400F^Pratt & Whitney, GE, ROLLS-ROYCE^4,445 NM^N/A^"]
["Boeing 747-8i","GE","7,730 NM",410,"$418.4M","Boeing 747-8i^GE^7,730 NM^410^$418.4M"]
["Boeing 757-200","ROLLS-ROYCE, Pratt & Whitney","4,100 NM",200,"TBC","Boeing 757-200^ROLLS-ROYCE, Pratt & Whitney^4,100 NM^200^TBC"]
["Boeing 757-300","ROLLS-ROYCE, Pratt & Whitney","3,595 NM",243,"TBC","Boeing 757-300^ROLLS-ROYCE, Pratt & Whitney^3,595 NM^243^TBC"]
["Boeing 767-300ER","Pratt & Whitney, GE, ROLLS-ROYCE","6,310 NM",269,"$217.9M","Boeing 767-300ER^Pratt & Whitney, GE, ROLLS-ROYCE^6,310 NM^269^$217.9M"]
["Boeing 767-400ER","Pratt & Whitney, GE","5,625 NM",304,"TBC","Boeing 767-400ER^Pratt & Whitney, GE^5,625 NM^304^TBC"]
["Boeing 777-200ER","Pratt & Whitney, GE, ROLLS-ROYCE","7,065 NM",313,"$306.6M","Boeing 777-200ER^Pratt & Whitney, GE, ROLLS-ROYCE^7,065 NM^313^$306.6M"]
["Boeing 777-200LR","GE","8,555 NM",317,"$346.9M","Boeing 777-200LR^GE^8,555 NM^317^$346.9M"]
["Boeing 777-300ER","GE","7,370 NM",396,"$375.5M","Boeing 777-300ER^GE^7,370 NM^396^$375.5M"]
["Boeing 777F","GE","4,970 NM","N/A","$352.3M","Boeing 777F^GE^4,970 NM^N/A^$352.3M"]
["Boeing 787-8","GE, ROLLS-ROYCE","7,355 NM",242,"$248.3M","Boeing 787-8^GE, ROLLS-ROYCE^7,355 NM^242^$248.3M"]
["Boeing 787-9","GE, ROLLS-ROYCE","7,635 NM",290,"$292.5M","Boeing 787-9^GE, ROLLS-ROYCE^7,635 NM^290^$292.5M"]
["Boeing 787-10","GE , ROLLS-ROYCE","6,430 NM",330,338.4,"Boeing 787-10^GE , ROLLS-ROYCE^6,430 NM^330^338.4"]
["Bombardier CRJ100ER/LR","GE","1,620 NM / 2,003 NM",50,"TBC","Bombardier CRJ100ER/LR^GE^1,620 NM / 2,003 NM^50^TBC"]
["Bombardier CRJ200ER/LR","GE","1,644 NM / 2,004 NM",50,"TBC","Bombardier CRJ200ER/LR^GE^1,644 NM / 2,004 NM^50^TBC"]
["Bombardier CRJ700ER","GE","1,378 NM",66,"TBC","Bombardier CRJ700ER^GE^1,378 NM^66^TBC"]
["Bombardier CRJ900ER/LR","GE","1,317 NM / 1,553 NM",79,"TBC","Bombardier CRJ900ER/LR^GE^1,317 NM / 1,553 NM^79^TBC"]
["Bombardier CRJ1000ER","GE","1,622 NM",50,"TBC","Bombardier CRJ1000ER^GE^1,622 NM^50^TBC"]
["Embraer 170LR","GE","2,100 NM",70,"$26.5M","Embraer 170LR^GE^2,100 NM^70^$26.5M"]
["Embraer 175","GE","2,150 NM",78,"$28M","Embraer 175^GE^2,150 NM^78^$28M"]
["Embraer 190","GE","2,400 NM",94,"$32M","Embraer 190^GE^2,400 NM^94^$32M"]
["Embraer 195","GE","2,000 NM",106,"$40M","Embraer 195^GE^2,000 NM^106^$40M"]
[]
["http://www.axonaviation.com/commercial-aircraft/aircraft-data/aircraft-pricing"]